{"text_format":"1","workbook":"xlsx","n_sheets":6,"sheets":["Titulní list","Zadání vstupních údajů","Výpis","Mezi výpočty","Parametry-vodiče,lana,KZL,SDOK","Data-námraza,vítr,součinitelé"],"not_rendered":{"charts":1,"images":0,"macros":1,"external_links":0,"defined_names":3,"comments":1,"pivot_tables":0},"unopened":[],"bounds":{"document_bytes":16777216,"sheet_cells":100000,"rows_first":2000,"rows_last":500,"rows_between":2000,"halvings":0,"cell_chars":16384,"cell_head_chars":4096},"cells_cut":0,"cells_raw":0,"read":"whole","date_system":"1900"}

{"sheet":"Titulní list","index":0,"n_rows":13,"n_cols":2,"rows_kept":13,"cut":false,"hidden":false,"merged":[[6,0,6,1],[0,0,2,1]]}
["Výpočet montážních tabulek s průhybem vedení"]
[]
[]
["Zpracoval:","Bc. Kamil Mádle"]
["Aktualizace:","2021-08-10"]
[]
["Manuál"]
["Karta:","Popis:"]
["Zadání vstupních údajů","Tato karta slouží k nastavení použitých lan, vstupních parametrů navrhovaného vedení a zvolení námrazových a větrných oblastí. V této kartě se nastavují pouze údaje v kolonkách a ovládacích prvcích, které jsou podbarvené zeleně. Na základě zadaných vstupních údajů dojde k výpočtům a následně k sestavení montážních tabulek a grafu v kartě výpis. Pro výpočet je nutné zvolit si typ lan nebo kabelů, dále je nutné si zvolit vstupní stavy jako je úroveň spolehlivosti, počáteční teplota, namáhání, námrazová oblast, větrná oblast a oblast terénu. Pro výpočet je nutné stanovit rozpětí PB, nadmořskou výšku umístění PB a výšku uchycení lan nebo kabelů na PB. "]
["Výpis","V této kartě jsou z provedených výpočtů sestaveny montážní tabulky pro vodiče a také pro zemnící lana, KZL nebo SDOK. Dále jsou v této kartě sepsány základní nastavené údaje a zvolené parametry lan z karty \"Zadání vstupních údajů\". V této kartě je dále zobrazen graf s vykreslenýma řetězovkama pro nastavené lana a důležité zatěžovací stavy."]
{"$rows_left_out":4}
{"sheet":"Zadání vstupních údajů","index":1,"n_rows":40,"n_cols":15,"rows_kept":40,"cut":false,"hidden":false,"merged":[[34,10,34,14],[1,10,3,10],[4,10,6,10],[28,10,28,14],[13,10,14,11],[24,10,25,11],[26,10,27,11],[27,1,28,1],[7,6,7,8],[15,10,15,14],[12,10,12,14],[4,2,4,4],[19,2,19,4],[10,6,10,8],[19,10,19,14],[23,10,23,14],[1,1,1,4],[16,1,16,4],[1,6,1,8],[12,1,13,1],[2,6,3,6]]}
[]
[null,"Vstupní údaje - Vodiče",null,null,null,null,"Vstupní stav - pro výpočty",null,null,null,"Levý PB     ","Nadmořská výška PB",null,445.2,"m"]
[null,null,24,null,null,null,"Úroveň spolehlivosti:",1,null," ",null,"Výška uchycení vodiče",null,10.5,"m"]
[null,null,null,null,null,null,null,null,null,null,null,"Výška uchycení lan, KZL nebo SDOK",null,8.5,"m"]
[null,"Typ lana:",{"$f":"INDEX('Parametry-vodiče,lana,KZL,SDOK'!$A$3:$H$40,$C$3,1)","v":"110-AL1/22-ST1A"},null,{"$f":"INDEX('Parametry-vodiče,lana,KZL,SDOK'!$A$4:$H$40,$C$3,2)","v":16.88},null,"Součinitel místních podmínek:",1,"KIc [-]",null,"Pravý PB   ","Nadmořská výška PB",null,436,"m"]
[null,"Průměr:",{"$f":"INDEX('Parametry-vodiče,lana,KZL,SDOK'!$A$3:$H$40,$C$3,2)","v":14.96},"d [mm]",null,null,"Součinitel výšky:",1,"Kh [-]",null,null,"Výška uchycení vodiče",null,10.5,"m"]
[null,"Průřez:",{"$f":"INDEX('Parametry-vodiče,lana,KZL,SDOK'!$A$3:$H$40,$C$3,3)","v":132.33000000000001},"S [mm2]",null,null,"Počáteční teplota:",-5,"t [°C]",null,null,"Výška uchycení lan, KZL nebo SDOK",null,8.5,"m"]
[null,"Hmotnost vodiče:",{"$f":"INDEX('Parametry-vodiče,lana,KZL,SDOK'!$A$3:$H$40,$C$3,4)","v":476.9},"m [kg.km-1]",null,null,"Vstupní stav - pro výpočty vodičů",null,null,null,"Převýšní vodiče",null,null,{"$f":"(N5+N6)-(N2+N3)","v":-9.1999999999999886},"m"]
[null,"Měrná tíha:",{"$f":"INDEX('Parametry-vodiče,lana,KZL,SDOK'!$A$3:$H$40,$C$3,8)","v":3.5341883057507739E-2},"γ [N.m-1.mm-2]",null,null,"Počáteční namáhání:",30,"σpoc[Mpa]",null,"Převýšení lana, KZL nebo SDOK",null,null,{"$f":"(N5+N7)-(N2+N4)","v":-9.1999999999999886},"m"]
[null,"Modul pružnosti:",{"$f":"INDEX('Parametry-vodiče,lana,KZL,SDOK'!$A$3:$H$40,$C$3,6)","v":77400},"E [Mpa]",null,null,"Horiz. tah:",{"$f":"(H9*C7)","v":3969.9000000000005},"F [N]",null,"Referenční výška - vodiče",null,null,{"$f":"IF(AND('Zadání vstupních údajů'!N6<=24,'Zadání vstupních údajů'!N3<=24),'Data-námraza,vítr,součinitelé'!$U$15,'Data-námraza,vítr,součinitelé'!$U$16)","v":10},"m"]
{"$rows_left_out":31}
{"sheet":"Výpis","index":2,"n_rows":26,"n_cols":18,"rows_kept":26,"cut":false,"hidden":false,"merged":[[20,0,20,13],[0,9,0,10],[0,2,0,8],[2,15,3,16],[2,17,3,17],[13,15,14,16],[13,17,14,17],[13,0,13,13]]}
[null,null,"Úsek vedení mezi podpěrnými body:",null,null,null,null,null,null,"196 a 195"]
[]
[null,null,"Nadmořská výška terénu u levého PB [m]:",null,null,null,null,null,null,null,{"$f":"'Zadání vstupních údajů'!N2","v":445.2},null,null,null,null,"Prametry vodiče:",null,{"$f":"'Zadání vstupních údajů'!C5","v":"110-AL1/22-ST1A"}]
[null,null,"Nadmořská výška terénu u pravého PB [m]:",null,null,null,null,null,null,null,{"$f":"'Zadání vstupních údajů'!N5","v":436}]
[null,null,"Rozpětí [m]:",null,null,null,null,null,null,null,{"$f":"Rozpeti","v":110},null,null,null,null,"E [Mpa]:",null,{"$f":"'Zadání vstupních údajů'!C10","v":77400}]
[null,null,"Výchozí vodorovná složka namáhání vodič [Mpa]:",null,null,null,null,null,null,null,{"$f":"'Zadání vstupních údajů'!$H$9","v":30},null,null,null,null,"α [K-1]:",null,{"$f":"'Zadání vstupních údajů'!C11","v":1.8300000000000001E-5}]
[null,null,"Výchozí vodorovná složka namáhání Lana, KZL nebo SDOK [Mpa]:",null,null,null,null,null,null,null,{"$f":"'Zadání vstupních údajů'!$H$12","v":20},null,null,null,null,"d [mm]:",null,{"$f":"'Zadání vstupních údajů'!C6","v":14.96}]
[null,null,"Výchozí teplota vodiče [°C]:",null,null,null,null,null,null,null,{"$f":"'Zadání vstupních údajů'!$H$7","v":-5},null,null,null,null,"S [mm2]:",null,{"$f":"'Zadání vstupních údajů'!C7","v":132.33000000000001}]
[null,null,"Námrazová oblast:",null,null,null,null,null,null,null,{"$f":"INDEX('Data-námraza,vítr,součinitelé'!$A$3:$C$11,'Zadání vstupních údajů'!$N$14,1)","v":"I2"},null,null,null,null,"γ [N.m-1.mm-2]:",null,{"$f":"'Zadání vstupních údajů'!C9","v":3.5341883057507739E-2}]
[null,null,"Větrná oblast:",null,null,null,null,null,null,null,{"$f":"INDEX('Data-námraza,vítr,součinitelé'!$H$5:$H$9,'Zadání vstupních údajů'!$N$25,1)","v":"III."},null,null,null,null,"m [kg.km-1]:",null,{"$f":"'Zadání vstupních údajů'!C8","v":476.9}]
{"$rows_left_out":17}
{"sheet":"Mezi výpočty","index":3,"n_rows":1003,"n_cols":32,"rows_kept":1003,"cut":false,"hidden":false,"merged":[[0,25,0,31],[0,18,0,24],[0,16,1,16],[0,15,1,15],[0,0,0,13],[1,28,1,29],[1,30,1,31],[21,0,21,13],[1,21,1,22],[1,19,1,20],[1,23,1,24],[1,26,1,27]]}
["Vodič",null,null,null,null,null,null,null,null,null,null,null,null,null,null,"Výpočtový bod","Vzdálenost","tg(h/a) (terén)","Vodič",null,null,null,null,null,null,"Lana, KZL nebo SDOK"]
[null,"zadaná/počáteční","min. tepl.","-20 °C","-10 °C","-5 °C","0 °C","+10 °C","+20 °C","+30 °C","+40 °C","+60 °C","-5 °C + I","-5 °C + W",null,null,null,{"$f":"ATAN(('Zadání vstupních údajů'!$N$5-'Zadání vstupních údajů'!$N$2)/Rozpeti)","v":-8.3442164771322005E-2},"tg(h/a)","min. teplota",null,"-5 °C + I",null,"+60 °C",null,"tg(h/a)","min. teplota",null,"-5 °C + I",null,"+60 °C"]
["t [°C]",{"$f":"'Zadání vstupních údajů'!$H$7","v":-5},{"$f":"INDEX('Data-námraza,vítr,součinitelé'!AG3:AK5,'Zadání vstupních údajů'!H3,5)","v":-30},-20,-10,-5,0,10,20,30,40,60,-5,-5,null,0,{"$f":"(Rozpeti/1000)*P3","v":0},{"$f":"$R$2*Q3","v":0},{"$f":"ATAN(prevyseni_vod/Rozpeti)","v":-8.3442164771322005E-2},{"$f":"($Q3*(Rozpeti-$Q3))/(2*$C$11)","v":0},{"$f":"'Zadání vstupních údajů'!$N$3","v":10.5},{"$f":"($Q3*(Rozpeti-$Q3))/(2*$M$11)","v":0},{"$f":"'Zadání vstupních údajů'!$N$3","v":10.5},{"$f":"($Q3*(Rozpeti-$Q3))/(2*$L$11)","v":0},{"$f":"'Zadání vstupních údajů'!$N$3","v":10.5},{"$f":"ATAN(prevyseni_ostatni/Rozpeti)","v":-8.3442164771322005E-2},{"$f":"($Q3*(Rozpeti-$Q3))/(2*$C$32)","v":0},{"$f":"'Zadání vstupních údajů'!$N$4","v":8.5},{"$f":"($Q3*(Rozpeti-$Q3))/(2*$M$32)","v":0},{"$f":"'Zadání vstupních údajů'!$N$4","v":8.5},{"$f":"($Q3*(Rozpeti-$Q3))/(2*$L$32)","v":0},{"$f":"'Zadání vstupních údajů'!$N$4","v":8.5}]
["I50 [N/m]",0,0,0,0,0,0,0,0,0,0,0,{"$f":"'Zadání vstupních údajů'!N17","v":14.125888},0,null,1,0.11,{"$f":"$R$2*Q4","v":-9.1786381248454198E-3},{"$f":"$S$3*Q4","v":-9.1786381248454198E-3},5.2494242921891227E-3,{"$f":"$U$3-T4+$S4","v":10.485571937582964},1.0107072978774431E-2,{"$f":"$W$3-V4+$S4","v":10.48071428889638},{"$f":"($Q4*(Rozpeti-$Q4))/(2*$L$11)","v":1.1250408736435126E-2},{"$f":"$Y$3-X4+$S4","v":10.479570953138719},{"$f":"$Z$3*Q4","v":-9.1786381248454198E-3},2.6170981286148033E-3,{"$f":"$AB$3-AA4+$Z4","v":8.4882042637465389},1.1190936595332981E-2,{"$f":"$AD$3-AC4+$Z4","v":8.4796304252798205},{"$f":"($Q4*(Rozpeti-$Q4))/(2*$L$32)","v":3.9401281111353034E-3},{"$f":"$AF$3-AE4+$Z4","v":8.4868812337640183}]
["qwc [N/m]",0,0,0,0,0,0,0,0,0,0,0,0,{"$f":"'Zadání vstupních údajů'!N33","v":10.340112772770709},null,2,0.22,-1.835727624969084E-2,{"$f":"$S$3*Q5","v":-1.835727624969084E-2},1.0488339226435927E-2,{"$f":"$U$3-T5+$S5","v":10.471154384523873},2.0193911577210975E-2,{"$f":"$W$3-V5+$S5","v":10.461448812173098},{"$f":"($Q5*(Rozpeti-$Q5))/(2*$L$11)","v":2.247829413205657E-2},{"$f":"$Y$3-X5+$S5","v":10.459164429618252},{"$f":"$Z$3*Q5","v":-1.835727624969084E-2},5.2289568215366849E-3,{"$f":"$AB$3-AA5+$Z5","v":8.476413766928772},2.235946891319783E-2,{"$f":"$AD$3-AC5+$Z5","v":8.4592832548371106},7.8723680779039708E-3,{"$f":"$AF$3-AE5+$Z5","v":8.4737703556724053}]
["D max [mm]",{"$f":"'Zadání vstupních údajů'!$C$6","v":14.96},{"$f":"'Zadání vstupních údajů'!$C$6","v":14.96},{"$f":"'Zadání vstupních údajů'!$C$6","v":14.96},{"$f":"'Zadání vstupních údajů'!$C$6","v":14.96},{"$f":"'Zadání vstupních údajů'!$C$6","v":14.96},{"$f":"'Zadání vstupních údajů'!$C$6","v":14.96},{"$f":"'Zadání vstupních údajů'!$C$6","v":14.96},{"$f":"'Zadání vstupních údajů'!$C$6","v":14.96},{"$f":"'Zadání vstupních údajů'!$C$6","v":14.96},{"$f":"'Zadání vstupních údajů'!$C$6","v":14.96},{"$f":"'Zadání vstupních údajů'!$C$6","v":14.96},{"$f":"'Zadání vstupních údajů'!$N$18","v":62.384703091754055},{"$f":"'Zadání vstupních údajů'!$C$6","v":14.96},null,3,0.33,-2.7535914374536265E-2,-2.7535914374536265E-2,1.571674480274041E-2,10.456747340822725,3.0260515795309636E-2,10.442203569830156,3.3683656186864336E-2,{"$f":"$Y$3-X6+$S6","v":10.4387804294386},-2.7535914374536265E-2,7.8355760787656437E-3,8.4646285095466993,3.3505596953594549E-2,8.4389584886718705,1.1796719900306001E-2,8.4606673657251577]
["z0 [-]",1,1,1,1,1,1,1,1,1,1,1,1,1,null,4,0.44,-3.6714552499381679E-2,-3.6714552499381679E-2,{"$f":"($Q7*(Rozpeti-$Q7))/(2*$C$11)","v":2.0934641021102571E-2},{"$f":"$U$3-T7+$S7","v":10.442350806479515},4.0306885633070402E-2,10.422978561867549,4.4866494900858402E-2,10.41841895259976,-3.6714552499381679E-2,1.0436955900301678E-2,8.4528484916003173,4.4629320716523126E-2,8.4186561267840965,1.5713183578341391E-2,8.447572263922277]
["z1 [-]",1,1,1,1,1,1,1,1,1,1,1,{"$f":"'Zadání vstupních údajů'!N19","v":4.0204229432397485},{"$f":"'Zadání vstupních údajů'!N34","v":2.4265743128640476},null,5,0.55000000000000004,-4.5893190624227108E-2,-4.5893190624227108E-2,2.6142027881522412E-2,{"$f":"$U$3-T8+$S8","v":10.42796478149425},5.0333021090493292E-2,10.40377378828528,5.6026810274038802E-2,10.398079999101734,-4.5893190624227108E-2,1.3033096286144793E-2,8.4410737130896276,5.5730640201983574E-2,8.3983761691737886,1.9621759112010147E-2,8.4344850502637634]
["F [kN]",{"$f":"(B10*'Zadání vstupních údajů'!$C$7)/1000","v":3.9699000000000004},{"$f":"(C10*'Zadání vstupních údajů'!$C$7)/1000","v":5.3846463379669194},{"$f":"(D10*'Zadání vstupních údajů'!$C$7)/1000","v":4.7087852396392824},{"$f":"(E10*'Zadání vstupních údajů'!$C$7)/1000","v":4.1860576607322697},{"$f":"(F10*'Zadání vstupních údajů'!$C$7)/1000","v":3.9699000000000004},{"$f":"(G10*'Zadání vstupních údajů'!$C$7)/1000","v":3.7782412389564519},{"$f":"(H10*'Zadání vstupních údajů'!$C$7)/1000","v":3.4547860503387455},{"$f":"(I10*'Zadání vstupních údajů'!$C$7)/1000","v":3.1933446480560304},{"$f":"(J10*'Zadání vstupních údajů'!$C$7)/1000","v":2.9780779573631291},{"$f":"(K10*'Zadání vstupních údajů'!$C$7)/1000","v":2.797797615680695},{"$f":"(L10*'Zadání vstupních údajů'!$C$7)/1000","v":2.5124681203651429},{"$f":"(M10*'Zadání vstupních údajů'!$C$7)/1000","v":11.243854111633302},{"$f":"(N10*'Zadání vstupních údajů'!$C$7)/1000","v":7.7828272326278691},null,6,0.66,-5.5071828749072529E-2,-5.5071828749072529E-2,3.1338905383999929E-2,10.413589265866927,6.0338922167578288E-2,10.38458924908335,6.7164602306405502E-2,10.377763568944522,-5.5071828749072529E-2,1.5623997236294982E-2,8.4293041740146322,6.6809555409975879E-2,8.3781186158409522,2.3522446501312261E-2,8.421405724749615]
["σvyp [Mpa]",{"$f":"'Zadání vstupních údajů'!$H$9","v":30},{"$f":"Reseni_namahani($B$10,$B$3,C3,C7,C8,'Zadání vstupních údajů'!$C$10,'Zadání vstupních údajů'!$C$9,'Zadání vstupních údajů'!$C$11,'Zadání vstupních údajů'!$N$12)","v":40.691047668457031},{"$f":"Reseni_namahani($B$10,$B$3,D3,D7,D8,'Zadání vstupních údajů'!$C$10,'Zadání vstupních údajů'!$C$9,'Zadání vstupních údajů'!$C$11,'Zadání vstupních údajů'!$N$12)","v":35.583656311035156},{"$f":"Reseni_namahani($B$10,$B$3,E3,E7,E8,'Zadání vstupních údajů'!$C$10,'Zadání vstupních údajů'!$C$9,'Zadání vstupních údajů'!$C$11,'Zadání vstupních údajů'!$N$12)","v":31.633474349975586},{"$f":"Reseni_namahani($B$10,$B$3,F3,F7,F8,'Zadání vstupních údajů'!$C$10,'Zadání vstupních údajů'!$C$9,'Zadání vstupních údajů'!$C$11,'Zadání vstupních údajů'!$N$12)","v":30},{"$f":"Reseni_namahani($B$10,$B$3,G3,G7,G8,'Zadání vstupních údajů'!$C$10,'Zadání vstupních údajů'!$C$9,'Zadání vstupních údajů'!$C$11,'Zadání vstupních údajů'!$N$12)","v":28.551660537719727},{"$f":"Reseni_namahani($B$10,$B$3,H3,H7,H8,'Zadání vstupních údajů'!$C$10,'Zadání vstupních údajů'!$C$9,'Zadání vstupních údajů'!$C$11,'Zadání vstupních údajů'!$N$12)","v":26.107353210449219},{"$f":"Reseni_namahani($B$10,$B$3,I3,I7,I8,'Zadání vstupních údajů'!$C$10,'Zadání vstupních údajů'!$C$9,'Zadání vstupních údajů'!$C$11,'Zadání vstupních údajů'!$N$12)","v":24.131675720214844},{"$f":"Reseni_namahani($B$10,$B$3,J3,J7,J8,'Zadání vstupních údajů'!$C$10,'Zadání vstupních údajů'!$C$9,'Zadání vstupních údajů'!$C$11,'Zadání vstupních údajů'!$N$12)","v":22.504934310913086},{"$f":"Reseni_namahani($B$10,$B$3,K3,K7,K8,'Zadání vstupních údajů'!$C$10,'Zadání vstupních údajů'!$C$9,'Zadání vstupních údajů'!$C$11,'Zadání vstupních údajů'!$N$12)","v":21.142580032348633},{"$f":"Reseni_namahani($B$10,$B$3,L3,L7,L8,'Zadání vstupních údajů'!$C$10,'Zadání vstupních údajů'!$C$9,'Zadání vstupních údajů'!$C$11,'Zadání vstupních údajů'!$N$12)","v":18.986383438110352},{"$f":"Reseni_namahani($B$10,$B$3,M3,M7,M8,'Zadání vstupních údajů'!$C$10,'Zadání vstupních údajů'!$C$9,'Zadání vstupních údajů'!$C$11,'Zadání vstupních údajů'!$N$12)","v":84.968292236328125},{"$f":"Reseni_namahani($B$10,$B$3,N3,N7,N8,'Zadání vstupních údajů'!$C$10,'Zadání vstupních údajů'!$C$9,'Zadání vstupních údajů'!$C$11,'Zadání vstupních údajů'!$N$12)","v":58.813777923583984},null,7,0.77,-6.4250466873917944E-2,-6.4250466873917944E-2,{"$f":"($Q10*(Rozpeti-$Q10))/(2*$C$11)","v":3.6525273528535129E-2},10.399224259597545,7.0324588864325396E-2,10.365424944261756,7.8279870997958523E-2,10.357469662128123,-6.4250466873917944E-2,1.8209658750752252E-2,8.4175398743753291,7.7866066340500056E-2,8.3578834667855819,2.7415245746247745E-2,8.4083342873798337]
{"$rows_left_out":994}
{"sheet":"Parametry-vodiče,lana,KZL,SDOK","index":4,"n_rows":40,"n_cols":17,"rows_kept":40,"cut":false,"hidden":false,"merged":[[0,0,0,7],[0,9,0,16]]}
["Fázové vodiče",null,null,null,null,null,null,null,null,"Zemníci lana, SDOK, KZL"]
["Typ lana","d           [mm]","S         [mm2]","m     [kg.km-1]","F            [N]","E           [Mpa]","α                  [K-1*10-5]","γ                [N.m-1.mm-2]",null,"Typ lana","d           [mm]","S         [mm2]","m     [kg.km-1]","F            [kN]","E           [Mpa]","α                  [K-1*10-5]","γ                [N.m-1.mm-2]"]
["-",0,0,0,0,0,0,0,null,"-",0,0,0,0,0,0,0]
["35 mm2 AlFe 3",9.41,47.29,195.2,18940,101989,1.76,{"$f":"((D4/1000)*9.80665)/C4","v":4.0479130471558468E-2},null,"35 mm2 Fe 540",7.5,34.36,268.70999999999998,18.899999999999999,180000,1.1000000000000001,{"$f":"((M4/1000)*9.80665)/L4","v":7.6692227051804424E-2}]
["35 mm2 AlFe 6",8.4,43.1,151.13,12360,88260,1.9750000000000001,3.4386984095127603E-2,null,"50 mm2 Fe 540",9,49.48,386.91,27,180000,1.1000000000000001,7.6683325616410683E-2]
["42/7 ZSNP",9,49.48,171.59,15087,80004,1.8173999999999999,3.4008146190379951E-2,null,"70 mm2 Fe 980",11.2,74.87,582.49,69.7,175000,1.1000000000000001,7.6295920375317211E-2]
["42-AL1/7ST1A",9,49.48,171.2,15270,79000,1.86,3.3930850444624086E-2,null,"95 mm2 Fe 980",12.5,93.27,766.37,85,192910,1.1000000000000001,8.0578131880561801E-2]
["50 mm2 AlFe 3",11.13,66.19,272.5,26070,101989,1.76,4.0373351337059979E-2,null,"SDOK 1 -STD7D135/48657N",13.5,146,140,25.6,12380,1,9.4036369863013704E-3]
["50 mm2 AlFe 4",11.2,74.400000000000006,282.60000000000002,25860,95712,1.85,3.7249452822580638E-2,null,"SDOK 2 -STD7D145/48657N",14.5,157,154,33.6,12380,0.5,9.6192617834394891E-3]
["50 mm2 AlFe 6",9.4499999999999993,54.55,191.27,15640,88260,1.9750000000000001,3.4385296892758939E-2,null,"SDOK 3 -STD7D155/48657N",15.5,178,175,41.6,17790,0.6,9.6413693820224713E-3]
{"$rows_left_out":31}
{"sheet":"Data-námraza,vítr,součinitelé","index":5,"n_rows":25,"n_cols":37,"rows_kept":25,"cut":false,"hidden":false,"merged":[[0,6,0,11],[17,6,17,11],[1,6,1,11],[1,12,1,17],[9,12,9,17],[9,6,9,11],[17,12,17,17],[0,12,0,17],[2,14,2,17],[4,12,8,12],[10,14,10,17],[12,12,16,12],[10,8,10,11],[6,19,6,21],[13,19,13,21],[20,12,24,12],[20,6,24,6],[18,8,18,11],[17,19,17,21],[18,14,18,17],[0,30,0,36],[1,30,4,30],[0,0,1,0],[0,1,0,4],[10,23,12,23],[4,23,6,23],[0,23,0,28],[7,23,7,28],[1,23,1,28],[2,25,2,28],[8,25,8,28],[4,6,8,6],[12,6,16,6],[1,1,1,2],[1,3,1,4],[2,8,2,11]]}
["Námrazové oblasti","Referenční zatížení námrazou IR50 [N/m]",null,null,null,null,"Do 24m výšky",null,null,null,null,null,"Od 24 do 40m výšky",null,null,null,null,null,null,"Kategorie terénu","z0 [-]","kr [-]",null,"Hodnoty součinitele rozpětí Gc",null,null,null,null,null,null,"Dílčí součinitelé zatížení a minimální teploty"]
[null,"d ≤ 30 mm",null,"d > 30 mm",null,null,"rychlost větru Vh [m/s]",null,null,null,null,null,"rychlost větru Vh [m/s]",null,null,null,null,null,null,"I.",0.01,{"$f":"0.189*(U2/0.05)^0.07","v":0.16886276796700878},null,"referenční výška 10m ",null,null,null,null,null,null,"úroveň spolehlivosti",null,"γW [-]","ΨW [-]","γI [-]","ΨI [-]","tmin [°C]"]
["Bez námrazy",0,0,0,0,null,null,null,"kategorie terénu",null,null,null,null,null,"kategorie terénu",null,null,null,null,"II.",0.05,{"$f":"0.189*(U3/0.05)^0.07","v":0.189},null,null,null,"kategorie terénu",null,null,null,null,null," Úroveň spolehlivosti 1",1,0.25,1,0.35,-30]
["I0",1.0640000000000001,0.128,3.9630000000000001,3.1399999999999997E-2,null,null,null,"I.","II.","III.","IV.",null,null,"I.","II.","III.","IV.",null,"III.",0.3,{"$f":"0.189*(U4/0.05)^0.07","v":0.21425570350255288},null,null,null,"I.","II.","III.","IV.",null,null," Úroveň spolehlivosti 2",1.2,0.25,1.25,0.35,-35]
["I1",3.1739999999999999,0.22120000000000001,8.5150000000000006,4.3200000000000002E-2,null,"Větrné oblasti","I.",{"$f":"J5*$U$8*$U$9*$V$2*LN($U$15/$U$2)","v":26.245410229071915},22.5,{"$f":"J5*$U$8*$U$9*$V$4*LN($U$15/$U$4)","v":16.90425065616132},{"$f":"J5*$U$8*$U$9*$V$5*LN($U$15/$U$5)","v":12.076250432752824},"Větrné oblasti","I.",{"$f":"J5*$U$8*$U$9*$V$2*LN($U$16/$U$2)","v":30.419491248780929},{"$f":"J5*$U$8*$U$9*$V$3*LN($U$16/$U$3)","v":27.202943358806664},{"$f":"J5*$U$8*$U$9*$V$4*LN($U$16/$U$4)","v":22.200389503826869},{"$f":"J5*$U$8*$U$9*$V$5*LN($U$16/$U$5)","v":17.838086191536718},null,"IV.",1,{"$f":"0.189*(U5/0.05)^0.07","v":0.233095507778947},null,"Lm [m]",100,0.75,0.7,0.62,0.54,null,null," Úroveň spolehlivosti 3",1.4,0.25,1.5,0.35,-40]
["I2",8.6609999999999996,0.36530000000000001,17.53,7.0000000000000007E-2,null,null,"II.",{"$f":"J6*$U$8*$U$9*$V$2*LN($U$15/$U$2)","v":29.16156692119101},25,{"$f":"J6*$U$8*$U$9*$V$4*LN($U$15/$U$4)","v":18.782500729068133},{"$f":"J6*$U$8*$U$9*$V$5*LN($U$15/$U$5)","v":13.418056036392025},null,"II.",{"$f":"J6*$U$8*$U$9*$V$2*LN($U$16/$U$2)","v":33.799434720867694},{"$f":"J6*$U$8*$U$9*$V$3*LN($U$16/$U$3)","v":30.22549262089629},{"$f":"J6*$U$8*$U$9*$V$4*LN($U$16/$U$4)","v":24.667099448696522},{"$f":"J6*$U$8*$U$9*$V$5*LN($U$16/$U$5)","v":19.820095768374127},null,null,null,null,null,null,200,0.69,0.63,0.55000000000000004,0.47]
["I3",15,0.48099999999999998,25.46,0.13200000000000001,null,null,"III.",{"$f":"J7*$U$8*$U$9*$V$2*LN($U$15/$U$2)","v":32.077723613310113},27.5,{"$f":"J7*$U$8*$U$9*$V$4*LN($U$15/$U$4)","v":20.660750801974945},{"$f":"J7*$U$8*$U$9*$V$5*LN($U$15/$U$5)","v":14.759861640031227},null,"III.",{"$f":"J7*$U$8*$U$9*$V$2*LN($U$16/$U$2)","v":37.179378192954466},{"$f":"J7*$U$8*$U$9*$V$3*LN($U$16/$U$3)","v":33.248041882985916},{"$f":"J7*$U$8*$U$9*$V$4*LN($U$16/$U$4)","v":27.133809393566175},{"$f":"J7*$U$8*$U$9*$V$5*LN($U$16/$U$5)","v":21.80210534521154},null,"Součinitelé",null,null,null,null,300,0.66,0.6,0.51,0.43]
["I5",29,0.66800000000000004,43.84,0.17399999999999999,null,null,"IV.",{"$f":"J8*$U$8*$U$9*$V$2*LN($U$15/$U$2)","v":34.993880305429215},30,{"$f":"J8*$U$8*$U$9*$V$4*LN($U$15/$U$4)","v":22.539000874881758},{"$f":"J8*$U$8*$U$9*$V$5*LN($U$15/$U$5)","v":16.10166724367043},null,"IV.",{"$f":"J8*$U$8*$U$9*$V$2*LN($U$16/$U$2)","v":40.559321665041232},{"$f":"J8*$U$8*$U$9*$V$3*LN($U$16/$U$3)","v":36.270591145075549},{"$f":"J8*$U$8*$U$9*$V$4*LN($U$16/$U$4)","v":29.600519338435827},{"$f":"J8*$U$8*$U$9*$V$5*LN($U$16/$U$5)","v":23.784114922048953},null,"Cdir",1,"[-]",null,"referenční výška 30m "]
["I8",51.7,0.89300000000000002,73.89,0.153,null,null,"V.",{"$f":"J9*$U$8*$U$9*$V$2*LN($U$15/$U$2)","v":41.992656366515057},36,{"$f":"J9*$U$8*$U$9*$V$4*LN($U$15/$U$4)","v":27.046801049858111},{"$f":"J9*$U$8*$U$9*$V$5*LN($U$15/$U$5)","v":19.322000692404515},null,"V.",{"$f":"J9*$U$8*$U$9*$V$2*LN($U$16/$U$2)","v":48.671185998049481},{"$f":"J9*$U$8*$U$9*$V$3*LN($U$16/$U$3)","v":43.524709374090662},{"$f":"J9*$U$8*$U$9*$V$4*LN($U$16/$U$4)","v":35.520623206122991},{"$f":"J9*$U$8*$U$9*$V$5*LN($U$16/$U$5)","v":28.540937906458744},null,"CO",1,"[-]",null,null,null,"kategorie terénu"]
["I12",83.66,1.135,107.8,0.33,null,"střední tlak větru qh [Pa]",null,null,null,null,null,"střední tlak větru qh [Pa]",null,null,null,null,null,null,"Cc",1,"[-]",null,null,null,"I.","II.","III.","IV."]
{"$rows_left_out":15}