{"text_format":"1","workbook":"xlsx","n_sheets":7,"sheets":["Úvodní list","Zadání","Tabulky specifikace betonu","Skrytý list se vzorci","Skrytý list se vzorci 2","Export formulář Dalux","Export KZP Dalux"],"not_rendered":{"charts":0,"images":2,"macros":1,"external_links":0,"defined_names":7,"comments":0,"pivot_tables":0},"unopened":[],"bounds":{"document_bytes":16777216,"sheet_cells":100000,"rows_first":2000,"rows_last":500,"rows_between":2000,"halvings":0,"cell_chars":16384,"cell_head_chars":4096},"cells_cut":0,"cells_raw":0,"read":"part_too_large","date_system":"1900"}

{"sheet":"Úvodní list","index":0,"n_rows":32,"n_cols":2,"rows_kept":32,"cut":false,"hidden":false,"merged":[[31,1,31,7],[3,1,3,7],[24,1,24,7],[5,1,5,7],[7,1,7,7],[22,1,22,7],[26,1,26,7],[29,1,29,7]]}
[]
[]
[]
[null,"ČESKÉ VYSOKÉ UČENÍ TECHNICKÉ"]
[]
[null,"FAKULTA STAVEBNÍ"]
{"$rows_left_out":27}
{"sheet":"Zadání","index":1,"n_rows":38,"n_cols":6,"rows_kept":38,"cut":false,"hidden":false,"merged":[[35,1,35,3],[23,0,23,1],[18,0,18,2],[17,0,17,5],[21,0,21,5],[31,1,31,3],[25,1,25,2],[25,3,25,4],[27,1,27,3],[8,0,8,2],[4,2,4,5],[5,2,6,5],[5,0,6,1],[4,0,4,1],[7,0,7,5],[9,0,9,5],[20,0,20,2],[19,0,19,5],[10,0,10,2],[15,0,15,5],[13,0,13,5],[12,0,12,2],[14,0,14,2],[16,0,16,2],[11,0,11,5]]}
["Číslo:",200617]
["Datum:","2020-09-28",null,"Adresář exportu:","C:\\Export Dalux"]
["Název:","DP_Červený"]
["Typ:","Vzorový objekt",null,"Vypracoval:","Bc. Milan Červený"]
["Základní údaje",null,"Rodinný dům MARLEN, Nad Hřištěm, k.ů. Horní Planá, p.č. 690/99"]
["Přesný popis objektu",null,"Rodinný dům je umístěn v nové zástavbě v kopci nad Lipnem. Parcela domu má obdelníkový tvar o rozměrech 19,4 x 45 m. Přízemí tvoří společenskou část domu, zatímco podkroví tvoří soukromou. Obytné místnosti jsou orientovány na jih, obslužné komunikace a příslušenství se nachází na severní straně domu. Po vstupu přes závětří a zádvěří se vchází do předsíně. Na severní stěně se nachází křivočaré schodiště, které pod sebou ukrývá WC. Z obytného prostoru je výstup na terasu, která výškově navazuje na zahradu."]
{"$rows_left_out":33}
{"sheet":"Tabulky specifikace betonu","index":2,"n_rows":31,"n_cols":4,"rows_kept":31,"cut":false,"hidden":false,"merged":[]}
["Stupeň vlivu prostředí","Stupeň","Popis prostředí","Min. doporučená tř. betonu"]
["Bez nebezpečí koroze nebo narušení","X0","Bez nebezpečí koroze nebo narušení","C 12/15"]
["Koroze vlivem karbonatace","XC1","suché nebo stále mokré","C 20/25"]
["Koroze vlivem karbonatace","XC2","mokré, občas suché","C 25/30"]
["Koroze vlivem karbonatace","XC3","středně mokré, vlhké","C 30/37"]
["Koroze vlivem karbonatace","XC4","střídavé mokré, suché","C 30/37"]
{"$rows_left_out":26}
{"sheet":"Skrytý list se vzorci","index":3,"n_rows":138,"n_cols":18,"rows_kept":138,"cut":false,"hidden":true,"merged":[[1,0,1,3],[14,0,15,0],[2,0,3,0],[4,0,5,0],[6,0,7,0],[8,0,9,0],[10,0,11,0],[12,0,13,0]]}
[]
["Zvolené možnosti",null,null,null,null,null,null,null,null,null,null,null,null,null,null,null,"datum",{"$f":"Zadání!B2","v":"2020-09-28"}]
["Hydroizolace spodní stavby:","Bílá Vana","Asfalt"]
[null,false,true,null,null,null,null,null,null,null,null,"M","N","O","P",null,"1. Geometrická přesnost"]
["Materiál nosných konstrukcí:","Beton","Zděné","Ocel",null,null,null,null,null,null,5,"Geometrická přesnost dle ČSN 74 4505","Rovinnost",null,"1. Geometrická přesnost",null,{"$f":"IF(Zadání!D26='Skrytý list se vzorci'!L6,'Skrytý list se vzorci'!O6,IF(Zadání!D26='Skrytý list se vzorci'!L7,'Skrytý list se vzorci'!O7,IF(Zadání!D26='Skrytý list se vzorci'!L8,'Skrytý list se vzorci'!O8)))","v":"a) Vzhled povrchu je bez puklin a výstupků, jednolitý povrch.\nb) Nutno zkontrolovat vodorovnost a rovinnost. Pro místní rovinnost platí přípustná mezní odchylka  ±2mm/2m. Měří se dvoumetrovou latí, která může mít na obou koncích gumové podložky. Jednotlivé klady latě se rozmístí po kontrolované ploše, lať musí být min. 100 mm od hran kontrolované plochy a především tam, kde předpokládáme největší odchylky. Pro vodorovné konstrukce se na každých 100 m2 kontrolované plochy se provede nejméně 5 měření, nejmenší počet kladů latě na ucelené ploše je 5. "}]
[null,true,false,false,null,null,null,null,null,null,6,"Místnosti pro pobyt osob","±2mm/2m",null,"a) Vzhled povrchu je bez puklin a výstupků, jednolitý povrch.\nb) Nutno zkontrolovat vodorovnost a rovinnost. Pro místní rovinnost platí přípustná mezní odchylka  ±2mm/2m. Měří se dvoumetrovou latí, která může mít na obou koncích gumové podložky. Jednotlivé klady latě se rozmístí po kontrolované ploše, lať musí být min. 100 mm od hran kontrolované plochy a především tam, kde předpokládáme největší odchylky. Pro vodorovné konstrukce se na každých 100 m2 kontrolované plochy se provede nejméně 5 měření, nejmenší počet kladů latě na ucelené ploše je 5. ",null,"ČSN 73 0205, ČSN EN 13914-2\na) Povrch omítek nesmí vykazovat puchýře, pecky ani trhliny (kromě vlasových trhlinek vzniklých smrštěním malty). Vrstva omítky musí být pevně spojena s omítaným povrchem.\nb) Místní rovinnost je Dle ČSN EN 13914-2, Tab.1: (Rovinnost omítky závisí na rovinnosti podkladu, pro podkladní beton rovinnosti ±9mm/2m je doporučena třída 3) ±5mm/2m pro rovinnost podkladu ±10mm/2m; (vyšší přesnost rovinnosti omítky lze požadovat pouze při vyšší přesnosti rovinnosti podkladu). \nMístní rovinnost dle ČSN 73 0205, Tab.A.4: "]
{"$rows_left_out":133}
{"sheet":"Skrytý list se vzorci 2","index":4,"n_rows":51,"n_cols":62,"rows_kept":51,"cut":false,"hidden":true,"merged":[]}
["Category","Text","Type","Required","Details","Help text","Unique ID","Parent",null,"Category","Text","Type","Required","Details","Help text","Unique ID","Parent",null,"Category","Text","Type","Required","Details","Help text","Unique ID","Parent",null,"Category","Text","Type","Required","Details","Help text","Unique ID","Parent",null,"Category","Text","Type","Required","Details","Help text","Unique ID","Parent",null,"Category","Text","Type","Required","Details","Help text","Unique ID","Parent",null,"Category","Text","Type","Required","Details","Help text","Unique ID","Parent"]
["Header","Hydroizolace - Asfaltové pásy","Heading","No"," "," "," "," ",null,"Header","Nosné konstrukce - Beton","Heading","No","  "," "," "," "," ","Header","Typ střechy - Plochá","Heading","No"," "," "," "," ",null,"Header","Typ výplňového zdiva - Zděnné","Heading","No"," "," "," "," ",null,"Header","Povrchová úprava - Omítka","Heading","No"," "," "," "," ",null,"Header","Podlaha - Betonová mazanina","Heading","No"," "," "," "," ",null,"Header","Fasáda - Provětrávaná","Heading","No"," "," "," "," "]
["Header","Dokumentace","Heading","No"," "," "," "," ",null,"Header","Dokumentace","Heading","No"," "," "," "," ",null,"Header","Dokumentace","Heading","No"," "," "," "," ",null,"Header","Dokumentace","Heading","No"," "," "," "," ",null,"Header","Dokumentace","Heading","No"," "," "," "," ",null,"Header","Dokumentace","Heading","No"," "," "," "," ",null,"Header","Dokumentace","Heading","No"," "," "," "," "]
["Header","Doklady před zahájením prací","List","Yes","Shoda;Neshoda","a) Odsouhlasena dle PP.\nb) Technologický postup schválen před zahájením prací.\nc) Převzetí materiálu - kompletnost a kvalita dle PD - zápis v dodacím listu.\nd) Certifikáty, atesty a prohlášení o shodě dle zákona č. 22/1997 Sb., Nařízení vlády č. 163/2002 Sb. Nebo Nařízení vlády č. 190/2002 Sb. \ne) ČSN 05 705 nebo ČSN EN 13067 - platné svářečské průkazy","1-Doklady před zahájením prací"," ",null,"Header","Doklady před zahájením prací","List","Yes","Shoda;Neshoda","a) Odsouhlasena objednatelem; platnost označena na výkresech.\nb) Aktualizovaný TP )datum, podpis) je předán před zahájením prací.\nc) Převzetí materiálu - kompletnost a kvalita dle PD - zápis v dodacím listu.\nd) Certifikáty, atesty a prohlášení o shodě dle zákona č. 22/1997 Sb., Nařízení vlády č. 163/2002 Sb. Nebo Nařízení vlády č. 190/2002 Sb. ","1-Doklady před zahájením prací"," ",null,"Header","Doklady před zahájením prací","List","Yes","Shoda;Neshoda","a) PD odsouhlasena objednatelem; platnost označena na výkresech.\nb) Technologický postup dle zákona č. 309/2006 Sb.,NV č. 591/2006 Sb.. Aktualizovaný TP (datum, podpis) je předán před zahájením prací.\nc) Převzetí materiálů - kompletnost a kvalita dle PD – zápis přímo na dodacím listu.\nd) Doložení kvality materiálu dle příslušných certifikátů, atestů a Prohlášení o shodě dle Zákona č. 163/2002 Sb.","1-Doklady před zahájením prací"," ",null,"Header","Doklady před zahájením prací","List","Yes","Shoda;Neshoda","a) Odsouhlasena objednatelem; platnost označena na výkresech.\nb) Aktualizovaný TP (datum, podpis) je předán před zahájením prací.\nc) Převzetí materiálů - kompletnost a kvalita dle PD – zápis přímo na dodacím listu.\nd) Certifikáty, atesty a Prohlášení o shodě dle NV č.163/2002 Sb a Zák. č.22/1997/Sb.","1-Doklady před zahájením prací"," ",null,"Header","Doklady před zahájením prací","List","Yes","Shoda;Neshoda","a) Odsouhlasena objednatelem; platnost označena na výkresech.\nb) Aktualizovaný TP (datum, podpis) je předán před zahájením prací.\nc) Převzetí materiálů - kompletnost a kvalita dle PD – zápis přímo na dodacím listu.\nd) Certifikáty, atesty a Prohlášení o shodě dle NV č.163/2002 Sb a Zák. č.22/1997/Sb.","1-Doklady před zahájením prací"," ",null,"Header","Doklady před zahájením prací","List","Yes","Shoda;Neshoda","a) Odsouhlasena objednatelem; platnost označena na výkresech.\nb) Aktualizovaný TP (datum, podpis) je předán před zahájením prací.\nc) Převzetí materiálů - kompletnost a kvalita dle PD – zápis přímo na dodacím listu.\nd) Certifikáty, atesty a Prohlášení o shodě dle NV č.163/2002 Sb a Zák. č.22/1997/Sb.","1-Doklady před zahájením prací"," ",null,"Header","Doklady před zahájením prací","List","Yes","Shoda;Neshoda","a) Odsouhlasena objednatelem; platnost označena na výkresech.\nb) Aktualizovaný TP (datum, podpis) je předán předzahájením prací.\nc) Převzetí materiálů - kompletnost a kvalita dle PD – zápis přímo na dodacím listu.\nd) Certifikáty, atesty a Prohlášení o shodě dle NV č.163/2002 Sb a Zák. č.22/1997/Sb.","1-Doklady před zahájením prací"," "]
["Header","Přípravná fáze","Heading","No"," "," "," "," ",null,"Header","Přípravná fáze","Heading","No"," "," "," ","  ",null,"Header","Přípravná fáze","Heading","No"," "," "," "," ",null,"Header","Přípravná fáze","Heading","No"," "," "," "," ",null,"Header","Přípravná fáze","Heading","No"," "," "," "," ",null,"Header","Přípravná fáze","Heading","No"," "," "," "," ",null,"Header","Přípravná fáze","Heading","No"," "," "," "," "]
["Header","Povětrnostní podmínky, příprava a kontrola izolačních pásů","List","Yes","Ano;Ne","a) Teplota +5°C až 30°C; doporučená relativní vlhkost 60%.\nB) Izolační pásy rozložit před aplikací, aby se vyrovnaly do požadovaného tvaru a aby při jejich instalaci nedocházelo k tvarové deformaci.","1-Povětrnostní podmínky, příprava a kontrola izolačních pásů"," ",null,"Header","Podkladní vrstvy","List","Yes","Ano;Ne","a) Vytyčení dle PD a ČSN 730420.\nb) Vodorovnost montážní roviny max. ± 10mm.","1-Podkladní vrstvy"," ",null,"Header","Podklad","List","Yes","Ano;Ne","a) Rovinnost podkladu max. přípustná odchylka 5mm/2m; Spády - tolerance max. 25% od předepsaného spádu v PD.\nb) Povrch podkladu bez výstupků a zlomů, vyčnívající zrna jsou akceptovatelná do tl. 3 mm, na povrchu nesmí být volné částice, stát voda, sníh, ropné prostředky nebo jiné chemikálie.\nc) Povětrnostní podmínky :Min. teplota + 5o C (max. 35°C), při nižší teplotě zvláštní opatření (temperace folií a pracoviště). Při dešti, sněžení a silném větru práce neprovádět.","1-Podklad"," ",null,"Header","Vstupní materiál a klimatické podmínky","List","Yes","Ano;Ne","a) Soulad s PD a ČSN EN 771-1 – průměrná odchylka rozměrů u všech zkoušených prvků: větší z ±0,4x(jmenovitý rozměr)^1/2mm nebo 3 mm pro třídu T1, větší z ±0,25x(jmenovitý rozměr)^1/2mm nebo 2mm pro třídu T2; max.odchylka rozměrů jednotlivých prvků: ±0,6x(jmenovitý rozměr)^1/2mm pro R1, ±0,3x(jmenovitý rozměr)^1/2mm pro R2.\nb) Cihly jsou celistvé, neporušené, deklarovaná pevnost v tlaku výrobcem dle prohlášení o shodě apod.\nc) Teplota 0°C až +5°C, použití malty s o jeden stupeň vyšší pevností; teplota -5°C až 0°C, použití malty s o jeden stupeň vyšší pevností a přidání příměsí pro zlepšení vlastností malty nebo spočívající v ohřevu malt a jejich komponentů; teplota pod -5°C, zdění zakázáno; přísady malt (voda, písek, předem vyrobené směsi) obsahující částice ledu se nemají používat; teplota malt nesmí klesnout před pokládkou na zdivo pod + 15°C při teplotě zdiva na které se pokládá nižší než 10°C.\nd) Je nutné zabránit provlhnutí cihel, Pro zdění se nesmí použít zmrzlé cihly, tj.cihly, na kterých ulpívá sníh či led.","1-Vstupní materiál a klimatické podmínky"," ",null,"Header","Klimatické podmínky","List","Yes","Ano;Ne","a) Teplota vzduchu a podkladu: min. 5°C.","1-Kvalita podkladu a klimatické podmínky"," ",null,"Header","Podklad a klimatické podmínky","List","Yes","Ano;Ne","a) Podklad - Povrch bez zbytků materiálů, včetně skvrn od ropných látek, nezaprášený; okna a zárubně jsou osazeny; provedeny omítky s dokončeným povrchem.\nb) Svislé konstrukce separovány materiálem Mirelon tl. 5mm + plošná separační folie dle TP.\nc) Rozvody instalací jsou kompletní, ukotveny.\nd) Teplota prostředí a povrchu podkladu minimálně +5°C.","1-Podklad a klimatické podmínky"," ",null,"Header","Podklad a klimatické podmínky","List","Yes","Ano;Ne","a) Před prováděním fasádního systému dokončeny všechny zakryté konstrukce dle PD.\nb) Podklad mechanicky pevný a soudržný bez prachu a mastnoty, prost všech výstupků a výdutí.\nc) Teplota vzduchu min. +5˚C max. +35˚C. Relativní vlhkost max 75%.","1-Podklad a klimatické podmínky"," "]
{"$rows_left_out":46}
{"sheet":"Export formulář Dalux","index":5,"n_rows":0,"n_cols":0,"rows_kept":0,"cut":false,"hidden":false,"merged":[],"read":"part_too_large"}

{"sheet":"Export KZP Dalux","index":6,"n_rows":154,"n_cols":12,"rows_kept":154,"cut":false,"hidden":false,"merged":[]}
[]
[{"$f":"IF('Skrytý list se vzorci'!$C$4=TRUE,'Skrytý list se vzorci'!A21,0)","v":"01_Hydroizolace spodní stavby\n"}]
[null,{"$f":"IF('Skrytý list se vzorci'!$C$4=TRUE,'Skrytý list se vzorci'!A22,0)","v":"Asfaltové pásy"}]
[null,null,{"$f":"IF('Skrytý list se vzorci'!$C$4=TRUE,'Skrytý list se vzorci'!B21,0)","v":1},{"$f":"IF('Skrytý list se vzorci'!$C$4=TRUE,'Skrytý list se vzorci'!C21,0)","v":"Doklady před zahájením prací"},{"$f":"IF('Skrytý list se vzorci'!$C$4=TRUE,'Skrytý list se vzorci'!E21,0)","v":"Vizuální kontrola\nKaždá dodávka\nKaždý doklad"},{"$f":"IF('Skrytý list se vzorci'!$C$4=TRUE,'Skrytý list se vzorci'!D21,0)","v":"a) Projektová dokumentace \nb) Technologický postup \nc) Kontrola vstupních materiálů \nd) Doložení kvality materiálů \ne) Odborná způsobilost pracovníků"},null,{"$f":"IF('Skrytý list se vzorci'!$C$4=TRUE,'Skrytý list se vzorci'!F21,0)","v":"a) Odsouhlasena dle PP \nb) Technologický postup schválen před zahájením prací \nc) Převzetí materiálu - kompletnost a kvalita dle PD - zápis v dodacím listu \nd) Certifikáty, atesty a prohlášení o shodě dle zákona č. 22/1997 Sb., Nařízení vlády č. 163/2002 Sb. Nebo Nařízení vlády č. 190/2002 Sb. \ne) ČSN 05 705 nebo ČSN EN 13067 - platné svářečské průkazy"},{"$f":"IF('Skrytý list se vzorci'!$C$4=TRUE,'Skrytý list se vzorci'!G21,0)","v":"Záznam o kontrole kvality, SD"}]
[null,null,{"$f":"IF('Skrytý list se vzorci'!$C$4=TRUE,'Skrytý list se vzorci'!B22,0)","v":2},{"$f":"IF('Skrytý list se vzorci'!$C$4=TRUE,'Skrytý list se vzorci'!C22,0)","v":"Příprava pro provádění prací"},{"$f":"IF('Skrytý list se vzorci'!$C$4=TRUE,'Skrytý list se vzorci'!E22,0)","v":"Přeměření 10ti míst 2m latí\nVizuální kontrola\nVšechny pasy"},{"$f":"IF('Skrytý list se vzorci'!$C$4=TRUE,'Skrytý list se vzorci'!D22,0)","v":"a) Kontrola rovinnosti a spádů\nb) Kvalita podkladů\nc) Povětrnostní podmínky\nd) Příprava a kontrola izolačních pasů\n\n"},null,{"$f":"IF('Skrytý list se vzorci'!$C$4=TRUE,'Skrytý list se vzorci'!F22,0)","v":"a) Rovinnosti 5mm/2m; spády - tolerance max. 25% od předepsaného spádu v PD \nb) Dostatečná tvarová pevnost a stálost, bez volných částí. Nerovnosti - poměr vzdálenosti k výšce sousední nerovnosti 1/20, max. 20 mm na 100 mm základny. Zaoblení hran rmin=200 mm  \nc) Teplota +5°C až 30°C; doporučená relativní vlhkost 60% \nd) Izolační pásy rozložit před aplikací, aby se vyrovnaly do požadovaného tvaru a aby při jejich instalaci nedocházelo k tvarové deformaci"},{"$f":"IF('Skrytý list se vzorci'!$C$4=TRUE,'Skrytý list se vzorci'!G22,0)","v":"Záznam o kontrole kvality, SD"},null,null," "]
[null,null,{"$f":"IF('Skrytý list se vzorci'!$C$4=TRUE,'Skrytý list se vzorci'!B23,0)","v":3},{"$f":"IF('Skrytý list se vzorci'!$C$4=TRUE,'Skrytý list se vzorci'!C23,0)","v":"Prostupy konstrukcemi"},{"$f":"IF('Skrytý list se vzorci'!$C$4=TRUE,'Skrytý list se vzorci'!E23,0)","v":"Přeměření"},{"$f":"IF('Skrytý list se vzorci'!$C$4=TRUE,'Skrytý list se vzorci'!D23,0)","v":"a) Poloha prostupů\nb) Světlý rozměr"},null,{"$f":"IF('Skrytý list se vzorci'!$C$4=TRUE,'Skrytý list se vzorci'!F23,0)","v":"a) ±25 mm\nb) Pravoúhlý otvor ±25 mm, kulatý otvor ±10 mm od průměru"},{"$f":"IF('Skrytý list se vzorci'!$C$4=TRUE,'Skrytý list se vzorci'!G23,0)","v":"Záznam o kontrole kvality"}]
{"$rows_left_out":148}