**
**
**
** file created by  A N S A  Sun May 24 22:15:08 2020
**
** output from :
**
** E:/BP/vypocty/podrobny_treni/sroub_M16x80_static_MitCalc.inp
**
**
*HEADING
**
**
**
INPUT_FILE: 'E:/vypocty/podrobny_treni/sroub_M16x80_podr_treni_v3.inp'
**
**
**
INPUT_FILE: 'E:/BP/vypocty/podrobny_treni/sroub_M16x80_podr_treni_v6.inp'
**
**
**
INPUT_FILE: 'E:/BP/vypocty/podrobny_treni/sroub_M16x80_static_MitCalc.inp'
**
**
**
*NODE
**
** SOLID ELEMENTS
**
*ELEMENT, TYPE=C3D8, ELSET=P1;deska_2_n
*ELEMENT, TYPE=C3D6, ELSET=P1;deska_2_n
*ELEMENT, TYPE=C3D4, ELSET=P7;sroub
*ELEMENT, TYPE=C3D4, ELSET=P9;matice
*ELEMENT, TYPE=C3D8, ELSET=P10;deska_1_n
*ELEMENT, TYPE=C3D6, ELSET=P10;deska_1_n
**
**
**
** PRE-TENSION SECTIONS
**
**
**S1;prepeti
**
*PRE-TENSION SECTION, NODE=319, SURFACE=S1;prepeti
**
** SURFACE INTERACTIONS
**
**
**I1;bez_treni
**
*SURFACE INTERACTION, NAME=I1;bez_treni
**
**I2;treni_pod_hlavou
**
*SURFACE INTERACTION, NAME=I2;treni_pod_hlavou
*FRICTION
                    0.14,
**
**I3;treni_zavit
**
*SURFACE INTERACTION, NAME=I3;treni_zavit
*FRICTION
                    0.16,
**
** SECTION DATA
**
*SOLID SECTION, ELSET=P1;deska_2_n, MATERIAL=M4;desky_S355J0
*SOLID SECTION, ELSET=P7;sroub, MATERIAL=M3;matice_srouby
*SOLID SECTION, ELSET=P9;matice, MATERIAL=M3;matice_srouby
*SOLID SECTION, ELSET=P10;deska_1_n, MATERIAL=M4;desky_S355J0
**
** MATERIALS
**
**
**M3;matice_srouby
**
*MATERIAL, NAME=M3;matice_srouby
*DENSITY
                 7.85E-9,
*ELASTIC, TYPE=ISOTROPIC
                 211000.,                      0.3
**
**M4;desky_S355J0
**
*MATERIAL, NAME=M4;desky_S355J0
*DENSITY
                 7.85E-9,
*ELASTIC, TYPE=ISOTROPIC
                 207000.,                      0.3
**
**
**
** CONTACT and TIE DEFINITIONS
**
**
**PAIR: S2;DESKA_1_DESKA-DESKA and S3;DESKA_2_DESKA-DESKA
**
*CONTACT PAIR, INTERACTION=I1;bez_treni, EXTENSION ZONE=0.1, SMOOTH=0.2
S2;deska_1_deska-deska, S3;deska_2_deska-deska
**
**PAIR: S5;SROUB_DESKA-SROUB and S4;DESKA_1_DESKA-SROUB
**
*CONTACT PAIR, INTERACTION=I2;treni_pod_hlavou, EXTENSION ZONE=0.1, SMOOTH=0.2
S5;sroub_deska-sroub, S4;deska_1_deska-sroub
**
**PAIR: S7;MATICE_DESKA-MATICE and S6;DESKA_2_DESKA-MATICE
**
*CONTACT PAIR, INTERACTION=I2;treni_pod_hlavou, EXTENSION ZONE=0.1, SMOOTH=0.2
S7;matice_deska-matice, S6;deska_2_deska-matice
**
**PAIR: S8;MATICE_SROUB-MATICE and S9;SROUB_MATICE-SROUB
**
*CONTACT PAIR, INTERACTION=I3;treni_zavit, EXTENSION ZONE=0.1, SMOOTH=0.2
S8;matice_sroub-matice, S9;sroub_matice-sroub
**
** SURFACE DEFINITIONS
**
*SURFACE, NAME=S1;prepeti, TYPE=ELEMENT
   59861, S1
   59873, S1
   63123, S1
   63125, S1
   63727, S1
   64344, S1
   64376, S1
   64377, S1
   64378, S1
   64379, S1
   64380, S1
   64398, S1
   64399, S1
   64405, S1
   64919, S1
   64920, S1
   64924, S1
   64933, S1
   64955, S1
   64972, S1
** ... 90 like lines cut
*SURFACE, NAME=S2;deska_1_deska-deska, TYPE=ELEMENT
    9960, S2
    9961, S2
    9962, S2
    9964, S2
    9966, S2
    9967, S2
    9968, S2
    9969, S2
    9970, S2
    9971, S2
    9972, S2
    9973, S2
    9974, S2
    9976, S2
    9977, S2
    9978, S2
    9980, S2
    9981, S2
    9982, S2
    9983, S2
** ... 478 like lines cut
*SURFACE, NAME=S3;deska_2_deska-deska, TYPE=ELEMENT
   14471, S1
   14490, S1
   14538, S1
   14612, S1
   14635, S1
   14644, S1
   14784, S1
   14789, S1
   14790, S1
   14791, S1
   14793, S1
   14794, S1
   14795, S1
   14796, S1
   14797, S1
   14798, S1
   14800, S1
   14801, S1
   14805, S1
   14807, S1
** ... 478 like lines cut
*SURFACE, NAME=S4;deska_1_deska-sroub, TYPE=ELEMENT
     810, S1
     815, S1
     830, S1
     839, S1
     884, S1
     889, S1
     895, S1
     914, S1
     942, S1
     944, S1
     972, S1
     973, S1
     977, S1
     979, S1
     999, S1
    1032, S1
    1034, S1
    1035, S1
    1160, S1
    1201, S1
** ... 64 like lines cut
*SURFACE, NAME=S5;sroub_deska-sroub, TYPE=ELEMENT
   17519, S1
   17521, S1
   17525, S1
   17526, S1
   17536, S1
   17537, S1
   17547, S1
   17552, S1
   17554, S1
   17565, S1
   17567, S1
   17574, S1
   17576, S1
   17577, S1
   17578, S1
   17586, S1
   17587, S1
   17594, S1
   17596, S1
   17597, S1
** ... 345 like lines cut
*SURFACE, NAME=S6;deska_2_deska-matice, TYPE=ELEMENT
     235, S2
     236, S2
     241, S2
     246, S2
     257, S2
     259, S2
     260, S2
     266, S2
     271, S2
     272, S2
     283, S2
     284, S2
     287, S2
     288, S2
     293, S2
     298, S2
     299, S2
     300, S2
     311, S2
     313, S2
** ... 64 like lines cut
*SURFACE, NAME=S7;matice_deska-matice, TYPE=ELEMENT
   34652, S1
   35283, S1
   36040, S1
   36253, S1
   36446, S1
   36451, S1
   37157, S1
   37158, S1
   37160, S1
   37161, S1
   37761, S1
   37770, S1
   37775, S1
   37781, S1
   37782, S1
   37783, S1
   37787, S1
   37856, S1
   37858, S1
   37890, S1
** ... 341 like lines cut
*SURFACE, NAME=S8;matice_sroub-matice, TYPE=ELEMENT
    4480, S1
   33464, S1
   33475, S1
   33477, S1
   33494, S1
   33496, S1
   33503, S1
   33507, S1
   33530, S1
   33532, S1
   33541, S1
   33546, S1
   33583, S1
   33585, S1
   33602, S1
   33618, S1
   33643, S1
   33644, S1
   33659, S1
   33688, S1
** ... 4218 like lines cut
*SURFACE, NAME=S9;sroub_matice-sroub, TYPE=ELEMENT
    3565, S1
    9076, S1
    9094, S1
    9145, S1
    9379, S1
    9381, S1
    9454, S1
    9526, S1
    9549, S1
    9559, S1
    9664, S1
    9681, S1
    9684, S1
    9784, S1
    9785, S1
    9810, S1
    9834, S1
    9868, S1
    9934, S1
    9998, S1
** ... 4826 like lines cut
**
** SETS
**
*NSET, NSET=bound
*NSET, NSET=load_sroub
*NSET, NSET=load_sroub_2
*NSET, NSET=bound_predpeti
*NSET, NSET=uzly_predpeti
*NSET, NSET=sila_sroub_hlava
*NSET, NSET=sila_sroub_matice
**
** BOUNDARY
**
*BOUNDARY, FIXED
bound,        1,        6
**
** STEPS
**
**
** STEP 1
**
*STEP, NAME=predpeti
*STATIC
**
** CLOAD
**
*CLOAD
     319,        1,                   64072.
**
** BOUNDARY
**
*BOUNDARY, FIXED
bound_predpeti,        2,        3
*OUTPUT, FIELD, VARIABLE=PRESELECT
*NODE PRINT, NSET=uzly_predpeti
TF,
*END STEP
**
** STEP 2
**
*STEP, NAME=sila
*STATIC
**
** CLOAD
**
*CLOAD
sila_sroub_hlava,        1,                   357.14
sila_sroub_matice,        1,                  -357.14
**
** BOUNDARY
**
*BOUNDARY, FIXED
     319,        1
*OUTPUT, FIELD, VARIABLE=PRESELECT
*NODE PRINT, NSET=uzly_predpeti
TF,
*END STEP