{"text_format":"1","workbook":"xlsx","n_sheets":11,"sheets":["Úvod","Vzdálenosti","Výchozí stav","Simulace bez podmínek","Simulace s podmínkami","Výstup ze simulace","Hladina 80 %","Hladina 60 %","Hladina 40 %","Podklady pro výpočet nákladů","Vypočtení nákladů"],"not_rendered":{"charts":9,"images":2,"macros":1,"external_links":0,"defined_names":334,"comments":0,"pivot_tables":0},"unopened":[],"bounds":{"document_bytes":16777216,"sheet_cells":100000,"rows_first":2000,"rows_last":500,"rows_between":2000,"halvings":0,"cell_chars":16384,"cell_head_chars":4096},"cells_cut":0,"cells_raw":0,"read":"whole","date_system":"1900"}

{"sheet":"Úvod","index":0,"n_rows":22,"n_cols":7,"rows_kept":22,"cut":false,"hidden":false,"merged":[]}
[]
[null,null,null,null,null,null,"Úvod"]
[]
[null,null,null,null,null,null,"Vzdálenosti"]
[]
[null,null,null,null,null,null,"Výchozí stav"]
[]
[null,null,null,null,null,null,"Simulace bez podmínek"]
[]
[null,null,null,null,null,null,"Simulace s podmínkami"]
[]
[null,null,null,null,null,null,"Výstup ze simulace"]
[]
[null,null,null,null,null,null,"Hladina 80 %"]
[]
[null,null,null,null,null,null,"Hladina 60 %"]
[]
[null,null,null,null,null,null,"Hladina 40 %"]
[]
[null,null,null,null,null,null,"Podklady pro výpočet nákladů"]
[]
[null,null,null,null,null,null,"Vypočtení nákladů"]

{"sheet":"Vzdálenosti","index":1,"n_rows":22,"n_cols":27,"rows_kept":22,"cut":false,"hidden":false,"merged":[]}
[]
[null,null,null,null,null,null,null,null,"Jednotlivé vzdálenosti"]
[null,null,null,null,null,null,null,null,null,1,2,3,4,5,6,7,8,9,10,11,12,13,14,15,16,17,18]
[null,null,null,null,null,null,null,null,"Vzdálenost [km]","Trhové sviny","Březí","Nežetice","Todně","Něchov","Ločenice","Nesměň","Besednice","Keblany","Lniště","Mohuřice","Slavče","Dobrkovská Lhotka","Dolní Lhotka","Záluží","Chvalkov","Čížkrajice","Boršíkov"]
[null,null,null,null,null,null,null,1,"Trhové Sviny",0,3,4,6,5,9,12,10,6,3,4,6,8,8,7,6,4,3]
[null,null,null,null,null,null,null,2,"Březí",3,0,1,4,4,7,11,13,9,2,7,9,11,11,10,9,7,6]
[null,null,null,null,null,null,null,3,"Nežetice",4,1,0,2,4,6,10,12,10,4,9,11,12,13,11,10,9,8]
[null,null,null,null,null,null,null,4,"Todně",6,4,2,0,1,4,7,9,12,5,10,12,14,15,13,12,11,9]
[null,null,null,null,null,null,null,5,"Něchov",5,4,4,1,0,3,7,9,11,4,9,11,13,13,12,11,10,8]
[null,null,null,null,null,null,null,6,"Ločenice",9,7,6,4,3,0,3,5,10,8,11,12,9,9,10,14,13,12]
[null,null,null,null,null,null,null,7,"Nesměň",12,11,10,7,7,3,0,3,8,11,9,10,7,6,8,12,13,15]
[null,null,null,null,null,null,null,8,"Besednice",10,13,12,9,9,5,3,0,5,8,6,7,4,3,5,9,10,12]
[null,null,null,null,null,null,null,9,"Keblany",6,9,10,12,11,10,8,5,0,4,2,3,4,5,3,4,5,7]
[null,null,null,null,null,null,null,10,"Lniště",3,2,4,5,4,8,11,8,4,0,2,4,6,7,5,6,7,5]
[null,null,null,null,null,null,null,11,"Mohuřice",4,7,9,10,9,11,9,6,2,2,0,2,4,4,3,4,5,6]
[null,null,null,null,null,null,null,12,"Slavče",6,9,11,12,11,12,10,7,3,4,2,0,2,2,1,2,3,4]
[null,null,null,null,null,null,null,13,"Dobrkovská Lhotka",8,11,12,14,13,9,7,4,4,6,4,2,0,1,2,3,4,6]
[null,null,null,null,null,null,null,14,"Dolní Lhotka",8,11,13,15,13,9,6,3,5,7,4,2,1,0,1,4,5,6]
[null,null,null,null,null,null,null,15,"Záluží",7,10,11,13,12,10,8,5,3,5,3,1,2,1,0,2,3,5]
[null,null,null,null,null,null,null,16,"Chvalkov",6,9,10,12,11,14,12,9,4,6,4,2,3,4,2,0,1,2]
[null,null,null,null,null,null,null,17,"Čížkrajice",4,7,9,11,10,13,13,10,5,7,5,3,4,5,3,1,0,1]
[null,null,null,null,null,null,null,18,"Boršíkov",3,6,8,9,8,12,15,12,7,5,6,4,6,6,5,2,1,0]

{"sheet":"Výchozí stav","index":2,"n_rows":22,"n_cols":15,"rows_kept":22,"cut":false,"hidden":false,"merged":[]}
[null,null,null,null,null,null,null,null,null,null,null,"Název","Přiřazené číslo","Vzdálenost [km]","Zastávka č."]
[null,null,null,null,null,null,null,null,null,null,null,{"$f":"VLOOKUP(M2,Vzdálenosti!$H$5:$I$22,2,FALSE)","v":"Trhové Sviny"},1,{"$f":"INDEX(Vzdálenosti!$J$5:$AA$22,'Výchozí stav'!M2,'Výchozí stav'!M3)","v":12},1]
[null,null,null,null,null,null,null,null,null,null,null,{"$f":"VLOOKUP(M3,Vzdálenosti!$H$5:$I$22,2,FALSE)","v":"Nesměň"},7,{"$f":"INDEX(Vzdálenosti!$J$5:$AA$22,'Výchozí stav'!M3,'Výchozí stav'!M4)","v":3},2]
[null,null,null,null,null,null,null,null,null,null,null,{"$f":"VLOOKUP(M4,Vzdálenosti!$H$5:$I$22,2,FALSE)","v":"Ločenice"},6,{"$f":"INDEX(Vzdálenosti!$J$5:$AA$22,'Výchozí stav'!M4,'Výchozí stav'!M5)","v":4},3]
[null,null,null,null,null,null,null,null,null,null,null,{"$f":"VLOOKUP(M5,Vzdálenosti!$H$5:$I$22,2,FALSE)","v":"Todně"},4,{"$f":"INDEX(Vzdálenosti!$J$5:$AA$22,'Výchozí stav'!M5,'Výchozí stav'!M6)","v":2},4]
[null,null,null,null,null,null,null,null,null,null,null,{"$f":"VLOOKUP(M6,Vzdálenosti!$H$5:$I$22,2,FALSE)","v":"Nežetice"},3,{"$f":"INDEX(Vzdálenosti!$J$5:$AA$22,'Výchozí stav'!M6,'Výchozí stav'!M7)","v":1},5]
[null,null,null,null,null,null,null,null,null,null,null,{"$f":"VLOOKUP(M7,Vzdálenosti!$H$5:$I$22,2,FALSE)","v":"Březí"},2,{"$f":"INDEX(Vzdálenosti!$J$5:$AA$22,'Výchozí stav'!M7,'Výchozí stav'!M8)","v":4},6]
[null,null,null,null,null,null,null,null,null,null,null,{"$f":"VLOOKUP(M8,Vzdálenosti!$H$5:$I$22,2,FALSE)","v":"Něchov"},5,{"$f":"INDEX(Vzdálenosti!$J$5:$AA$22,'Výchozí stav'!M8,'Výchozí stav'!M9)","v":9},7]
[null,null,null,null,null,null,null,null,null,null,null,{"$f":"VLOOKUP(M9,Vzdálenosti!$H$5:$I$22,2,FALSE)","v":"Besednice"},8,{"$f":"INDEX(Vzdálenosti!$J$5:$AA$22,'Výchozí stav'!M9,'Výchozí stav'!M10)","v":5},8]
[null,null,null,null,null,null,null,null,null,null,null,{"$f":"VLOOKUP(M10,Vzdálenosti!$H$5:$I$22,2,FALSE)","v":"Keblany"},9,{"$f":"INDEX(Vzdálenosti!$J$5:$AA$22,'Výchozí stav'!M10,'Výchozí stav'!M11)","v":2},9]
[null,null,null,null,null,null,null,null,null,null,null,{"$f":"VLOOKUP(M11,Vzdálenosti!$H$5:$I$22,2,FALSE)","v":"Mohuřice"},11,{"$f":"INDEX(Vzdálenosti!$J$5:$AA$22,'Výchozí stav'!M11,'Výchozí stav'!M12)","v":4},10]
[null,null,null,null,null,null,null,null,null,null,null,{"$f":"VLOOKUP(M12,Vzdálenosti!$H$5:$I$22,2,FALSE)","v":"Dobrkovská Lhotka"},13,{"$f":"INDEX(Vzdálenosti!$J$5:$AA$22,'Výchozí stav'!M12,'Výchozí stav'!M13)","v":1},11]
[null,null,null,null,null,null,null,null,null,null,null,{"$f":"VLOOKUP(M13,Vzdálenosti!$H$5:$I$22,2,FALSE)","v":"Dolní Lhotka"},14,{"$f":"INDEX(Vzdálenosti!$J$5:$AA$22,'Výchozí stav'!M13,'Výchozí stav'!M14)","v":1},12]
[null,null,null,null,null,null,null,null,null,null,null,{"$f":"VLOOKUP(M14,Vzdálenosti!$H$5:$I$22,2,FALSE)","v":"Záluží"},15,{"$f":"INDEX(Vzdálenosti!$J$5:$AA$22,'Výchozí stav'!M14,'Výchozí stav'!M15)","v":1},13]
[null,null,null,null,null,null,null,null,null,null,null,{"$f":"VLOOKUP(M15,Vzdálenosti!$H$5:$I$22,2,FALSE)","v":"Slavče"},12,{"$f":"INDEX(Vzdálenosti!$J$5:$AA$22,'Výchozí stav'!M15,'Výchozí stav'!M16)","v":4},14]
[null,null,null,null,null,null,null,null,null,null,null,{"$f":"VLOOKUP(M16,Vzdálenosti!$H$5:$I$22,2,FALSE)","v":"Lniště"},10,{"$f":"INDEX(Vzdálenosti!$J$5:$AA$22,'Výchozí stav'!M16,'Výchozí stav'!M17)","v":6},15]
[null,null,null,null,null,null,null,null,null,null,null,{"$f":"VLOOKUP(M17,Vzdálenosti!$H$5:$I$22,2,FALSE)","v":"Chvalkov"},16,{"$f":"INDEX(Vzdálenosti!$J$5:$AA$22,'Výchozí stav'!M17,'Výchozí stav'!M18)","v":1},16]
[null,null,null,null,null,null,null,null,null,null,null,{"$f":"VLOOKUP(M18,Vzdálenosti!$H$5:$I$22,2,FALSE)","v":"Čížkrajice"},17,{"$f":"INDEX(Vzdálenosti!$J$5:$AA$22,'Výchozí stav'!M18,'Výchozí stav'!M19)","v":1},17]
[null,null,null,null,null,null,null,null,null,null,null,{"$f":"VLOOKUP(M19,Vzdálenosti!$H$5:$I$22,2,FALSE)","v":"Boršíkov"},18,{"$f":"INDEX(Vzdálenosti!$J$5:$AA$22,'Výchozí stav'!M19,'Výchozí stav'!M20)","v":3},18]
[null,null,null,null,null,null,null,null,null,null,null,{"$f":"VLOOKUP(M20,Vzdálenosti!$H$5:$I$22,2,FALSE)","v":"Trhové Sviny"},1]
[]
[null,null,null,null,null,null,null,null,null,null,null,"Celková trasa [km]",{"$f":"SUM(N2:N19)","v":64}]

{"sheet":"Simulace bez podmínek","index":3,"n_rows":24,"n_cols":9,"rows_kept":24,"cut":false,"hidden":false,"merged":[[2,7,2,8],[3,7,3,8]]}
[null,"Simulace bez podmínek"]
[]
[null,null,"Název","Přiřazené číslo","Vzdálenost [km]","Zastávka",null,"Základní podmínka začátek a konec"]
[null,null,{"$f":"VLOOKUP(D4,Vzdálenosti!$H$5:$I$22,2,FALSE)","v":"Trhové Sviny"},1,{"$f":"INDEX(Vzdálenosti!$J$5:$AA$22,'Simulace bez podmínek'!D4,'Simulace bez podmínek'!D5)","v":3},1,null,"Trhové. Sviny"]
[null,null,{"$f":"VLOOKUP(D5,Vzdálenosti!$H$5:$I$22,2,FALSE)","v":"Březí"},2,{"$f":"INDEX(Vzdálenosti!$J$5:$AA$22,'Simulace bez podmínek'!D5,'Simulace bez podmínek'!D6)","v":1},3,null,1,{"$f":"IF(H5=D4,1,0)","v":1}]
[null,null,{"$f":"VLOOKUP(D6,Vzdálenosti!$H$5:$I$22,2,FALSE)","v":"Nežetice"},3,{"$f":"INDEX(Vzdálenosti!$J$5:$AA$22,'Simulace bez podmínek'!D6,'Simulace bez podmínek'!D7)","v":2},2]
[null,null,{"$f":"VLOOKUP(D7,Vzdálenosti!$H$5:$I$22,2,FALSE)","v":"Todně"},4,{"$f":"INDEX(Vzdálenosti!$J$5:$AA$22,'Simulace bez podmínek'!D7,'Simulace bez podmínek'!D8)","v":1},1]
[null,null,{"$f":"VLOOKUP(D8,Vzdálenosti!$H$5:$I$22,2,FALSE)","v":"Něchov"},5,{"$f":"INDEX(Vzdálenosti!$J$5:$AA$22,'Simulace bez podmínek'!D8,'Simulace bez podmínek'!D9)","v":3},3]
[null,null,{"$f":"VLOOKUP(D9,Vzdálenosti!$H$5:$I$22,2,FALSE)","v":"Ločenice"},6,{"$f":"INDEX(Vzdálenosti!$J$5:$AA$22,'Simulace bez podmínek'!D9,'Simulace bez podmínek'!D10)","v":3},3]
[null,null,{"$f":"VLOOKUP(D10,Vzdálenosti!$H$5:$I$22,2,FALSE)","v":"Nesměň"},7,{"$f":"INDEX(Vzdálenosti!$J$5:$AA$22,'Simulace bez podmínek'!D10,'Simulace bez podmínek'!D11)","v":3},8]
[null,null,{"$f":"VLOOKUP(D11,Vzdálenosti!$H$5:$I$22,2,FALSE)","v":"Besednice"},8,{"$f":"INDEX(Vzdálenosti!$J$5:$AA$22,'Simulace bez podmínek'!D11,'Simulace bez podmínek'!D12)","v":4},6]
[null,null,{"$f":"VLOOKUP(D12,Vzdálenosti!$H$5:$I$22,2,FALSE)","v":"Dobrkovská Lhotka"},13,{"$f":"INDEX(Vzdálenosti!$J$5:$AA$22,'Simulace bez podmínek'!D12,'Simulace bez podmínek'!D13)","v":1},9]
[null,null,{"$f":"VLOOKUP(D13,Vzdálenosti!$H$5:$I$22,2,FALSE)","v":"Dolní Lhotka"},14,{"$f":"INDEX(Vzdálenosti!$J$5:$AA$22,'Simulace bez podmínek'!D13,'Simulace bez podmínek'!D14)","v":1},10]
[null,null,{"$f":"VLOOKUP(D14,Vzdálenosti!$H$5:$I$22,2,FALSE)","v":"Záluží"},15,{"$f":"INDEX(Vzdálenosti!$J$5:$AA$22,'Simulace bez podmínek'!D14,'Simulace bez podmínek'!D15)","v":1},11]
[null,null,{"$f":"VLOOKUP(D15,Vzdálenosti!$H$5:$I$22,2,FALSE)","v":"Slavče"},12,{"$f":"INDEX(Vzdálenosti!$J$5:$AA$22,'Simulace bez podmínek'!D15,'Simulace bez podmínek'!D16)","v":2},12]
[null,null,{"$f":"VLOOKUP(D16,Vzdálenosti!$H$5:$I$22,2,FALSE)","v":"Mohuřice"},11,{"$f":"INDEX(Vzdálenosti!$J$5:$AA$22,'Simulace bez podmínek'!D16,'Simulace bez podmínek'!D17)","v":2},13]
[null,null,{"$f":"VLOOKUP(D17,Vzdálenosti!$H$5:$I$22,2,FALSE)","v":"Lniště"},10,{"$f":"INDEX(Vzdálenosti!$J$5:$AA$22,'Simulace bez podmínek'!D17,'Simulace bez podmínek'!D18)","v":4},14]
[null,null,{"$f":"VLOOKUP(D18,Vzdálenosti!$H$5:$I$22,2,FALSE)","v":"Keblany"},9,{"$f":"INDEX(Vzdálenosti!$J$5:$AA$22,'Simulace bez podmínek'!D18,'Simulace bez podmínek'!D19)","v":4},15]
[null,null,{"$f":"VLOOKUP(D19,Vzdálenosti!$H$5:$I$22,2,FALSE)","v":"Chvalkov"},16,{"$f":"INDEX(Vzdálenosti!$J$5:$AA$22,'Simulace bez podmínek'!D19,'Simulace bez podmínek'!D20)","v":1},16]
[null,null,{"$f":"VLOOKUP(D20,Vzdálenosti!$H$5:$I$22,2,FALSE)","v":"Čížkrajice"},17,{"$f":"INDEX(Vzdálenosti!$J$5:$AA$22,'Simulace bez podmínek'!D20,'Simulace bez podmínek'!D21)","v":1},17]
[null,null,{"$f":"VLOOKUP(D21,Vzdálenosti!$H$5:$I$22,2,FALSE)","v":"Boršíkov"},18,{"$f":"INDEX(Vzdálenosti!$J$5:$AA$22,'Simulace bez podmínek'!D21,'Simulace bez podmínek'!D22)","v":3},18]
[null,null,{"$f":"VLOOKUP(D22,Vzdálenosti!$H$5:$I$22,2,FALSE)","v":"Trhové Sviny"},1]
[]
[null,null,"Celková trasa [km]",{"$f":"SUM(E4:E21)","v":40}]

{"sheet":"Simulace s podmínkami","index":4,"n_rows":514,"n_cols":15,"rows_kept":514,"cut":false,"hidden":false,"merged":[[2,8,2,9],[3,8,3,9]]}
[null,"Simulace s podmínkami"]
[]
[null,null,"Název","Přiřazené číslo","Vzdálenost","Zastávka",null,null,"Základní podmínka začátek a konec"]
[null,null,{"$f":"IFERROR(VLOOKUP(D4,Vzdálenosti!$H$5:$I$22,2,FALSE),\"\")","v":"Trhové Sviny"},{"$f":"VLOOKUP(F4,$N$6:$O$23,2,0)","v":1},{"$f":"INDEX(Vzdálenosti!$J$5:$AA$22,'Simulace s podmínkami'!D4,'Simulace s podmínkami'!D5)","v":4},1,null,null,"Trhové. Sviny"]
[null,null,{"$f":"IFERROR(VLOOKUP(D5,Vzdálenosti!$H$5:$I$22,2,FALSE),\"\")","v":"Nežetice"},3,{"$f":"INDEX(Vzdálenosti!$J$5:$AA$22,'Simulace s podmínkami'!D5,'Simulace s podmínkami'!D6)","v":2},2,null,null,1,{"$f":"IF(I5=D4,1,0)","v":1}]
[null,null,{"$f":"IFERROR(VLOOKUP(D6,Vzdálenosti!$H$5:$I$22,2,FALSE),\"\")","v":"Todně"},4,{"$f":"INDEX(Vzdálenosti!$J$5:$AA$22,'Simulace s podmínkami'!D6,'Simulace s podmínkami'!D7)","v":1},3,null,null,null,null,null,null,null,1,1]
[null,null,{"$f":"IFERROR(VLOOKUP(D7,Vzdálenosti!$H$5:$I$22,2,FALSE),\"\")","v":"Něchov"},5,{"$f":"INDEX(Vzdálenosti!$J$5:$AA$22,'Simulace s podmínkami'!D7,'Simulace s podmínkami'!D8)","v":4},4,null,"č.","Název","Stav zaplněnosti","Vyvézt",null,null,2,3]
[null,null,{"$f":"IFERROR(VLOOKUP(D8,Vzdálenosti!$H$5:$I$22,2,FALSE),\"\")","v":"Lniště"},10,{"$f":"INDEX(Vzdálenosti!$J$5:$AA$22,'Simulace s podmínkami'!D8,'Simulace s podmínkami'!D9)","v":4},7,null,2,"Březí",20,{"$f":"IF(J8>=40,\"ANO\",\"NE\")","v":"NE"},null,null,3,4]
[null,null,{"$f":"IFERROR(VLOOKUP(D9,Vzdálenosti!$H$5:$I$22,2,FALSE),\"\")","v":"Slavče"},12,{"$f":"INDEX(Vzdálenosti!$J$5:$AA$22,'Simulace s podmínkami'!D9,'Simulace s podmínkami'!D10)","v":2},9,null,3,"Nežetice",60,{"$f":"IF(J9>=40,\"ANO\",\"NE\")","v":"ANO"},null,null,4,5]
[null,null,{"$f":"IFERROR(VLOOKUP(D10,Vzdálenosti!$H$5:$I$22,2,FALSE),\"\")","v":"Chvalkov"},16,{"$f":"INDEX(Vzdálenosti!$J$5:$AA$22,'Simulace s podmínkami'!D10,'Simulace s podmínkami'!D11)","v":2},13,null,4,"Todně",80,"ANO",null,null,5,8]
[null,null,{"$f":"IFERROR(VLOOKUP(D11,Vzdálenosti!$H$5:$I$22,2,FALSE),\"\")","v":"Záluží"},15,{"$f":"INDEX(Vzdálenosti!$J$5:$AA$22,'Simulace s podmínkami'!D11,'Simulace s podmínkami'!D12)","v":2},12,null,5,"Něchov",60,"ANO",null,null,6,9]
[null,null,{"$f":"IFERROR(VLOOKUP(D12,Vzdálenosti!$H$5:$I$22,2,FALSE),\"\")","v":"Dobrkovská Lhotka"},13,{"$f":"INDEX(Vzdálenosti!$J$5:$AA$22,'Simulace s podmínkami'!D12,'Simulace s podmínkami'!D13)","v":1},10,null,6,"Ločenice",10,"NE",null,null,7,10]
[null,null,{"$f":"IFERROR(VLOOKUP(D13,Vzdálenosti!$H$5:$I$22,2,FALSE),\"\")","v":"Dolní Lhotka"},14,{"$f":"INDEX(Vzdálenosti!$J$5:$AA$22,'Simulace s podmínkami'!D13,'Simulace s podmínkami'!D14)","v":3},11,null,7,"Nesměň",0,"NE",null,null,8,11]
[null,null,{"$f":"IFERROR(VLOOKUP(D14,Vzdálenosti!$H$5:$I$22,2,FALSE),\"\")","v":"Besednice"},8,{"$f":"INDEX(Vzdálenosti!$J$5:$AA$22,'Simulace s podmínkami'!D14,'Simulace s podmínkami'!D15)","v":5},5,null,8,"Besednice",70,"ANO",null,null,9,12]
[null,null,{"$f":"IFERROR(VLOOKUP(D15,Vzdálenosti!$H$5:$I$22,2,FALSE),\"\")","v":"Keblany"},9,{"$f":"INDEX(Vzdálenosti!$J$5:$AA$22,'Simulace s podmínkami'!D15,'Simulace s podmínkami'!D16)","v":2},6,null,9,"Keblany",40,"ANO",null,null,10,13]
[null,null,{"$f":"IFERROR(VLOOKUP(D16,Vzdálenosti!$H$5:$I$22,2,FALSE),\"\")","v":"Mohuřice"},11,{"$f":"INDEX(Vzdálenosti!$J$5:$AA$22,'Simulace s podmínkami'!D16,'Simulace s podmínkami'!D17)","v":4},8,null,10,"Lniště",40,"ANO",null,null,11,14]
[null,null,{"$f":"IFERROR(VLOOKUP(D17,Vzdálenosti!$H$5:$I$22,2,FALSE),\"\")","v":"Trhové Sviny"},1,{"$f":"INDEX(Vzdálenosti!$J$5:$AA$22,'Simulace s podmínkami'!D17,'Simulace s podmínkami'!D18)","v":0},14,null,11,"Mohuřice",50,"ANO",null,null,12,15]
[null,null,{"$f":"IFERROR(VLOOKUP(D18,Vzdálenosti!$H$5:$I$22,2,FALSE),\"\")","v":""},0,{"$f":"INDEX(Vzdálenosti!$J$5:$AA$22,'Simulace s podmínkami'!D18,'Simulace s podmínkami'!D19)","v":0},15,null,12,"Slavče",90,"ANO",null,null,13,16]
[null,null,{"$f":"IFERROR(VLOOKUP(D19,Vzdálenosti!$H$5:$I$22,2,FALSE),\"\")","v":""},0,{"$f":"INDEX(Vzdálenosti!$J$5:$AA$22,'Simulace s podmínkami'!D19,'Simulace s podmínkami'!D20)","v":0},16,null,13,"Dobrkovská Lhotka",50,"ANO",null,null,14,1]
[null,null,{"$f":"IFERROR(VLOOKUP(D20,Vzdálenosti!$H$5:$I$22,2,FALSE),\"\")","v":""},{"$f":"VLOOKUP(F20,$N$6:$O$23,2,0)","v":0},{"$f":"INDEX(Vzdálenosti!$J$5:$AA$22,'Simulace s podmínkami'!D20,'Simulace s podmínkami'!D21)","v":0},17,null,14,"Dolní Lhotka",60,"ANO",null,null,15]
[null,null,{"$f":"IFERROR(VLOOKUP(D21,Vzdálenosti!$H$5:$I$22,2,FALSE),\"\")","v":""},{"$f":"VLOOKUP(F21,$N$6:$O$23,2,0)","v":0},{"$f":"INDEX(Vzdálenosti!$J$5:$AA$22,'Simulace s podmínkami'!D21,'Simulace s podmínkami'!D22)","v":0},18,null,15,"Záluží",50,"ANO",null,null,16]
[null,null,{"$f":"IFERROR(VLOOKUP(D22,Vzdálenosti!$H$5:$I$22,2,FALSE),\"\")","v":""},null,null,null,null,16,"Chvalkov",60,"ANO",null,null,17]
[null,null,null,null,null,null,null,17,"Čížkrajice",0,"NE",null,null,18]
[null,null,"Celková trasa",{"$f":"SUM(E4:E21)","v":36},null,null,null,18,"Boršíkov",30,"NE",null,null,19]
[]
[]
[]
[]
[]
[]
[]
[]
[]
[]
[]
[]
[]
[]
[]
[]
[]
[]
[]
[]
[]
[]
[]
[]
[]
[]
[]
[]
[]
[]
[]
[]
[]
[]
[]
[]
[]
[]
[]
[]
[]
[]
[]
[]
[]
[]
[]
[]
[]
[]
[]
[]
[]
[]
[]
[]
[]
[]
[]
[]
[]
[]
[]
[]
[]
[]
[]
[]
[]
[]
[]
[]
[]
[]
[]
[]
[]
[]
[]
[]
[]
[]
[]
[]
[]
[]
[]
[]
[]
[]
[]
[]
[]
[]
[]
[]
[]
[]
[]
[]
[]
[]
[]
[]
[]
[]
[]
[]
[]
[]
[]
[]
[]
[]
[]
[]
[]
[]
[]
[]
[]
[]
[]
[]
[]
[]
[]
[]
[]
[]
[]
[]
[]
[]
[]
[]
[]
[]
[]
[]
[]
[]
[]
[]
[]
[]
[]
[]
[]
[]
[]
[]
[]
[]
[]
[]
[]
[]
[]
[]
[]
[]
[]
[]
[]
[]
[]
[]
[]
[]
[]
[]
[]
[]
[]
[]
[]
[]
[]
[]
[]
[]
[]
[]
[]
[]
[]
[]
[]
[]
[]
[]
[]
[]
[]
[]
[]
[]
[]
[]
[]
[]
[]
[]
[]
[]
[]
[]
[]
[]
[]
[]
[]
[]
[]
[]
[]
[]
[]
[]
[]
[]
[]
[]
[]
[]
[]
[]
[]
[]
[]
[]
[]
[]
[]
[]
[]
[]
[]
[]
[]
[]
[]
[]
[]
[]
[]
[]
[]
[]
[]
[]
[]
[]
[]
[]
[]
[]
[]
[]
[]
[]
[]
[]
[]
[]
[]
[]
[]
[]
[]
[]
[]
[]
[]
[]
[]
[]
[]
[]
[]
[]
[]
[]
[]
[]
[]
[]
[]
[]
[]
[]
[]
[]
[]
[]
[]
[]
[]
[]
[]
[]
[]
[]
[]
[]
[]
[]
[]
[]
[]
[]
[]
[]
[]
[]
[]
[]
[]
[]
[]
[]
[]
[]
[]
[]
[]
[]
[]
[]
[]
[]
[]
[]
[]
[]
[]
[]
[]
[]
[]
[]
[]
[]
[]
[]
[]
[]
[]
[]
[]
[]
[]
[]
[]
[]
[]
[]
[]
[]
[]
[]
[]
[]
[]
[]
[]
[]
[]
[]
[]
[]
[]
[]
[]
[]
[]
[]
[]
[]
[]
[]
[]
[]
[]
[]
[]
[]
[]
[]
[]
[]
[]
[]
[]
[]
[]
[]
[]
[]
[]
[]
[]
[]
[]
[]
[]
[]
[]
[]
[]
[]
[]
[]
[]
[]
[]
[]
[]
[]
[]
[]
[]
[]
[]
[]
[]
[]
[]
[]
[]
[]
[]
[]
[]
[]
[]
[]
[]
[]
[]
[]
[]
[]
[]
[]
[]
[]
[]
[]
[]
[]
[]
[]
[]
[]
[]
[]
[]
[]
[]
[]
[]
[]
[]
[]
[]
[]
[]
[]
[]
[]
[]
[]
[]
[]
[]
[]
[]
[]
[]
[]
[]
[]
[]
[null,null,null,10]
[null,null,null,11]
[null,null,null,14]
[null,null,null,16]
[null,null,null,17]

{"sheet":"Výstup ze simulace","index":5,"n_rows":23,"n_cols":2,"rows_kept":23,"cut":false,"hidden":false,"merged":[]}
["Výstup ze simulace"]
[]
[null,"Název"]
[null,"Trhové Sviny"]
[null,"Nesměň"]
[null,"Ločenice"]
[null,"Todně"]
[null,"Nežetice"]
[null,"Březí"]
[null,"Něchov"]
[null,"Besednice"]
[null,"Keblany"]
[null,"Mohuřice"]
[null,"Dobrkovská Lhotka"]
[null,"Dolní Lhotka"]
[null,"Záluží"]
[null,"Slavče"]
[null,"Lniště"]
[null,"Chvalkov"]
[null,"Čížkrajice"]
[null,"Boršíkov"]
[]
[null,"Vzdálenost [km]"]

{"sheet":"Hladina 80 %","index":6,"n_rows":29,"n_cols":1002,"rows_kept":29,"cut":false,"hidden":false,"merged":[]}
["Výstup ze simulace"]
[]
[null,"Název",1,2,3,4,5,6,7,8,9,10,11,12,13,14,15,16,17,18,19,20,21,22,23,24,25,26,27,28,29,30,31,32,33,34,35,36,37,38,39,40,41,42,43,44,45,46,47,48,49,50,51,52,53,54,55,56,57,58,59,60,61,62,63,64,65,66,67,68,69,70,71,72,73,74,75,76,77,78,79,80,81,82,83,84,85,86,87,88,89,90,91,92,93,94,95,96,97,98,99,100,101,102,103,104,105,106,107,108,109,110,111,112,113,114,115,116,117,118,119,120,121,122,123,124,125,126,127,128,129,130,131,132,133,134,135,136,137,138,139,140,141,142,143,144,145,146,147,148,149,150,151,152,153,154,155,156,157,158,159,160,161,162,163,164,165,166,167,168,169,170,171,172,173,174,175,176,177,178,179,180,181,182,183,184,185,186,187,188,189,190,191,192,193,194,195,196,197,198,199,200,201,202,203,204,205,206,207,208,209,210,211,212,213,214,215,216,217,218,219,220,221,222,223,224,225,226,227,228,229,230,231,232,233,234,235,236,237,238,239,240,241,242,243,244,245,246,247,248,249,250,251,252,253,254,255,256,257,258,259,260,261,262,263,264,265,266,267,268,269,270,271,272,273,274,275,276,277,278,279,280,281,282,283,284,285,286,287,288,289,290,291,292,293,294,295,296,297,298,299,300,301,302,303,304,305,306,307,308,309,310,311,312,313,314,315,316,317,318,319,320,321,322,323,324,325,326,327,328,329,330,331,332,333,334,335,336,337,338,339,340,341,342,343,344,345,346,347,348,349,350,351,352,353,354,355,356,357,358,359,360,361,362,363,364,365,366,367,368,369,370,371,372,373,374,375,376,377,378,379,380,381,382,383,384,385,386,387,388,389,390,391,392,393,394,395,396,397,398,399,400,401,402,403,404,405,406,407,408,409,410,411,412,413,414,415,416,417,418,419,420,421,422,423,424,425,426,427,428,429,430,431,432,433,434,435,436,437,438,439,440,441,442,443,444,445,446,447,448,449,450,451,452,453,454,455,456,457,458,459,460,461,462,463,464,465,466,467,468,469,470,471,472,473,474,475,476,477,478,479,480,481,482,483,484,485,486,487,488,489,490,491,492,493,494,495,496,497,498,499,500,501,502,503,504,505,506,507,508,509,510,511,512,513,514,515,516,517,518,519,520,521,522,523,524,525,526,527,528,529,530,531,532,533,534,535,536,537,538,539,540,541,542,543,544,545,546,547,548,549,550,551,552,553,554,555,556,557,558,559,560,561,562,563,564,565,566,567,568,569,570,571,572,573,574,575,576,577,578,579,580,581,582,583,584,585,586,587,588,589,590,591,592,593,594,595,596,597,598,599,600,601,602,603,604,605,606,607,608,609,610,611,612,613,614,615,616,617,618,619,620,621,622,623,624,625,626,627,628,629,630,631,632,633,634,635,636,637,638,639,640,641,642,643,644,645,646,647,648,649,650,651,652,653,654,655,656,657,658,659,660,661,662,663,664,665,666,667,668,669,670,671,672,673,674,675,676,677,678,679,680,681,682,683,684,685,686,687,688,689,690,691,692,693,694,695,696,697,698,699,700,701,702,703,704,705,706,707,708,709,710,711,712,713,714,715,716,717,718,719,720,721,722,723,724,725,726,727,728,729,730,731,732,733,734,735,736,737,738,739,740,741,742,743,744,745,746,747,748,749,750,751,752,753,754,755,756,757,758,759,760,761,762,763,764,765,766,767,768,769,770,771,772,773,774,775,776,777,778,779,780,781,782,783,784,785,786,787,788,789,790,791,792,793,794,795,796,797,798,799,800,801,802,803,804,805,806,807,808,809,810,811,812,813,814,815,816,817,818,819,820,821,822,823,824,825,826,827,828,829,830,831,832,833,834,835,836,837,838,839,840,841,842,843,844,845,846,847,848,849,850,851,852,853,854,855,856,857,858,859,860,861,862,863,864,865,866,867,868,869,870,871,872,873,874,875,876,877,878,879,880,881,882,883,884,885,886,887,888,889,890,891,892,893,894,895,896,897,898,899,900,901,902,903,904,905,906,907,908,909,910,911,912,913,914,915,916,917,918,919,920,921,922,923,924,925,926,927,928,929,930,931,932,933,934,935,936,937,938,939,940,941,942,943,944,945,946,947,948,949,950,951,952,953,954,955,956,957,958,959,960,961,962,963,964,965,966,967,968,969,970,971,972,973,974,975,976,977,978,979,980,981,982,983,984,985,986,987,988,989,990,991,992,993,994,995,996,997,998,999,1000]
[null,"Trhové Sviny",1,1,1,1,1,1,1,1,1,1,1,1,1,1,1,1,1,1,1,1,1,1,1,1,1,1,1,1,1,1,1,1,1,1,1,1,1,1,1,1,1,1,1,1,1,1,1,1,1,1,1,1,1,1,1,1,1,1,1,1,1,1,1,1,1,1,1,1,1,1,1,1,1,1,1,1,1,1,1,1,1,1,1,1,1,1,1,1,1,1,1,1,1,1,1,1,1,1,1,1,1,1,1,1,1,1,1,1,1,1,1,1,1,1,1,1,1,1,1,1,1,1,1,1,1,1,1,1,1,1,1,1,1,1,1,1,1,1,1,1,1,1,1,1,1,1,1,1,1,1,1,1,1,1,1,1,1,1,1,1,1,1,1,1,1,1,1,1,1,1,1,1,1,1,1,1,1,1,1,1,1,1,1,1,1,1,1,1,1,1,1,1,1,1,1,1,1,1,1,1,1,1,1,1,1,1,1,1,1,1,1,1,1,1,1,1,1,1,1,1,1,1,1,1,1,1,1,1,1,1,1,1,1,1,1,1,1,1,1,1,1,1,1,1,1,1,1,1,1,1,1,1,1,1,1,1,1,1,1,1,1,1,1,1,1,1,1,1,1,1,1,1,1,1,1,1,1,1,1,1,1,1,1,1,1,1,1,1,1,1,1,1,1,1,1,1,1,1,1,1,1,1,1,1,1,1,1,1,1,1,1,1,1,1,1,1,1,1,1,1,1,1,1,1,1,1,1,1,1,1,1,1,1,1,1,1,1,1,1,1,1,1,1,1,1,1,1,1,1,1,1,1,1,1,1,1,1,1,1,1,1,1,1,1,1,1,1,1,1,1,1,1,1,1,1,1,1,1,1,1,1,1,1,1,1,1,1,1,1,1,1,1,1,1,1,1,1,1,1,1,1,1,1,1,1,1,1,1,1,1,1,1,1,1,1,1,1,1,1,1,1,1,1,1,1,1,1,1,1,1,1,1,1,1,1,1,1,1,1,1,1,1,1,1,1,1,1,1,1,1,1,1,1,1,1,1,1,1,1,1,1,1,1,1,1,1,1,1,1,1,1,1,1,1,1,1,1,1,1,1,1,1,1,1,1,1,1,1,1,1,1,1,1,1,1,1,1,1,1,1,1,1,1,1,1,1,1,1,1,1,1,1,1,1,1,1,1,1,1,1,1,1,1,1,1,1,1,1,1,1,1,1,1,1,1,1,1,1,1,1,1,1,1,1,1,1,1,1,1,1,1,1,1,1,1,1,1,1,1,1,1,1,1,1,1,1,1,1,1,1,1,1,1,1,1,1,1,1,1,1,1,1,1,1,1,1,1,1,1,1,1,1,1,1,1,1,1,1,1,1,1,1,1,1,1,1,1,1,1,1,1,1,1,1,1,1,1,1,1,1,1,1,1,1,1,1,1,1,1,1,1,1,1,1,1,1,1,1,1,1,1,1,1,1,1,1,1,1,1,1,1,1,1,1,1,1,1,1,1,1,1,1,1,1,1,1,1,1,1,1,1,1,1,1,1,1,1,1,1,1,1,1,1,1,1,1,1,1,1,1,1,1,1,1,1,1,1,1,1,1,1,1,1,1,1,1,1,1,1,1,1,1,1,1,1,1,1,1,1,1,1,1,1,1,1,1,1,1,1,1,1,1,1,1,1,1,1,1,1,1,1,1,1,1,1,1,1,1,1,1,1,1,1,1,1,1,1,1,1,1,1,1,1,1,1,1,1,1,1,1,1,1,1,1,1,1,1,1,1,1,1,1,1,1,1,1,1,1,1,1,1,1,1,1,1,1,1,1,1,1,1,1,1,1,1,1,1,1,1,1,1,1,1,1,1,1,1,1,1,1,1,1,1,1,1,1,1,1,1,1,1,1,1,1,1,1,1,1,1,1,1,1,1,1,1,1,1,1,1,1,1,1,1,1,1,1,1,1,1,1,1,1,1,1,1,1,1,1,1,1,1,1,1,1,1,1,1,1,1,1,1,1,1,1,1,1,1,1,1,1,1,1,1,1,1,1,1,1,1,1,1,1,1,1,1,1,1,1,1,1,1,1,1,1,1,1,1,1,1,1,1,1,1,1,1,1,1,1,1,1,1,1,1,1,1,1,1,1,1,1,1,1,1,1,1,1,1,1,1,1,1,1,1,1,1,1,1,1,1,1,1,1,1,1,1,1,1,1,1,1,1,1,1,1,1,1,1,1,1,1,1,1,1,1,1,1,1,1,1,1,1,1,1,1,1,1,1,1,1,1]
[null,"Nesměň",3,3,null,null,null,null,null,4,4,null,null,2,null,null,null,null,null,3,3,3,3,null,2,2,3,null,null,null,null,null,null,6,null,null,null,2,4,null,null,3,2,2,null,null,4,null,null,null,null,null,null,null,4,3,null,4,3,2,null,null,null,null,2,null,4,null,null,4,null,3,null,null,3,3,null,3,5,null,null,null,null,null,5,3,4,null,null,null,3,2,null,2,null,3,null,null,null,4,null,null,null,null,2,null,null,2,null,null,null,null,4,null,4,null,null,null,null,null,null,null,null,null,5,null,null,3,null,null,null,null,null,null,null,3,null,null,null,null,null,null,null,null,null,null,3,null,null,null,4,null,null,null,4,null,null,3,null,null,null,3,null,null,3,null,4,null,null,null,null,null,null,null,3,null,4,null,null,null,null,null,null,null,null,null,null,null,5,2,null,null,null,3,4,null,null,null,null,null,null,null,5,null,null,null,null,null,null,null,null,null,null,null,4,null,4,6,null,3,null,null,4,null,4,null,null,null,null,null,null,4,4,null,null,3,null,3,null,null,3,null,null,4,null,null,3,3,null,null,4,null,4,null,3,null,null,null,2,4,null,null,null,null,null,null,null,null,null,2,null,3,null,null,3,4,null,null,null,null,null,null,5,null,null,3,null,null,null,4,null,4,null,3,null,null,3,null,5,null,null,null,null,2,null,null,null,null,null,null,3,null,null,null,null,null,5,null,3,null,null,null,null,4,3,null,null,null,null,null,null,null,null,3,5,null,null,null,4,null,5,null,3,3,null,3,2,null,null,3,null,null,null,null,null,null,null,null,null,null,null,null,null,3,null,null,null,3,null,null,null,null,3,3,null,null,null,null,null,2,null,null,null,null,null,4,null,null,null,null,null,null,null,null,null,4,3,5,null,2,null,3,null,4,null,4,3,null,null,5,2,null,2,3,null,null,null,3,null,3,null,2,3,null,3,2,null,null,null,null,6,null,3,2,4,null,4,5,null,null,null,null,null,3,null,null,null,null,null,3,null,2,null,null,null,null,null,null,null,null,null,null,null,3,5,null,2,2,null,5,3,null,null,4,null,4,null,4,null,null,null,null,3,null,null,null,null,4,null,null,null,null,null,null,null,null,null,7,null,4,null,null,4,null,2,5,null,3,null,3,null,null,4,null,null,null,null,null,null,3,null,null,null,3,5,null,null,null,3,null,4,4,5,3,null,null,4,null,null,null,null,3,null,null,4,null,null,null,null,null,null,2,null,null,4,null,null,null,null,3,2,null,2,5,3,3,null,null,4,null,null,null,null,null,null,null,null,3,null,null,null,4,5,null,3,5,null,null,3,null,5,null,null,null,null,null,null,null,null,null,null,3,null,null,3,null,null,null,null,null,null,null,3,null,5,null,4,3,null,4,null,2,null,3,null,null,6,null,null,null,null,null,6,3,null,null,null,null,null,null,null,null,3,null,4,null,null,null,null,null,null,null,null,5,4,null,null,2,null,null,null,null,null,null,null,null,null,null,null,null,null,null,null,4,2,null,null,null,null,null,null,null,null,null,null,null,3,4,3,null,null,null,null,5,null,3,3,null,null,null,null,5,null,3,null,4,null,4,null,null,null,null,4,null,null,null,null,4,null,null,null,null,null,4,4,null,null,null,null,null,null,null,3,null,null,4,null,null,null,null,3,null,null,3,null,3,null,null,null,null,null,null,2,5,null,null,null,4,null,null,null,null,3,null,3,null,null,null,null,null,2,null,null,3,null,null,null,null,null,null,null,4,null,4,null,3,4,2,2,null,null,3,null,null,null,null,2,null,null,null,null,null,null,null,3,2,4,null,4,5,null,null,null,null,4,null,null,null,null,null,null,null,null,null,null,4,2,null,null,4,3,null,null,null,null,3,null,null,null,null,null,null,null,null,3,2,null,null,null,null,null,null,null,null,3,2,2,null,null,null,null,null,null,null,null,null,null,null,null,null,null,4,4,null,null,null,null,null,null,null,null,null,null,null,null,null,null,null,3,null,null,2,null,null,null,null,null,null,4,3,null,null,null,3,3,null,3,null,null,null,4,3,null,2,null,2,5,null,null,null,null,null,null,null,null,3,null,3,2,null,null,null,null,3,2,null,4,4,null,null,null,3,null,null,4,null,null,null,4,null,3,null,null,null,null,null,null,null,2,3,null,4,null,null,null,3,null,null,null,2,2,5,null,null,null,5,null,null,null,null,null,3,null,null,3,null,null,null,null,null,null,null,null,2,3,2,null,null,null,3,4,3]
[null,"Ločenice",null,null,null,4,null,null,null,3,3,null,null,null,null,null,null,null,null,null,null,null,null,null,null,null,2,null,null,null,null,null,null,5,null,null,3,null,3,null,2,null,null,null,3,null,3,null,null,null,null,null,3,null,null,null,null,3,null,null,3,null,null,null,null,null,3,null,null,3,null,null,null,3,null,null,null,null,null,2,null,null,null,null,4,null,null,null,null,null,2,null,4,null,null,null,5,null,4,null,null,null,null,null,null,null,null,null,null,null,null,null,null,null,null,null,null,2,5,3,null,null,3,3,null,3,4,null,null,3,null,null,null,3,4,null,null,null,null,null,4,2,3,3,null,null,2,null,3,null,3,null,3,null,3,2,null,null,null,null,3,null,2,4,null,null,null,null,null,null,null,null,null,null,null,null,null,null,3,null,null,3,null,null,3,null,null,null,null,null,null,5,2,2,3,3,null,2,null,4,null,5,4,null,2,2,null,null,3,4,null,null,3,3,null,4,3,5,2,2,3,null,null,null,null,null,null,3,null,null,2,null,3,2,null,null,3,null,4,null,null,2,null,null,null,null,null,null,4,null,3,null,null,null,null,2,2,null,null,3,null,4,null,null,null,3,5,4,null,null,null,null,null,3,null,null,null,null,3,3,null,null,null,null,null,2,2,null,null,null,2,null,null,null,null,2,null,null,4,null,null,null,null,null,null,null,null,null,null,null,null,3,3,2,null,null,null,5,null,4,null,null,null,3,null,4,null,null,null,null,3,null,null,null,4,null,null,null,null,null,4,3,null,null,null,null,null,null,null,null,3,3,null,null,null,null,3,3,null,null,null,3,2,null,null,null,3,null,null,3,null,2,2,2,null,null,null,null,null,null,null,null,null,null,null,3,null,null,null,6,null,3,null,null,null,3,2,4,null,null,null,null,3,null,null,null,2,3,3,4,null,null,null,2,null,null,null,2,3,2,null,null,null,null,null,null,null,null,2,null,5,null,null,null,null,null,null,4,null,null,null,null,null,null,null,null,null,2,null,2,2,null,null,null,null,2,3,null,null,null,null,null,null,null,4,3,null,null,null,4,null,3,null,null,3,null,null,null,null,3,3,null,null,2,6,3,null,null,5,null,null,null,null,2,null,null,null,6,null,null,4,4,null,null,null,4,null,null,null,2,3,4,null,null,3,2,null,null,null,null,null,null,null,null,4,2,null,3,null,null,3,null,null,2,4,null,3,null,null,null,null,null,null,null,null,null,null,null,3,null,null,null,null,null,null,null,2,null,null,null,null,null,null,4,null,null,2,null,null,null,null,3,4,null,null,null,2,null,null,3,null,null,null,null,null,null,null,null,null,null,4,null,null,null,2,null,2,4,3,4,null,null,3,null,null,null,null,null,5,3,null,null,null,null,4,null,null,null,null,null,null,null,null,null,null,4,5,null,null,null,3,null,5,null,null,null,3,2,null,5,null,3,null,null,null,null,null,2,null,null,null,4,null,4,null,3,null,null,null,null,null,null,3,null,null,null,null,null,2,4,2,null,null,null,null,null,null,null,2,null,4,null,null,2,null,3,null,3,2,3,2,null,3,4,null,null,null,3,null,null,null,4,2,null,3,3,null,3,null,3,null,4,3,null,null,2,null,null,3,2,null,3,null,null,null,null,null,null,null,2,null,3,null,null,null,null,null,2,null,null,null,null,null,2,4,2,null,null,2,null,3,null,null,4,null,null,null,null,null,2,null,null,null,null,null,null,null,3,3,null,null,null,3,null,2,3,null,3,null,2,null,null,null,null,null,null,null,null,null,4,2,null,null,null,null,null,null,3,2,3,3,null,4,3,null,null,null,3,null,null,null,2,5,3,null,2,null,null,null,null,null,null,null,null,null,null,null,null,null,null,null,null,null,null,null,null,null,null,null,5,null,null,3,null,null,null,null,null,null,2,null,2,null,2,null,null,null,3,null,3,null,null,null,null,null,null,4,null,4,null,null,null,3,3,null,null,null,null,2,3,null,4,null,null,4,null,null,null,2,null,null,null,null,null,null,null,3,3,3,null,null,null,null,null,null,3,2,null,null,3,null,null,4,null,null,null,4,null,null,2,null,2,null,null,null,null,3,null,null,null,5,2,null,null,null,2,3,3,null,null,null,null,3,null,null,null,null,null,null,null,null,null,3,null,3,2,3,3,null,null,null,3,null,null,null,null,3,4,null,null,null,null,null,null,null,4,null,3,3,null,null,null,null,null,2,2,3,null,2,4,null,null,null,null,null,null,3]
[null,"Todně",null,null,null,2,2,null,null,2,null,null,null,null,null,null,null,2,3,null,null,null,2,2,null,null,null,3,2,null,null,null,null,3,null,null,null,null,2,null,null,null,null,null,null,null,2,null,null,null,null,null,null,null,null,null,2,null,null,null,null,null,null,null,null,null,null,3,null,null,null,null,null,null,null,null,2,null,4,null,null,null,2,2,3,null,2,null,null,2,null,null,null,null,null,2,3,4,2,null,null,null,null,null,null,null,null,null,null,null,null,null,3,null,2,2,3,null,3,2,null,null,null,2,null,2,3,null,null,2,null,2,null,null,null,2,null,null,null,null,null,null,2,null,null,null,null,null,2,2,2,null,null,null,null,null,null,null,null,3,null,null,null,3,null,null,2,2,null,null,null,2,2,null,2,null,null,null,null,null,null,2,null,null,null,3,3,2,null,null,null,3,null,null,null,null,null,null,3,null,2,3,null,2,null,null,null,null,null,3,4,null,null,2,3,2,null,null,null,null,null,3,null,2,3,null,2,null,null,null,null,null,null,null,null,null,null,null,null,null,null,null,2,3,null,null,null,null,3,null,null,null,3,null,null,null,null,null,null,null,null,2,3,null,2,null,null,null,3,null,null,null,null,null,null,null,2,null,null,2,null,null,null,null,null,null,null,null,null,3,null,null,2,null,null,null,null,3,2,2,2,2,null,null,null,3,null,3,null,2,2,null,null,null,null,2,null,4,null,2,null,null,3,null,null,null,null,null,null,2,null,null,null,null,null,null,2,3,null,null,2,null,2,null,null,2,null,null,3,2,null,null,null,null,null,2,null,null,null,null,null,null,null,2,null,2,2,2,3,null,null,null,null,null,null,3,4,null,null,null,2,null,3,3,null,null,null,null,2,4,null,2,3,null,null,null,null,3,2,null,null,null,2,null,null,3,null,null,2,null,null,3,null,null,3,null,null,null,null,null,2,null,null,null,null,null,null,null,null,2,4,3,2,null,null,null,3,2,null,null,null,null,3,null,null,null,null,null,3,null,null,null,2,2,null,null,null,null,null,null,null,null,null,2,2,2,null,null,null,3,null,null,null,3,null,3,2,null,3,2,2,null,null,null,4,null,null,3,null,2,2,4,null,null,2,null,null,4,null,2,null,null,3,2,null,null,3,null,null,null,2,null,2,2,null,null,null,null,null,2,null,null,4,2,null,null,3,null,null,null,null,null,null,null,null,2,null,null,null,null,null,null,2,2,3,null,null,null,null,null,null,null,2,3,3,null,null,null,2,null,null,null,null,null,null,2,null,2,3,2,null,2,3,3,4,null,null,2,null,null,3,null,4,null,2,null,2,null,null,null,null,null,3,3,null,null,null,2,null,null,3,null,2,null,2,3,2,2,4,null,2,null,null,3,null,null,2,null,null,2,null,null,null,null,null,null,null,4,null,null,2,null,3,null,null,3,null,null,null,3,null,null,null,null,3,null,null,null,null,null,null,3,null,3,null,2,null,null,null,2,null,null,null,3,null,2,3,null,null,3,null,null,3,3,null,2,null,null,null,null,3,null,null,null,3,2,null,null,null,2,null,null,null,3,null,null,null,2,null,null,3,2,null,null,null,null,2,null,2,2,null,null,null,2,3,null,2,3,null,null,null,null,2,null,null,3,null,null,3,null,null,2,null,null,2,null,null,null,null,null,2,2,null,null,3,null,2,null,null,null,2,null,null,null,null,null,null,null,null,null,null,3,2,null,null,null,3,null,null,3,null,null,2,null,null,2,null,null,null,null,null,2,2,null,null,null,3,null,null,null,null,null,null,null,null,null,null,2,null,2,2,2,null,null,2,null,3,null,3,null,null,null,null,null,3,null,null,null,null,null,null,2,null,null,null,null,null,null,null,null,null,2,null,null,3,null,null,null,null,null,null,null,2,3,null,null,null,null,null,null,null,null,null,null,null,null,null,2,null,2,null,null,null,3,null,null,null,2,null,null,2,null,2,null,null,null,3,2,null,null,3,null,2,null,null,2,3,null,null,null,null,null,null,null,2,4,2,null,null,null,null,null,null,null,null,null,null,null,null,null,3,2,3,null,2,null,null,null,null,null,null,null,2,2,null,null,null,null,null,2,4,null,3,null,null,null,null,null,null,null,null,null,null,null,3,null,null,null,null,3,null,null,null,3,null,null,null,2,null,2,null,null,null,null,3,null,null,2,null,null,null,null,null,2,3,2,null,null,2,2,2,null,null,null,null,null,null,null,null,null,null,4,null,null,null,null,null,null,null,null,3]
[null,"Nežetice",null,null,null,null,null,3,null,null,null,null,null,null,null,null,null,null,2,null,2,2,null,null,null,null,null,null,null,null,null,null,null,2,3,null,null,null,null,null,null,null,null,null,null,2,null,null,3,2,null,2,null,null,null,null,null,2,null,null,null,null,2,null,null,2,null,2,null,null,null,null,null,2,2,null,null,null,3,null,2,2,null,null,2,null,null,null,null,null,null,null,3,null,3,null,null,3,null,null,null,null,null,null,null,2,null,null,null,2,3,null,null,null,null,null,2,null,null,null,null,null,null,null,3,null,2,2,null,null,null,null,2,null,2,null,null,3,2,null,2,null,null,null,null,null,null,null,null,null,null,2,null,null,2,null,2,null,null,2,null,null,null,2,null,null,null,null,null,2,null,null,null,null,null,2,3,null,2,null,2,null,null,null,2,2,2,null,3,null,null,null,null,null,null,2,null,null,null,2,null,null,3,null,null,null,null,2,null,null,3,null,null,null,null,null,2,3,null,null,2,2,3,null,2,2,null,null,2,null,null,null,null,null,2,2,2,2,null,null,null,null,null,null,3,null,2,null,null,null,null,null,2,null,null,null,null,null,null,null,3,null,2,null,null,null,3,null,2,null,null,null,null,null,null,2,null,2,null,null,null,3,3,2,2,null,null,2,null,null,null,3,null,2,null,null,2,null,null,null,null,null,2,null,null,null,null,2,null,null,null,null,2,null,null,null,3,3,null,null,null,2,2,null,null,2,null,null,null,null,null,null,null,null,2,2,null,2,3,2,null,null,null,null,null,null,null,null,null,null,2,2,2,null,2,null,2,null,null,2,null,2,null,null,null,null,null,null,null,null,null,null,null,null,3,null,3,null,null,null,null,null,null,2,3,null,2,null,null,3,3,null,2,2,null,null,null,2,null,null,null,null,null,null,2,2,null,2,null,3,null,2,null,null,null,2,null,null,2,null,null,null,null,2,null,null,null,null,null,null,3,2,null,null,2,2,2,null,null,null,null,null,null,null,2,null,3,null,2,null,null,null,null,null,2,null,2,2,null,2,null,2,null,null,null,null,null,null,null,2,null,null,null,null,null,2,null,2,2,null,null,2,null,null,3,2,null,2,3,null,null,3,2,null,null,2,null,3,3,null,2,null,null,null,null,3,2,null,null,null,null,3,null,null,null,null,3,null,null,null,null,null,3,null,null,null,2,null,null,null,null,3,3,null,3,null,null,null,2,2,null,null,null,null,2,null,2,2,null,null,null,null,null,null,null,null,null,null,null,null,null,null,null,2,null,null,null,null,null,null,null,null,2,2,3,null,null,null,2,null,null,2,3,null,null,3,null,2,null,2,2,null,null,2,null,null,null,null,null,null,null,null,null,null,null,2,null,null,3,null,null,3,2,2,2,null,null,2,null,null,null,null,null,null,3,null,3,3,2,2,null,null,null,null,null,2,null,null,3,null,null,2,2,null,null,null,2,null,null,null,2,null,null,2,null,null,null,null,null,null,null,null,null,null,null,null,2,null,null,2,null,null,null,2,null,null,null,null,null,null,2,2,3,null,null,null,null,2,null,null,null,null,null,2,2,null,2,null,null,2,2,null,null,null,null,2,null,null,null,null,null,2,null,null,2,null,null,2,null,null,null,null,null,2,null,2,2,null,2,null,null,null,2,2,null,null,null,null,2,null,null,null,null,null,null,null,null,null,null,null,null,3,null,3,null,null,null,3,null,null,null,null,null,3,2,null,2,null,2,null,null,2,null,null,null,null,null,null,null,null,null,null,null,3,null,null,2,null,null,2,null,null,2,null,null,null,null,null,null,null,null,null,null,2,null,null,null,null,2,3,null,null,3,null,2,null,null,null,2,3,null,null,null,null,null,3,null,2,null,2,2,null,null,null,null,null,null,null,2,3,2,3,null,null,null,null,null,null,null,null,3,null,null,null,null,null,null,null,2,null,2,null,null,null,null,null,2,null,2,null,null,3,null,null,2,null,null,null,null,null,null,3,null,null,null,null,null,null,null,null,null,null,2,null,null,3,null,null,null,2,null,null,null,2,null,null,null,null,null,2,null,null,null,null,null,null,2,2,2,null,null,null,null,null,2,null,null,null,null,null,3,null,2,2,null,null,null,2,3,3,null,null,2,null,2,null,2,null,null,null,null,null,null,null,null,null,2,null,null,null,null,null,null,3,2,null,2,null,2,null,null,3,2,null,2,null,null,null,null,null,null,null,null,null,null,null,null,null,null,3,2,3,null,null,null,null,2,2,2,2]
[null,"Březí",null,2,null,null,null,2,null,null,2,null,null,null,null,2,null,null,null,null,null,null,null,null,null,null,null,2,null,2,null,2,2,null,2,null,2,null,null,null,null,2,null,null,2,null,null,null,2,null,null,null,2,null,2,2,null,null,null,null,2,null,null,null,null,null,null,null,2,null,null,2,2,null,null,2,null,2,2,null,null,null,null,null,null,2,null,null,null,null,null,null,2,null,2,null,2,2,null,2,null,null,null,2,null,null,2,null,null,null,2,null,2,2,null,null,null,null,2,null,null,null,2,null,2,null,null,null,2,null,null,null,null,null,null,null,null,2,null,2,null,null,null,null,2,null,null,null,null,null,null,null,2,null,null,null,null,null,null,null,null,2,null,null,2,null,null,null,null,null,null,null,null,null,null,null,2,2,null,2,null,null,2,null,null,null,null,null,2,null,null,2,null,null,null,null,2,null,2,null,null,2,2,null,null,null,2,null,null,2,2,null,null,null,2,null,null,2,null,null,null,null,2,null,null,null,null,null,null,2,null,2,null,null,null,null,null,null,2,null,null,null,null,2,2,null,null,null,2,null,2,2,null,2,2,null,null,null,null,null,2,null,null,2,null,null,2,2,null,null,null,null,null,2,2,null,null,null,2,null,2,2,2,null,null,null,null,null,null,2,null,2,null,null,null,null,null,2,null,null,null,null,null,null,2,2,2,null,null,null,null,null,null,null,null,null,2,2,2,null,null,null,null,null,2,null,null,null,null,null,2,null,2,2,null,null,null,null,2,null,null,2,null,2,null,null,null,null,2,null,null,null,null,null,null,null,null,null,null,null,null,null,null,null,null,null,null,null,2,2,null,null,null,null,2,2,2,null,null,null,null,null,2,null,2,null,null,null,null,2,2,null,null,null,null,2,null,null,null,null,2,null,null,2,null,null,null,null,null,2,null,null,null,null,2,null,2,null,null,null,null,null,2,null,null,null,null,2,null,null,2,null,null,null,null,null,null,null,null,null,2,null,2,2,null,null,2,null,null,null,null,null,null,null,null,null,null,null,null,null,null,null,2,null,null,null,null,null,null,null,null,null,null,2,null,null,null,null,null,null,null,null,null,null,2,null,null,null,2,null,null,2,null,null,null,null,null,2,2,null,null,2,2,null,null,2,null,2,null,null,null,2,null,null,2,null,2,null,2,null,2,null,2,null,2,null,null,null,2,2,2,2,2,null,2,null,null,null,null,null,null,2,null,null,null,2,null,null,null,null,null,null,null,2,2,null,null,null,null,2,null,null,null,null,null,null,null,null,2,null,null,null,null,null,2,null,null,null,null,null,2,null,2,2,null,2,null,null,null,null,null,null,2,null,null,2,null,null,null,2,2,null,null,null,null,null,null,null,2,null,null,2,null,null,null,null,null,null,null,null,null,null,2,2,2,2,2,2,null,null,null,null,2,null,null,null,null,null,2,2,null,null,null,null,2,null,null,null,null,null,null,2,2,null,2,null,null,null,2,null,null,null,null,2,null,null,null,null,null,null,null,null,2,null,null,null,2,2,null,2,null,null,2,null,2,null,2,null,null,null,null,null,2,null,null,null,null,null,null,null,null,null,null,2,2,null,null,2,null,null,null,null,null,null,null,null,null,null,2,null,null,null,null,null,2,null,null,null,null,null,null,null,null,null,null,2,2,null,null,null,null,null,null,null,2,null,null,null,null,null,null,2,null,2,null,null,null,2,null,null,2,2,null,2,null,null,null,2,null,2,null,null,null,null,null,null,2,null,2,null,null,null,null,2,null,null,null,null,null,null,null,null,null,null,2,null,null,null,null,null,null,null,2,null,null,null,2,null,null,2,2,null,2,2,null,null,2,null,null,2,null,null,null,null,null,2,null,null,null,null,null,null,null,null,2,2,null,2,null,2,null,2,null,2,2,null,null,null,null,null,2,null,null,null,2,null,null,null,null,null,null,null,2,2,2,null,null,null,null,null,null,2,null,null,null,null,2,null,null,2,2,2,null,2,2,null,2,null,null,null,null,null,null,null,null,2,null,2,2,null,null,2,null,null,2,2,null,null,null,null,2,null,2,null,null,null,null,null,null,null,null,null,null,null,null,null,2,null,null,null,2,null,null,null,null,null,2,null,2,2,null,null,null,null,null,2,null,null,2,2,null,2,2,2,2,null,null,null,null,null,2,2,2,2,null,null,null,null,null,null,null,2,null,null,null,null,2,null,null,null,null,2,null,null,null,null,null,null,null,2,null,2,null,null,2,null,null,null,null,null,2,2]
[null,"Něchov",2,null,null,3,null,4,2,null,null,null,null,null,null,3,null,3,4,2,null,null,null,null,null,null,null,null,null,null,null,null,null,4,4,null,null,null,null,null,null,null,null,null,null,null,null,2,null,null,null,null,null,null,3,null,null,null,2,null,null,null,3,null,null,3,2,null,null,2,2,null,3,null,null,null,3,null,null,null,null,3,3,null,null,null,3,null,null,null,null,null,null,null,4,null,4,null,3,3,null,null,2,3,null,null,3,null,2,null,null,null,null,null,3,3,4,null,4,null,null,null,null,null,4,null,null,null,null,null,2,null,null,2,3,null,2,null,null,null,3,null,null,2,null,null,null,null,null,null,null,3,null,null,null,null,null,2,null,4,2,null,null,null,null,null,3,null,2,null,null,3,null,null,null,3,null,null,null,null,null,null,3,null,null,null,4,null,4,null,null,4,null,null,2,null,null,null,4,3,3,4,null,3,null,null,null,null,2,null,null,null,2,null,null,3,null,4,null,null,null,4,null,null,null,3,null,2,null,null,null,3,2,null,null,null,null,null,3,null,2,null,3,null,null,null,null,2,null,null,null,null,null,3,null,null,null,null,null,2,null,3,null,null,null,2,4,3,null,null,null,2,2,null,null,3,null,null,null,null,null,null,4,null,null,null,null,null,2,null,null,null,null,null,2,null,null,null,3,3,3,null,null,null,null,null,null,null,null,null,null,2,null,null,2,null,4,null,null,3,null,null,null,2,null,3,null,null,null,null,null,null,null,null,3,null,3,null,null,null,3,null,null,null,null,null,null,2,null,null,null,null,null,null,null,null,null,2,2,null,null,null,null,null,2,null,null,null,null,null,2,null,null,null,null,null,null,null,2,null,null,null,4,null,null,2,3,null,3,5,4,null,null,null,null,null,null,null,null,null,3,2,null,3,null,null,null,null,null,null,null,null,null,null,null,null,3,null,null,null,3,null,null,3,2,null,2,null,null,null,null,4,null,null,3,3,null,3,2,null,null,2,null,null,null,2,null,null,null,null,null,null,null,3,null,null,null,null,2,null,null,null,3,null,3,null,null,null,2,null,2,2,2,null,2,null,null,3,null,null,null,null,2,null,5,null,2,null,4,3,3,null,null,null,3,null,null,5,null,3,3,3,null,null,null,null,4,null,null,null,null,null,3,null,null,null,null,null,null,null,null,2,null,null,3,null,null,2,null,null,null,null,4,null,null,null,2,null,null,null,null,null,null,null,null,3,null,null,2,null,null,null,null,null,null,2,null,2,null,null,null,null,null,3,2,null,null,null,null,null,null,null,null,4,null,null,null,null,3,2,null,3,null,null,null,4,null,3,2,null,3,2,null,4,null,null,null,3,2,3,null,2,null,null,null,null,3,null,null,2,3,null,null,null,3,2,3,null,null,3,2,null,3,null,null,3,4,null,null,null,null,null,4,2,null,null,2,null,4,4,null,null,null,null,null,2,null,null,null,2,null,null,3,null,3,null,2,null,null,null,null,2,2,null,null,3,null,null,null,null,null,null,null,null,null,null,null,3,null,3,null,null,4,null,null,null,null,null,null,null,null,null,null,null,null,2,null,null,2,null,4,3,null,null,null,null,null,null,null,null,2,3,2,null,null,null,null,null,null,null,null,2,null,3,3,null,null,null,null,null,null,null,null,null,null,3,null,null,null,2,null,null,null,null,null,null,null,null,null,null,null,4,null,null,2,null,2,null,null,null,3,null,null,4,null,2,null,null,null,null,null,null,null,2,null,null,null,2,null,null,2,3,null,null,null,2,null,null,null,3,null,2,3,null,null,null,null,null,null,null,null,3,3,null,null,null,null,2,null,4,3,null,4,null,null,null,3,2,null,4,null,3,2,null,null,null,null,null,null,3,null,null,null,null,null,null,2,null,null,4,null,null,null,4,null,null,null,null,null,null,4,null,null,null,null,null,null,null,null,null,null,null,null,null,null,null,3,null,3,null,null,null,null,2,null,null,null,null,null,null,null,null,null,3,3,null,4,2,null,null,null,null,null,null,null,null,null,null,null,null,2,null,null,null,null,null,null,2,null,null,null,null,null,null,null,null,3,null,null,null,null,null,null,3,3,2,null,2,null,null,null,null,null,null,null,null,null,null,4,null,null,2,null,null,null,null,3,null,3,null,2,null,null,4,null,null,null,null,null,null,null,null,3,4,null,2,null,3,null,null,null,4,3,3,null,3,3,2,null,null,null,null,null,null,null,null,2]
[null,"Besednice",null,null,null,null,null,5,null,null,null,null,null,null,2,null,null,null,null,null,4,null,4,null,null,null,null,null,3,null,null,null,null,null,null,null,null,null,null,null,null,4,null,null,4,null,5,null,null,null,null,null,null,null,null,null,null,null,null,null,null,null,null,null,null,null,null,null,null,5,null,null,null,null,null,null,4,null,null,null,3,null,null,null,null,4,null,null,2,null,null,null,null,null,null,4,6,null,null,null,null,null,null,4,null,null,null,3,null,3,null,null,5,null,null,null,null,null,null,null,null,2,null,4,null,null,null,4,3,null,null,3,null,null,null,null,null,null,null,null,null,3,null,null,null,null,null,null,4,null,null,null,4,null,null,null,null,null,null,null,null,null,null,null,null,null,null,3,null,null,2,null,3,2,4,null,null,null,4,3,null,null,null,null,null,null,null,null,6,null,null,null,null,null,null,4,null,3,null,null,null,6,null,4,3,3,null,null,null,null,null,null,null,4,null,null,null,null,3,null,null,5,null,null,5,null,3,null,null,3,null,null,null,null,3,null,null,4,null,null,4,null,null,null,null,2,4,null,null,null,null,3,5,null,null,null,null,2,null,5,null,5,null,null,null,4,null,null,null,null,null,4,null,4,null,null,null,null,null,null,3,null,null,null,3,4,3,3,3,null,3,null,null,null,null,null,4,null,6,null,null,3,null,3,null,null,null,null,null,3,null,4,null,3,null,3,6,6,null,null,null,null,null,null,null,null,null,2,null,null,4,2,null,null,null,null,null,4,null,3,null,null,null,null,2,4,null,null,4,null,null,null,null,2,null,null,null,null,null,null,null,null,null,4,null,3,null,null,null,null,null,null,null,null,null,4,null,2,null,3,null,null,null,null,4,null,null,null,null,7,null,4,null,3,null,5,null,6,null,3,null,null,4,null,null,null,null,null,null,null,3,4,null,null,4,null,null,null,4,null,null,null,null,null,null,null,null,null,null,null,null,5,null,null,null,4,null,null,null,null,null,3,null,null,null,null,4,3,null,null,null,null,3,null,null,null,null,null,null,null,null,3,null,4,null,null,3,3,null,6,4,null,null,null,null,null,null,null,null,null,4,3,null,null,null,null,null,null,6,4,4,5,3,null,null,null,null,null,null,null,null,null,null,3,3,null,5,null,null,null,null,5,5,null,null,null,null,2,null,null,null,null,null,4,null,3,null,null,4,null,null,null,null,null,null,null,null,null,null,3,null,null,null,null,null,4,null,3,null,2,null,3,null,4,null,null,null,3,null,4,null,2,null,null,4,4,null,null,null,null,null,null,5,null,null,null,3,null,null,null,4,5,6,null,4,null,null,null,4,3,null,3,4,null,null,null,null,5,null,null,null,null,null,null,null,null,null,3,6,null,null,4,null,null,6,null,null,4,null,null,null,null,4,null,null,null,null,null,null,null,null,null,null,null,null,null,null,3,5,6,null,null,4,null,null,null,null,null,null,null,null,null,4,null,null,null,null,null,null,null,null,null,null,null,null,null,null,2,null,null,3,2,null,null,null,3,3,null,null,4,null,null,null,null,null,null,null,5,null,4,3,null,4,null,null,null,4,4,null,null,null,null,null,4,null,null,null,null,null,4,null,null,null,3,null,3,null,null,4,null,null,4,3,5,null,null,3,null,null,null,null,4,null,3,null,null,null,null,null,3,null,3,null,4,null,null,null,null,null,2,null,null,null,null,null,2,3,5,null,3,4,null,null,null,null,null,null,null,null,null,null,null,4,4,null,null,null,null,null,null,3,null,null,null,2,null,null,null,null,null,null,null,null,null,3,null,null,null,null,null,null,null,null,null,null,null,null,null,5,6,null,null,6,null,5,null,null,null,null,5,null,null,null,null,null,5,null,null,null,null,4,null,null,null,null,null,null,null,null,null,null,null,4,null,null,null,null,null,null,null,5,3,null,null,null,null,3,null,null,4,null,null,null,null,null,null,null,null,null,null,null,5,null,4,3,null,null,null,null,4,4,null,3,4,null,null,null,null,null,null,null,null,null,null,null,null,4,null,5,null,null,3,null,null,null,null,null,null,null,4,5,null,5,null,null,null,null,null,null,null,null,null,3,null,null,null,null,4,null,null,6,null,null,null,null,null,null,null,null,4,2,null,null,null,null,null,null,2,null,null,null,null,4,5,null,3,null,null,null,null,null,null,null,null,null,null,null,null,null,null,null,6,null,null,null,6,4,null,null,null,3,null,null,null,null,null,null,null,null,null,null,null,null,3,null,null,4,3,null,null,5]
[null,"Keblany",null,null,null,null,null,null,null,null,null,2,2,null,null,null,2,null,5,null,null,null,null,null,null,3,null,null,null,null,2,null,null,null,null,null,null,3,null,null,3,null,3,3,null,null,null,null,null,3,null,null,null,2,null,4,3,null,null,null,null,null,4,null,null,null,null,null,3,null,null,null,null,null,null,null,5,null,null,null,null,null,null,null,null,null,null,null,null,3,null,null,null,null,null,null,7,null,null,null,null,null,null,null,3,null,4,null,null,null,4,null,null,null,null,null,null,null,6,null,2,null,null,null,null,4,null,null,4,null,null,null,null,null,null,null,null,null,null,null,null,null,4,null,3,null,null,null,null,null,null,null,5,2,null,3,3,4,null,null,null,4,3,null,4,2,null,4,null,null,3,null,null,null,null,null,null,3,null,null,3,null,null,2,null,null,null,null,null,null,2,null,3,null,5,5,null,null,null,null,4,null,null,5,null,null,null,null,null,null,null,2,4,null,null,null,null,7,null,null,null,null,null,null,null,null,4,null,3,4,null,5,null,null,null,null,null,null,null,null,null,null,null,null,4,null,5,4,5,2,null,null,6,4,null,null,null,null,3,6,null,null,null,null,null,null,6,null,null,3,null,5,3,5,null,null,null,null,null,null,null,null,6,null,4,null,null,4,null,null,null,null,null,null,null,null,5,null,null,4,null,null,3,null,null,null,null,null,2,null,null,null,null,null,null,4,null,null,null,null,2,null,null,null,null,null,2,null,2,null,null,3,null,null,null,3,null,null,null,null,null,4,4,4,3,5,null,null,5,4,null,4,null,null,null,null,4,null,null,null,2,4,3,null,null,null,null,null,null,4,3,null,4,null,4,null,null,3,null,null,null,null,null,null,null,null,null,null,null,null,null,null,null,null,null,null,null,null,null,null,4,null,null,null,null,null,4,null,null,6,4,5,null,null,5,null,4,null,null,null,null,3,null,null,4,null,null,null,3,null,null,null,4,null,null,null,null,null,null,2,null,null,null,null,null,3,null,null,null,4,null,null,4,null,3,null,null,null,3,null,null,null,4,null,null,4,null,null,null,7,null,null,null,null,4,null,3,5,null,null,null,null,null,null,null,null,3,null,null,null,null,null,4,null,null,3,2,8,4,null,null,null,null,null,null,null,6,4,null,null,null,6,null,3,null,null,null,null,3,null,3,null,null,5,6,null,4,null,5,null,null,null,null,null,5,null,null,null,null,null,2,null,null,null,null,5,null,null,null,null,null,null,null,null,null,null,null,null,null,null,null,3,null,null,null,null,null,null,null,3,null,null,null,null,null,null,4,null,4,4,null,null,7,null,null,null,3,null,null,4,6,null,null,null,3,3,3,null,null,null,4,4,null,null,null,null,null,4,7,null,null,null,null,null,null,null,null,null,null,5,3,3,null,null,4,null,7,5,3,null,null,null,null,null,null,null,null,null,null,null,2,4,null,2,null,null,null,3,null,null,null,null,null,null,null,null,3,null,null,3,null,null,null,4,2,null,null,null,3,null,4,null,null,null,null,null,4,4,3,null,null,null,null,null,null,null,null,6,null,null,4,null,null,6,null,null,null,null,null,null,null,null,null,5,null,null,3,5,null,null,null,null,null,null,4,4,null,null,5,null,2,null,null,null,null,null,null,null,null,3,null,null,null,null,null,null,null,null,3,null,null,4,null,null,null,4,null,null,null,null,null,5,null,null,null,null,4,6,2,null,5,null,4,null,null,null,null,null,null,null,3,null,null,null,3,4,null,4,3,null,null,null,null,null,null,4,5,null,3,null,null,null,4,2,null,null,null,null,null,4,null,null,null,4,null,null,5,null,null,null,null,null,7,null,6,3,null,3,null,null,null,4,null,2,null,6,3,null,null,null,null,null,null,null,null,null,null,null,3,null,3,4,5,null,null,null,2,null,2,null,6,null,null,null,4,3,null,4,null,null,null,null,null,null,null,2,5,null,null,null,3,null,null,null,null,null,4,null,null,null,null,null,4,null,null,null,null,null,4,null,null,null,null,null,3,null,null,4,null,null,3,null,2,null,null,null,4,3,null,null,null,null,null,null,null,null,null,null,null,null,null,null,null,null,null,null,null,null,null,null,7,null,null,null,3,null,5,null,5,null,3,null,4,2,null,null,null,3,null,null,null,3,null,null,null,null,4,null,null,null,null,5,4,null,null,null,4,null,3,3,null,null,null,4,null,7,null,4,null,3,4,null,null,null,null,null,4,2,null,null,null,null,null,null,null,3,5,null,3,4,null,4]
[null,"Mohuřice",null,null,2,null,null,7,null,null,5,null,null,3,null,null,null,null,null,null,null,null,null,null,null,5,null,4,4,null,3,null,null,null,null,null,null,null,null,null,null,null,null,null,5,null,null,null,null,4,null,null,null,3,null,null,null,null,4,null,null,null,5,3,4,null,5,null,null,6,3,null,null,4,null,null,null,null,null,3,4,null,null,null,null,null,5,2,null,null,null,null,null,3,null,null,null,null,5,null,2,null,3,null,4,null,null,null,null,4,null,null,6,null,5,null,null,3,null,null,3,null,4,null,6,null,null,null,null,null,null,null,3,null,null,null,null,5,null,null,5,null,5,null,null,null,null,2,null,null,null,null,6,3,null,null,5,null,null,null,null,null,null,null,5,null,null,null,null,null,null,4,4,3,null,null,null,null,null,null,4,4,4,null,null,null,null,null,null,null,null,null,4,null,7,null,4,5,5,5,null,7,null,null,null,null,null,null,null,null,null,null,5,null,null,null,null,null,null,4,null,null,null,4,null,null,null,null,null,null,null,null,6,null,null,null,null,null,6,2,null,null,null,null,null,null,null,null,null,null,null,null,null,null,null,null,3,null,null,7,null,null,null,null,null,5,null,null,null,null,null,null,null,null,null,null,null,null,null,null,null,5,null,null,null,null,4,null,null,5,null,null,null,4,3,null,6,null,null,null,null,null,null,4,4,4,null,null,null,null,null,null,4,null,null,null,null,7,null,null,4,3,null,null,null,null,null,3,null,3,5,null,null,null,null,null,5,6,null,null,null,null,null,5,null,6,4,null,null,null,null,null,4,null,4,3,null,null,null,null,null,null,4,null,null,null,4,null,null,null,null,null,null,null,null,null,5,4,null,null,null,null,null,null,5,null,5,null,null,null,null,5,null,4,2,7,null,null,null,null,null,null,null,5,null,null,null,null,null,8,6,7,3,null,null,null,null,null,null,4,null,null,null,null,null,null,4,null,4,null,null,null,6,3,null,null,null,6,3,4,null,4,4,null,4,null,null,null,4,null,null,4,6,null,4,3,4,null,null,3,3,null,null,6,null,null,null,null,null,9,5,null,null,null,5,null,null,null,4,4,null,null,null,null,8,null,null,null,null,null,null,null,null,null,null,4,null,null,5,null,null,null,null,null,null,null,null,null,3,null,null,null,null,4,4,3,4,null,5,5,4,null,null,null,7,null,null,null,6,null,null,null,null,null,7,3,null,null,null,null,null,null,3,null,null,null,null,null,null,null,null,null,3,null,5,3,null,null,null,null,null,null,4,null,5,null,null,null,null,null,null,null,null,null,null,2,5,null,null,null,null,null,8,null,5,6,null,4,null,5,8,null,null,null,null,null,null,null,null,null,6,null,4,null,null,null,null,null,null,null,null,null,null,5,null,3,null,null,null,null,5,null,null,null,null,null,null,null,null,null,5,null,null,null,null,4,null,4,6,null,4,null,null,null,null,null,3,5,2,null,null,5,null,null,null,null,null,3,null,4,null,null,null,null,null,null,4,null,null,null,null,null,null,null,4,null,null,5,null,null,6,null,null,3,null,4,4,null,null,null,null,null,5,8,null,null,null,null,null,4,null,7,null,null,null,6,5,null,null,null,3,null,5,null,null,null,null,null,null,null,null,null,null,null,5,4,null,2,null,4,null,5,null,4,3,null,3,null,null,4,4,null,null,5,5,6,null,null,null,3,null,null,3,null,null,3,null,null,3,4,6,null,5,null,null,null,null,null,null,null,4,3,null,null,null,null,4,null,null,null,null,null,null,null,3,null,null,4,null,null,3,null,null,null,null,2,3,null,3,null,null,null,5,6,null,null,6,null,6,null,4,3,null,null,null,null,null,null,3,null,null,null,null,null,2,null,null,null,2,null,null,null,null,3,4,4,null,null,null,null,4,null,6,5,null,3,null,2,null,null,null,4,2,null,null,null,4,null,null,null,null,2,null,null,null,null,6,3,null,null,null,null,null,null,null,null,null,3,4,null,null,null,null,null,null,null,null,4,5,3,null,null,3,null,null,null,null,null,null,null,4,null,null,null,null,null,null,null,null,5,null,null,null,null,3,null,null,null,3,null,null,null,4,null,null,null,null,null,3,null,null,null,5,null,5,3,null,null,7,null,null,null,null,null,null,null,null,null,null,null,null,null,null,null,null,4,null,null,null,null,null,null,5,null,null,4,null,null,null,5,3,null,4,null,null,8,null,null,null,null,null,null,null,2,4,null,null,3,4,null,null,5,2,4,null,null,6,4]
[null,"Dobrkovská Lhotka",null,4,null,5,5,null,3,6,null,null,4,null,null,4,null,null,null,null,5,null,null,3,null,null,null,null,null,null,null,null,null,null,null,null,null,null,null,null,5,6,null,4,7,null,7,null,null,null,null,null,null,4,6,7,4,null,5,4,null,null,null,4,null,null,null,4,4,8,null,null,4,null,null,null,null,4,null,null,null,null,null,4,null,null,6,null,null,null,null,null,5,null,null,5,null,5,6,7,null,3,null,6,null,null,null,null,null,null,null,null,7,null,null,null,null,4,null,4,5,null,null,null,null,5,null,null,6,null,null,null,null,null,null,null,4,null,null,null,7,null,null,4,null,null,null,3,null,null,null,null,null,4,null,null,null,null,null,null,null,6,null,null,6,null,null,null,null,4,null,null,null,null,null,5,null,5,null,null,null,null,5,null,4,null,null,3,null,null,null,8,null,4,null,null,6,null,null,null,5,null,null,null,4,null,null,null,null,null,null,null,null,6,null,null,null,8,null,null,null,null,null,5,null,null,null,null,4,null,null,null,8,null,null,null,null,null,null,3,null,null,4,null,6,null,6,null,null,4,null,4,null,null,null,null,4,3,5,null,null,null,null,4,null,null,7,null,5,null,null,null,4,null,null,null,null,3,null,null,null,6,null,null,null,null,null,null,null,null,null,null,3,null,null,null,null,null,7,null,null,6,4,null,null,null,null,null,null,null,null,5,null,null,null,null,null,null,null,null,null,null,null,null,4,null,3,4,null,null,6,null,null,null,null,null,null,7,null,null,null,null,null,null,null,null,null,null,null,5,null,null,6,null,null,4,null,null,3,null,4,5,null,null,null,null,5,null,5,6,null,null,null,null,null,null,6,null,null,5,3,null,6,null,null,null,7,3,null,null,null,null,4,5,null,null,null,7,3,5,null,null,null,null,null,null,6,5,null,null,null,9,null,null,null,null,5,4,null,null,null,null,null,5,null,null,5,4,5,4,8,null,8,null,null,null,null,null,null,null,null,6,null,4,null,5,6,null,null,null,null,null,null,null,null,null,null,4,5,null,null,null,null,null,6,null,5,null,null,null,null,null,4,null,null,null,4,null,5,null,null,null,null,null,null,null,null,null,null,null,null,null,null,null,null,null,null,10,null,6,null,6,5,null,null,null,null,7,null,4,4,null,null,5,null,null,5,4,null,null,null,4,5,null,null,null,7,null,7,null,null,null,null,null,null,4,null,3,null,null,null,null,null,null,null,null,4,4,null,null,null,null,null,null,null,null,3,null,4,6,null,5,null,6,null,null,3,null,null,null,3,null,6,6,null,3,null,null,null,null,5,null,null,4,null,null,null,null,null,6,null,null,null,null,null,null,null,null,4,null,null,null,5,2,null,null,null,6,null,6,null,null,5,null,null,5,null,null,null,null,null,null,null,null,null,null,9,6,4,4,null,4,null,5,2,null,null,null,null,8,5,null,null,null,null,null,null,6,null,null,3,null,null,null,null,null,null,5,null,null,null,3,null,null,null,5,null,null,null,6,null,null,4,null,null,null,null,6,null,null,null,null,5,null,null,null,5,null,4,null,null,null,null,null,null,null,null,6,null,null,null,null,3,null,null,null,null,null,null,6,null,null,null,null,null,null,3,null,null,null,null,5,5,null,null,null,null,4,4,null,null,null,null,5,null,null,4,3,4,null,null,null,3,null,7,null,4,4,null,null,null,null,5,null,null,null,null,7,4,5,null,5,6,null,null,null,null,null,null,null,6,null,null,null,null,null,null,null,null,null,null,5,null,null,null,null,null,null,null,null,4,null,null,4,null,4,null,null,null,null,4,5,null,null,null,3,null,5,8,null,null,null,null,null,null,5,5,4,null,7,3,null,null,null,null,null,null,null,null,null,null,null,null,4,null,null,null,4,5,null,null,null,null,null,null,null,null,null,null,4,null,null,null,5,null,null,null,null,null,null,null,null,null,null,3,null,null,null,null,null,null,7,null,null,null,null,null,null,null,null,6,null,null,null,null,null,null,null,null,4,null,null,null,null,null,5,null,null,null,5,null,4,null,null,null,5,5,null,null,null,null,4,null,null,null,3,null,4,null,null,2,null,null,null,4,null,null,null,null,null,null,4,null,4,6,null,null,null,null,null,null,null,null,4,null,null,5,null,null,null,5,4,null,null,null,5,5,5,null,5,3,7,6,null,null,null,null,null,null,null,null,null,null,null,null,9,null,null,null,null,null,6,null,3,null,null,null,4,null,null,null,null,3,5,null,null,null,6,null,6]
[null,"Dolní Lhotka",null,5,null,null,null,null,4,7,null,null,null,4,3,null,4,null,null,null,null,null,null,null,null,6,null,null,null,null,null,null,null,7,null,2,null,null,null,3,6,null,null,null,null,null,null,null,null,null,null,3,null,null,null,null,null,null,6,null,null,null,6,null,5,null,null,null,null,9,4,4,null,null,null,null,7,null,6,null,null,null,null,5,null,5,null,null,null,null,null,null,null,null,6,null,null,6,7,null,null,null,4,null,null,4,null,null,null,null,7,null,null,4,null,null,null,5,null,null,null,4,null,null,null,null,5,null,null,null,3,null,null,null,null,null,5,null,3,null,null,4,6,null,null,2,null,null,5,4,null,4,null,null,5,null,6,null,3,5,null,null,null,5,null,null,6,null,null,5,4,null,5,4,5,null,null,null,null,null,5,null,6,4,5,null,null,null,null,4,null,9,null,null,8,null,7,null,7,6,6,8,null,null,5,4,4,3,null,null,null,null,7,null,null,5,null,null,null,null,null,null,null,null,null,4,null,4,5,null,null,7,null,null,4,6,null,5,null,4,5,null,null,null,7,null,7,null,null,5,null,5,7,null,null,null,null,null,null,null,null,null,null,null,null,6,null,null,null,null,null,null,null,null,4,null,3,4,null,null,null,null,null,null,null,null,null,null,null,null,4,7,4,null,null,null,null,5,null,null,null,null,null,null,null,null,null,null,null,null,null,null,null,4,null,null,null,null,null,null,null,4,4,null,null,6,null,null,null,null,null,null,3,null,null,5,null,null,5,null,7,null,5,null,null,null,5,3,null,null,null,5,null,null,null,5,6,null,null,null,5,null,5,null,null,null,null,null,6,null,null,null,null,null,6,7,null,null,null,null,null,null,null,4,6,null,8,4,null,null,null,null,null,null,null,8,null,null,null,null,5,null,5,null,null,6,null,null,4,null,null,null,null,null,null,null,null,null,6,null,null,4,null,null,5,null,null,null,null,5,9,null,null,null,null,5,5,null,4,5,null,null,6,null,null,null,null,5,null,null,3,null,null,4,null,null,null,null,null,null,null,4,null,7,null,6,null,null,null,null,7,null,null,null,null,null,5,null,6,null,null,4,null,4,9,null,null,null,null,null,null,7,5,null,5,null,null,null,null,null,null,null,null,null,4,null,null,8,null,null,5,null,6,null,null,null,null,5,null,null,null,5,null,null,8,5,null,null,null,3,null,null,null,null,9,null,5,null,null,null,3,5,null,null,6,null,5,5,4,null,3,null,null,null,6,null,null,null,null,null,null,null,null,7,null,5,null,null,null,null,null,null,null,null,null,null,null,4,null,null,6,7,null,null,null,null,null,5,null,null,null,null,6,null,null,4,null,null,null,null,null,null,null,null,null,4,null,null,null,7,null,null,null,null,7,null,null,null,2,6,6,null,null,4,5,null,null,null,null,null,null,5,null,null,null,null,null,null,null,null,null,null,null,null,null,null,null,7,null,null,4,null,null,null,null,null,null,null,null,null,3,null,null,6,null,null,5,null,null,7,null,null,null,5,null,4,null,null,4,null,null,null,null,null,null,5,null,null,null,null,null,null,null,null,3,null,null,null,null,5,null,null,null,null,null,null,6,null,null,null,null,null,null,4,null,null,4,null,null,4,null,6,6,null,null,null,5,null,5,null,3,null,null,null,5,6,null,4,null,null,null,null,null,null,null,null,null,null,3,4,4,null,null,null,null,null,null,null,null,6,null,null,null,null,null,null,null,null,4,4,null,4,null,null,null,null,5,null,null,3,4,6,null,null,5,null,null,null,null,null,5,4,null,null,null,null,4,4,null,null,null,6,null,null,4,null,null,null,9,7,5,null,null,null,7,null,6,null,null,null,null,null,3,null,null,null,null,null,4,null,5,3,3,null,null,null,5,null,6,null,null,null,7,null,null,null,4,3,3,null,7,null,null,null,null,4,null,null,3,null,null,4,null,4,null,null,null,null,7,null,5,null,null,null,5,2,null,4,null,null,null,null,null,null,null,null,5,null,null,null,null,null,null,3,null,6,null,5,null,null,6,null,3,5,5,null,null,null,null,null,6,5,null,4,null,null,6,null,null,null,null,null,5,null,null,null,null,5,4,null,9,null,null,null,null,4,7,null,null,null,4,null,null,null,6,null,null,null,null,null,null,null,null,null,null,6,null,null,4,null,null,null,null,null,null,5,null,null,null,null,4,null,5,null,null,10,null,null,null,null,null,7,null,null,null,null,null,null,null,null,4,7,null,null,null,null,7]
[null,"Záluží",null,6,3,null,null,null,null,null,null,null,null,5,null,null,null,null,null,null,6,null,null,4,4,null,5,null,null,null,5,null,null,null,null,null,null,5,5,null,null,null,null,5,null,null,null,null,null,6,3,null,null,5,null,8,null,null,null,null,null,4,null,5,6,null,null,null,null,null,5,5,5,null,5,4,null,null,null,4,6,null,null,null,7,null,null,null,3,null,null,3,6,null,null,null,8,null,null,null,null,4,null,7,null,null,null,null,null,null,null,3,null,null,6,null,5,null,null,5,null,null,null,null,null,null,6,null,null,null,null,null,5,null,null,null,null,null,null,null,8,null,null,null,null,3,6,4,null,null,null,5,7,null,null,4,null,null,4,null,null,null,null,null,null,4,null,null,null,null,5,5,null,null,null,null,null,6,null,null,null,null,null,5,null,4,null,4,null,5,4,null,null,null,null,null,null,null,8,null,null,null,null,null,null,null,null,null,null,null,null,null,null,null,null,null,null,null,null,null,null,7,null,null,null,5,null,null,null,5,null,null,null,3,null,7,null,null,null,null,6,3,null,null,null,3,8,null,null,null,null,6,null,null,4,3,null,4,null,null,5,null,5,5,null,null,null,null,6,5,3,7,null,null,null,null,null,null,4,null,5,7,null,null,null,6,null,null,null,null,5,null,null,null,null,4,7,null,null,null,5,null,null,null,null,5,null,null,null,null,null,null,null,null,null,null,8,8,null,null,6,null,null,null,5,null,4,5,4,null,null,5,4,null,7,null,null,null,6,null,null,null,6,null,4,null,null,null,null,6,6,null,null,null,null,6,null,null,4,null,null,null,null,null,null,4,6,null,null,null,null,3,6,null,7,8,null,5,4,null,null,null,null,null,null,null,null,null,5,null,null,null,null,6,null,9,null,8,null,null,null,null,6,null,null,null,null,6,null,null,null,null,4,null,null,null,null,5,null,null,null,5,null,null,null,3,null,null,null,null,null,null,null,4,6,null,null,7,null,null,4,null,null,null,null,null,null,null,null,null,4,null,null,null,null,4,null,5,6,4,4,null,null,null,null,null,null,null,null,null,8,null,5,null,null,5,null,null,null,null,null,null,null,null,null,4,5,5,7,null,null,null,6,4,null,null,3,null,null,7,null,7,null,null,null,null,null,null,4,null,6,null,null,null,null,null,null,6,null,null,null,null,null,null,null,null,null,null,null,4,5,6,null,null,10,null,6,null,3,null,4,null,4,null,null,null,6,null,5,null,4,null,null,null,null,null,4,null,null,7,null,6,6,8,null,null,null,4,6,null,null,null,null,null,null,4,null,null,null,null,null,null,null,null,null,7,5,null,null,null,null,null,null,null,null,null,4,null,5,null,null,null,null,3,null,null,null,7,null,null,null,null,6,null,null,null,null,6,3,null,null,null,null,null,null,6,null,null,null,null,null,6,null,null,null,6,null,null,null,null,null,null,5,null,null,4,4,null,4,null,null,null,6,null,null,null,null,6,3,null,null,null,5,null,null,null,null,null,5,null,null,4,null,6,null,null,null,7,null,6,7,3,null,5,null,null,null,null,null,null,null,3,null,9,null,null,5,null,3,null,5,null,4,null,null,7,null,null,null,7,null,6,null,null,null,5,null,5,null,null,null,7,7,null,null,null,null,5,6,null,null,null,null,null,null,null,null,5,null,null,null,null,null,null,null,7,5,5,null,null,null,null,6,null,3,null,7,8,null,null,null,null,null,null,null,null,4,null,null,null,null,5,null,null,4,null,null,5,null,null,5,null,4,5,null,null,null,null,5,null,null,null,5,null,null,null,null,null,null,5,null,7,null,7,null,null,null,null,null,8,6,5,null,4,null,null,null,5,null,8,4,null,4,5,null,null,null,null,5,5,null,4,null,5,null,null,6,null,null,null,5,null,null,null,4,4,null,null,4,null,8,null,null,6,null,5,5,null,null,null,null,null,null,null,null,null,7,4,8,null,null,null,null,null,null,3,null,null,null,5,null,5,5,null,6,3,6,5,null,5,3,3,4,4,4,null,5,null,8,null,7,5,null,null,null,null,null,4,3,null,null,null,null,5,4,null,null,5,null,null,null,null,null,4,null,5,null,6,null,null,null,null,null,5,null,null,null,null,null,null,null,4,6,null,null,5,null,null,null,6,null,5,null,null,null,null,null,null,5,null,4,null,null,null,null,null,null,null,null,6,null,7,null,null,null,null,null,null,null,null,5,null,null,4,null,null,null,null,5,null,null,8,null,null,null,null,null,null,null,7]
[null,"Slavče",null,null,null,null,4,8,null,5,null,null,null,null,null,null,null,null,null,null,null,4,null,null,3,null,null,null,null,4,4,null,4,null,null,null,null,4,null,null,null,null,5,null,6,3,6,null,null,5,2,null,null,null,5,6,null,null,null,null,null,3,null,null,null,null,null,null,null,7,null,null,null,null,4,null,null,null,null,null,5,null,null,3,6,null,null,null,null,4,4,null,null,4,5,null,null,null,null,6,3,2,null,5,null,3,5,null,4,null,6,2,null,null,null,null,null,null,null,null,4,null,null,null,null,null,null,5,5,null,null,4,4,4,null,4,3,null,null,3,6,null,null,null,null,null,5,null,null,null,null,null,null,null,null,null,null,null,2,null,null,5,null,null,null,null,5,null,null,null,null,null,null,null,null,null,5,4,null,null,null,null,null,null,null,null,null,null,null,3,null,7,null,null,null,null,5,null,6,null,null,null,null,6,null,null,null,null,4,6,null,null,6,null,null,null,5,null,4,null,4,6,6,null,null,null,5,null,null,null,3,6,7,null,null,5,4,null,null,null,null,null,null,null,null,null,null,null,null,null,5,null,null,null,null,null,null,null,null,null,null,null,4,null,null,null,null,null,4,4,2,6,null,null,null,null,null,null,null,null,4,null,null,3,5,null,5,null,4,6,null,6,null,5,null,null,null,null,null,null,null,5,null,null,null,null,null,null,3,null,4,null,null,null,3,null,7,null,4,null,5,null,null,5,null,null,null,null,3,null,null,null,null,null,null,4,null,null,null,null,null,5,null,null,null,null,null,null,null,null,5,null,5,3,null,null,5,5,null,null,null,null,null,null,3,null,null,4,4,5,null,null,5,5,null,6,null,null,3,4,null,null,5,null,null,null,6,null,null,null,5,6,null,null,3,null,null,null,null,4,null,5,null,null,null,null,5,4,null,null,null,8,null,4,null,null,null,null,5,5,null,null,null,4,null,null,null,3,null,null,7,6,7,null,5,null,null,null,null,null,null,5,5,null,null,null,null,null,5,null,null,null,null,null,null,null,null,null,null,null,null,null,5,null,null,null,4,4,null,10,6,4,3,null,null,null,null,null,null,null,5,null,5,null,null,null,4,null,null,null,null,6,null,3,null,null,null,null,null,null,5,null,null,null,null,6,null,6,null,null,null,null,null,null,null,null,null,null,6,null,5,3,null,null,null,null,6,null,null,null,null,null,6,null,8,null,null,null,null,null,null,null,null,null,null,null,3,null,null,3,null,null,null,null,null,null,null,5,3,5,null,4,5,null,null,null,null,3,5,null,2,null,null,null,null,null,6,null,5,5,null,null,null,null,null,null,4,null,5,null,null,null,5,null,null,null,null,null,null,null,null,null,null,null,null,null,4,null,null,5,4,5,null,null,null,4,null,5,null,null,null,null,null,null,null,5,8,null,null,null,null,3,null,4,null,5,null,null,null,7,null,5,null,null,null,null,null,null,3,null,null,null,null,null,null,null,null,4,null,null,2,null,null,5,3,null,null,3,null,null,null,3,null,null,null,null,5,null,null,null,null,null,null,4,null,null,null,7,null,null,null,2,6,null,null,null,null,null,null,null,null,null,null,null,4,null,null,null,null,null,null,null,null,null,5,null,null,null,6,3,null,null,4,null,null,null,null,3,null,null,null,6,null,null,4,null,null,null,null,null,null,5,2,null,6,null,3,3,null,null,null,null,4,null,null,4,6,null,null,null,null,4,null,null,null,null,null,null,null,null,5,null,5,null,null,null,null,null,null,null,null,null,3,null,4,5,null,null,null,null,null,null,null,3,null,3,null,null,4,null,null,null,null,null,null,null,null,null,7,null,null,4,null,null,null,null,null,null,null,null,null,null,null,4,null,null,4,null,3,null,null,null,null,null,null,null,4,3,4,null,null,null,null,null,null,null,3,null,null,null,null,5,null,4,null,null,null,5,null,null,null,3,null,null,null,4,null,null,6,null,4,6,null,null,null,null,null,null,null,null,5,null,null,null,null,null,null,null,6,null,2,null,null,null,null,null,null,null,7,4,5,null,null,4,null,4,null,null,2,6,null,null,null,3,null,null,null,3,null,null,null,3,null,null,null,4,null,null,null,3,null,3,null,null,null,null,null,null,null,null,null,null,5,3,5,4,4,null,5,5,4,null,null,null,null,null,null,4,3,4,null,6,null,null,null,null,null,null,null,null,null,null,null,null,5,null,null,5,null,null,null,5,null,null,5,3,null,null,null,null,3,6,null,null,null,4,null,5,null,5,null,5]
[null,"Lniště",null,null,null,null,3,6,null,null,null,null,3,null,null,null,3,null,null,null,null,null,null,null,null,4,4,null,null,3,null,null,3,null,null,null,4,null,null,2,4,5,4,null,null,null,null,3,null,null,null,null,4,null,null,5,null,null,null,3,null,2,null,2,3,null,null,null,null,null,null,null,null,null,null,null,6,null,null,null,null,4,4,null,null,null,null,null,null,null,null,null,null,null,null,null,null,null,null,5,null,null,null,null,null,null,null,null,3,null,5,null,null,3,null,null,null,null,null,null,null,3,null,null,null,null,null,null,null,null,null,null,null,null,5,null,null,4,null,null,null,null,null,null,null,null,4,null,null,3,null,null,null,null,null,null,4,null,null,null,4,null,null,null,null,3,null,null,3,3,null,null,null,null,null,4,null,null,5,null,null,null,null,3,null,null,5,null,7,null,3,6,null,null,6,null,3,4,null,null,null,null,6,null,null,null,3,null,null,5,null,null,null,5,null,null,null,null,null,null,null,null,5,3,null,null,null,null,null,null,null,null,5,null,null,4,null,null,5,null,null,null,null,5,5,null,null,null,null,3,null,null,null,5,null,null,null,null,4,null,4,6,null,3,null,null,null,null,null,null,null,null,null,null,null,null,null,null,null,4,null,4,null,null,null,5,null,5,null,null,null,5,null,null,null,3,null,4,null,5,4,4,null,null,3,null,3,null,null,null,null,null,null,null,null,null,null,null,null,5,3,null,null,null,null,5,null,null,null,null,null,4,null,null,6,null,4,5,null,4,6,null,null,null,null,null,3,null,null,null,4,null,3,null,3,null,null,4,null,null,3,null,null,null,null,null,null,null,null,null,null,null,null,4,5,5,null,null,null,null,null,2,null,null,null,null,4,2,4,8,null,null,null,null,null,6,null,null,null,null,null,4,null,null,null,5,null,null,null,7,5,6,null,null,6,3,null,null,null,null,null,null,null,null,null,null,3,null,null,3,null,null,5,null,null,null,null,null,null,3,3,null,null,null,3,4,5,4,null,5,null,3,5,null,null,null,null,3,4,null,2,null,null,5,null,5,null,null,null,8,null,null,null,null,null,null,null,6,null,null,null,null,4,3,7,null,null,null,null,null,null,null,null,null,4,null,null,9,null,5,null,5,null,null,null,null,null,5,2,null,null,null,null,null,null,null,null,3,4,4,null,null,null,null,null,4,5,4,null,null,null,5,null,4,6,null,null,2,null,4,null,4,null,3,5,null,null,null,null,null,2,4,null,null,null,null,null,4,null,null,3,null,3,null,null,null,null,null,null,null,null,null,null,5,null,null,null,null,null,null,null,6,null,3,null,null,null,null,null,null,7,null,null,null,null,null,null,6,null,null,5,5,null,null,4,null,null,5,null,4,null,null,4,4,null,null,null,null,null,null,4,null,null,null,null,null,null,null,null,3,4,2,7,null,null,null,null,null,null,null,3,null,null,3,null,3,null,4,null,3,null,null,5,null,null,4,null,null,null,null,null,null,4,null,null,4,null,null,4,5,null,null,null,null,3,null,null,null,null,5,5,null,null,null,null,null,null,null,null,5,null,null,null,7,null,null,null,5,null,3,null,6,null,6,null,5,4,null,null,5,null,5,null,null,null,null,null,null,null,null,null,null,null,null,null,null,4,null,null,null,2,null,null,null,null,5,null,null,null,null,null,null,null,null,null,5,null,2,null,null,null,null,null,6,null,null,5,null,null,null,null,null,null,5,null,3,null,4,null,null,null,null,null,null,null,null,3,null,null,null,null,null,null,null,null,null,6,3,4,5,null,null,null,null,null,null,null,null,null,null,null,4,null,5,null,null,null,4,null,null,null,null,8,null,null,4,4,null,null,6,2,5,null,3,null,7,null,null,null,null,null,null,2,2,null,null,3,null,null,null,null,5,null,null,null,null,null,null,null,3,null,null,null,3,null,null,null,null,null,null,null,null,3,null,null,3,null,null,5,2,null,null,null,null,4,null,null,null,3,null,null,null,null,null,5,null,null,3,null,2,null,null,null,2,null,null,null,null,6,null,null,null,null,null,4,null,null,null,null,null,null,null,6,null,null,null,null,null,null,null,null,null,null,null,null,null,null,null,null,null,8,null,4,null,4,null,6,null,6,null,null,null,null,null,null,3,null,4,null,4,null,null,null,null,null,null,null,null,null,null,null,null,null,null,null,null,null,null,null,4,null,null,null,5,4,null,null,null,4,null,null,4,2,null,null,null,null,null,3]
[null,"Chvalkov",null,null,4,null,null,9,null,null,null,3,5,null,null,null,null,null,null,null,null,null,null,null,5,null,6,null,null,null,null,3,null,null,null,3,null,null,null,null,null,null,6,null,null,null,null,null,4,7,null,4,null,null,null,null,null,null,null,null,4,5,7,6,null,4,null,null,null,null,null,6,6,null,null,5,null,null,null,null,null,null,5,6,null,null,null,null,null,null,null,null,null,null,null,null,null,7,null,null,null,null,null,null,null,null,null,null,null,null,8,null,8,null,null,4,null,6,null,null,null,null,null,null,null,6,null,null,null,null,4,null,6,5,null,null,null,null,null,4,9,null,null,5,null,4,null,null,null,5,null,6,null,null,6,5,null,null,5,null,null,null,4,null,null,null,7,null,4,null,null,null,null,null,6,6,6,7,6,4,6,null,null,null,null,5,6,null,null,null,5,10,null,null,null,null,null,null,null,null,null,null,null,null,6,null,null,null,null,null,5,3,8,null,null,null,null,9,5,null,null,null,7,6,null,null,null,null,6,6,4,8,null,null,null,8,5,6,null,5,7,4,null,null,8,null,null,null,null,null,6,null,null,null,null,4,null,null,6,8,6,null,null,null,3,null,null,5,null,null,null,null,5,6,null,5,null,null,null,5,6,null,7,4,6,null,null,null,5,null,null,null,null,null,null,null,null,null,null,null,6,null,5,null,5,6,4,null,null,null,null,null,null,null,null,null,9,null,null,null,null,null,5,null,6,7,null,null,5,4,null,null,null,null,null,null,6,8,7,null,null,null,null,null,null,null,6,null,6,7,null,null,null,4,null,null,7,null,null,3,null,6,null,null,4,null,7,null,null,null,null,null,7,null,null,null,null,6,5,null,null,3,null,5,null,null,null,null,null,null,null,null,null,null,null,10,4,null,4,6,6,null,null,null,null,null,null,null,null,9,7,null,null,null,null,null,6,6,7,null,4,null,4,6,null,null,null,null,null,null,null,null,9,null,null,null,6,null,5,null,null,null,null,null,null,null,null,null,6,6,null,null,null,null,null,null,null,null,null,null,null,null,6,null,7,null,null,null,3,null,null,5,null,null,6,null,null,null,null,null,null,null,null,null,null,null,6,null,null,null,null,null,null,null,null,null,4,null,null,null,null,null,null,null,5,null,null,null,null,null,null,null,null,6,null,null,null,null,null,null,null,6,6,null,9,null,null,null,8,null,null,null,null,null,null,null,7,null,4,null,null,null,null,4,null,null,null,null,null,null,null,null,null,null,null,null,null,null,null,null,null,null,null,null,null,6,null,5,null,null,null,null,7,null,null,null,null,5,6,null,null,null,null,null,6,8,null,6,null,7,null,null,null,null,4,null,null,null,6,null,null,null,null,null,null,null,null,8,null,null,null,6,null,null,null,null,null,null,4,null,null,null,null,null,null,null,null,7,null,null,6,null,8,null,3,7,4,null,null,null,null,null,6,4,null,null,null,8,null,null,null,null,null,6,null,null,null,null,null,null,null,null,null,null,null,6,null,4,null,null,null,null,null,null,null,5,null,null,null,null,8,null,null,null,null,6,null,null,5,null,5,null,7,null,4,null,null,null,null,null,6,null,5,7,5,null,7,null,3,null,null,null,6,null,null,null,null,null,7,null,3,8,8,null,null,null,null,null,7,null,null,null,null,6,6,null,5,null,5,null,null,null,null,null,null,null,null,null,4,null,5,null,7,null,null,null,8,null,null,null,null,null,null,null,4,null,null,5,null,null,null,null,6,null,null,null,null,null,null,null,null,null,null,null,null,null,null,null,null,null,null,5,6,5,null,null,null,5,null,6,null,null,null,8,null,4,null,null,10,null,7,null,null,null,null,6,null,6,4,null,null,null,null,6,null,8,null,3,null,null,null,5,null,6,null,null,null,null,null,6,null,6,null,null,null,null,null,null,null,null,null,null,null,null,null,6,null,null,4,null,null,5,4,null,4,5,null,null,null,3,null,null,null,null,null,null,null,null,5,6,null,6,null,5,null,4,null,null,null,null,null,null,null,null,null,null,null,null,9,6,null,null,null,null,null,null,null,null,null,null,null,null,7,null,null,4,null,null,4,3,null,null,null,null,null,6,4,null,null,null,null,null,null,null,null,null,null,null,8,5,null,null,null,null,null,6,6,null,6,null,null,null,null,null,4,7,null,6,null,null,null,null,7,null,4,6,null,5,null,null,null,null,null,6,null,null,null,null,null,null,null,8,3,null,null,null,5,null,null,null,null,null,null,null,4,null,null,null,4,null,null,6]
[null,"Čížkrajice",4,7,5,null,null,null,null,null,null,4,6,null,4,null,5,4,null,4,null,null,null,null,6,null,null,null,null,null,null,null,5,null,null,null,5,null,null,4,null,null,7,null,8,4,null,null,5,8,null,5,null,6,null,null,5,null,null,5,null,null,8,7,null,null,null,5,5,null,6,null,7,null,null,6,null,null,null,null,null,5,null,7,null,null,null,3,null,null,5,4,null,null,null,null,null,null,null,null,4,null,5,null,null,5,6,4,null,null,null,null,null,null,null,null,null,null,null,6,6,null,null,null,null,7,null,null,null,4,null,null,null,null,null,5,null,null,4,null,null,null,7,null,4,5,7,null,null,null,null,null,null,5,null,6,7,5,null,6,null,null,5,6,7,5,null,null,null,6,null,6,6,null,null,null,null,null,null,null,7,5,null,null,null,null,7,null,null,null,null,11,null,null,9,null,null,null,9,7,null,null,null,null,7,5,5,null,5,7,null,null,null,null,null,6,null,10,null,5,5,null,null,null,null,null,null,null,7,null,5,null,null,4,null,null,6,null,7,null,null,null,null,null,null,null,null,null,null,null,null,7,null,null,null,null,null,null,null,null,7,null,6,null,4,null,8,null,null,6,4,null,null,7,null,6,null,null,null,null,null,null,8,5,7,null,null,null,null,7,null,null,null,null,null,5,null,6,null,6,null,null,6,null,null,null,5,null,null,4,null,null,null,null,4,null,null,null,null,null,null,5,6,null,null,8,5,null,null,5,null,null,null,4,null,null,null,null,null,null,null,6,7,6,null,null,null,4,null,8,null,null,null,5,null,null,null,null,null,4,6,null,null,null,5,null,8,5,null,null,4,4,8,null,null,null,null,null,6,null,4,4,7,null,7,null,null,null,null,null,6,null,null,null,null,null,null,null,null,null,null,6,null,null,3,null,7,7,null,null,null,null,null,null,null,4,null,null,8,null,null,6,null,null,6,null,null,null,6,null,null,null,null,null,null,null,null,8,null,null,null,null,null,null,5,null,null,null,null,null,5,null,null,null,null,null,5,null,null,null,null,5,null,null,null,null,null,null,null,11,null,null,null,null,7,null,null,null,null,null,6,5,null,null,null,null,7,null,8,5,null,null,null,null,6,null,null,null,null,8,6,8,null,4,null,7,null,null,5,null,7,null,null,null,null,4,6,null,null,null,6,null,7,6,null,null,null,null,null,5,null,7,null,5,null,5,8,4,null,5,null,null,5,null,null,null,null,null,6,null,null,null,4,5,null,null,5,null,5,8,null,7,7,null,6,7,4,null,null,null,4,4,null,null,null,null,null,null,7,null,null,8,null,null,7,null,null,null,null,null,null,4,null,5,null,null,null,7,null,null,null,null,null,null,null,null,5,null,null,null,null,7,null,null,8,null,null,7,5,7,7,4,null,5,null,null,null,8,5,5,7,null,9,null,null,null,null,5,7,null,6,6,null,null,5,5,5,null,5,4,null,null,null,7,5,5,4,null,null,null,null,4,null,null,4,null,null,5,6,null,5,null,5,null,null,6,null,null,null,null,9,4,null,null,4,null,6,null,null,null,6,4,null,10,null,4,null,null,4,6,7,null,null,null,null,null,null,null,4,null,null,null,null,null,null,null,null,null,null,5,4,null,null,null,6,null,null,null,null,5,null,7,4,null,7,null,null,6,null,null,null,null,4,null,null,null,null,null,null,null,null,6,null,null,4,5,null,null,5,null,7,null,null,null,null,4,null,null,null,null,null,null,null,null,null,null,null,null,4,4,6,null,null,6,null,null,7,5,null,null,null,null,null,null,4,5,5,null,5,7,5,null,6,null,null,null,null,null,11,null,null,null,null,5,null,null,null,null,5,null,5,null,5,7,3,9,null,4,null,6,null,null,4,null,null,null,null,5,null,null,null,null,null,null,null,null,5,4,5,5,9,null,3,null,null,7,null,null,5,5,3,null,null,null,null,null,8,5,null,4,6,8,null,null,null,null,null,null,null,null,null,7,6,null,null,null,null,null,null,6,4,4,5,5,null,null,null,null,null,null,8,null,4,null,null,null,null,null,null,7,7,6,null,6,null,null,null,6,5,null,3,4,null,null,null,null,5,null,null,null,null,null,null,null,7,null,null,null,9,null,null,null,null,null,null,7,7,null,null,null,6,null,5,null,null,null,6,7,null,6,null,null,null,null,null,null,5,6,null,null,null,null,null,7,6,11,null,null,null,null,6,null,4,null,null,null,null,null,null,5,null,9,null,null,null,null,null,null,null,null,null,7]
[null,"Boršíkov",null,null,null,null,null,null,null,null,null,5,7,null,null,null,6,null,6,5,null,5,5,5,7,null,7,null,null,5,null,4,null,null,null,4,null,6,6,null,null,null,null,null,null,5,null,4,null,null,4,null,null,null,7,9,null,null,7,null,null,null,null,null,null,null,null,null,null,null,null,7,null,null,null,7,null,null,null,null,null,null,null,8,null,null,null,4,4,null,null,null,null,null,7,6,null,null,null,null,null,null,null,8,null,null,7,null,5,null,null,4,null,null,null,5,6,null,null,null,null,null,null,null,null,8,null,6,null,5,null,null,null,null,null,null,null,null,null,null,null,null,null,null,5,6,8,null,null,6,null,null,null,null,7,7,null,null,null,null,5,null,null,null,null,null,8,5,null,null,null,null,null,5,null,null,7,null,null,null,null,null,null,6,null,null,null,5,null,6,null,null,null,null,10,6,null,null,null,null,null,9,null,7,8,null,null,4,null,null,null,4,null,null,5,7,6,null,null,6,null,null,8,null,null,null,null,5,null,null,6,null,null,null,null,null,null,null,null,null,null,null,null,null,9,4,null,null,null,null,null,null,8,6,5,null,null,null,null,null,null,null,null,null,5,null,9,null,null,7,5,8,6,8,null,null,4,null,null,null,7,null,null,6,null,null,null,null,null,8,null,null,null,6,4,null,null,null,8,null,null,7,7,null,null,null,null,4,4,null,null,null,null,5,null,5,null,null,null,6,null,null,null,null,null,null,6,null,6,null,7,null,null,null,null,null,null,null,null,null,null,null,null,null,5,null,null,null,null,null,null,null,7,null,null,null,8,null,5,null,null,null,6,5,6,5,null,null,null,null,5,null,null,null,null,null,null,null,7,null,null,null,null,null,null,null,null,5,null,null,null,null,null,null,4,null,null,9,null,null,null,null,null,null,4,null,null,8,null,null,null,null,null,null,null,null,null,7,9,null,null,null,null,null,null,4,6,null,null,null,10,7,null,null,null,null,null,9,6,null,null,7,null,null,null,null,null,null,null,7,null,null,null,null,null,null,null,null,null,null,null,null,null,null,null,7,null,5,4,null,null,6,null,null,8,null,null,null,null,null,null,null,null,null,null,5,null,null,null,6,5,null,null,null,null,null,null,11,null,9,null,null,null,null,null,8,null,null,6,null,null,null,null,null,5,5,null,null,null,null,null,null,null,null,null,null,null,null,null,6,null,null,7,null,null,6,null,null,5,null,5,null,6,null,null,6,null,null,null,4,null,null,null,null,null,4,null,null,null,null,4,null,null,null,null,null,null,null,null,4,5,5,null,null,null,null,7,null,null,6,null,null,9,null,8,9,null,null,null,null,null,null,7,null,5,null,null,8,null,null,null,6,null,4,null,5,6,9,null,8,null,null,null,6,null,6,null,null,null,8,null,null,null,null,null,7,null,null,null,null,null,7,10,6,4,null,5,null,null,9,null,7,null,5,6,6,null,null,null,null,5,6,null,8,null,null,null,null,4,null,4,null,null,7,null,null,null,null,null,null,null,null,null,null,null,null,null,null,5,7,null,null,null,null,5,null,null,null,null,6,null,null,8,null,null,null,6,null,5,null,null,8,null,null,null,null,null,null,null,null,4,null,null,null,null,null,null,6,8,null,null,null,null,null,null,5,6,6,8,null,4,8,null,null,8,7,null,null,null,5,null,6,5,null,null,null,null,6,null,null,null,7,null,null,5,null,null,null,6,null,8,null,7,null,null,null,null,null,null,null,null,6,null,5,null,null,null,6,null,null,null,null,null,null,null,null,null,null,6,null,null,null,null,6,null,6,null,null,6,8,null,8,null,null,5,5,null,null,12,null,null,null,null,6,8,7,7,null,null,null,6,null,6,8,4,null,null,5,null,null,null,null,null,null,null,null,null,null,null,null,null,null,null,null,null,null,null,5,null,null,null,6,4,null,5,8,null,null,null,null,4,6,null,null,null,null,null,6,null,null,null,null,null,null,null,4,5,null,6,null,7,8,null,null,7,null,null,null,7,7,null,null,6,null,null,null,6,null,10,7,null,null,null,null,6,null,6,5,4,null,8,7,null,null,null,5,null,null,6,4,4,null,null,null,null,null,null,null,null,4,10,null,null,6,8,null,null,5,null,null,null,null,null,5,7,8,8,null,null,null,null,6,6,null,5,8,null,null,6,7,null,null,null,5,5,null,null,7,4,null,5,null,6,null,null,null,null,null,null,4,null,null,null,null,null,4,6,null,null,6,null,null,4,null,5,5,null,7]
[]
[null,"Vzdálenost [km]",29,30,14,27,25,35,27,28,26,15,19,26,22,28,21,21,28,29,30,31,31,30,28,29,29,21,25,16,16,17,16,27,13,17,29,30,29,19,30,30,32,30,32,22,28,17,19,26,15,26,21,19,30,34,30,25,32,29,30,16,33,18,27,25,24,28,24,26,26,28,29,25,29,29,30,29,27,26,28,23,23,29,28,28,28,13,23,27,29,27,28,28,30,29,30,30,28,30,13,17,27,30,26,26,28,29,20,26,26,15,32,20,28,23,27,30,27,28,19,22,25,25,28,32,27,31,29,27,28,28,23,28,20,30,27,13,26,20,32,25,34,26,21,16,30,17,26,27,25,30,29,18,28,29,26,29,17,29,24,32,28,28,35,17,28,30,21,24,22,26,31,22,29,27,31,27,33,31,29,30,29,20,28,27,22,30,29,27,18,32,25,27,35,30,20,25,29,33,31,32,27,30,26,26,21,26,27,30,24,15,31,28,32,28,30,34,29,30,29,28,33,26,26,29,29,26,28,30,28,34,27,26,27,32,29,30,28,18,27,27,28,28,25,23,32,26,27,20,31,29,34,25,30,27,26,23,31,31,19,26,26,20,22,24,33,30,29,30,14,31,28,29,28,32,29,25,27,30,29,22,32,22,31,28,27,27,29,32,25,29,29,32,23,28,31,28,29,24,24,30,26,25,17,28,16,18,16,29,29,25,25,26,23,30,32,27,30,25,17,26,30,27,31,32,19,23,17,25,32,24,22,31,30,27,23,31,29,26,29,30,32,33,24,27,30,27,31,34,28,30,23,24,14,29,33,26,28,19,21,32,34,31,23,28,33,30,30,30,25,26,31,29,23,28,28,24,24,27,28,14,29,30,30,23,27,19,23,26,26,28,28,29,13,31,30,30,29,29,33,31,26,27,17,29,33,29,27,34,32,31,27,28,28,19,31,28,27,28,24,28,32,30,32,28,24,22,33,26,29,30,35,27,30,28,29,32,27,20,17,31,29,29,19,25,27,27,26,31,26,26,27,28,20,26,30,23,26,22,15,28,29,28,29,36,27,29,21,35,26,27,27,26,29,28,31,30,29,25,29,28,29,28,28,28,27,28,28,29,30,26,29,26,27,20,17,36,20,31,30,30,29,29,28,30,27,32,15,27,28,26,27,31,30,29,24,24,18,27,22,28,28,30,33,27,27,19,34,22,28,31,32,31,33,28,25,17,22,30,19,30,26,23,29,31,25,28,25,24,17,26,25,30,28,23,27,28,28,31,31,25,30,30,30,28,26,27,29,28,16,27,28,25,12,17,30,29,29,28,28,33,32,19,31,34,28,31,28,32,29,28,28,21,28,25,28,31,27,18,22,32,27,18,27,29,25,33,26,29,24,30,31,22,29,27,25,30,16,33,27,29,26,29,27,28,32,30,26,22,29,19,33,28,16,27,27,29,32,29,19,30,30,16,31,21,23,33,14,20,26,31,29,30,31,29,25,28,21,24,17,26,26,33,16,26,28,24,31,29,28,22,29,27,26,27,30,31,33,31,30,22,29,26,21,31,34,30,28,31,28,14,30,36,26,29,30,28,24,23,26,32,28,34,30,29,30,27,23,29,23,29,30,26,27,28,29,29,30,27,15,27,30,28,32,25,28,18,29,30,19,30,31,31,29,31,23,27,27,29,26,30,16,25,28,30,29,19,28,21,29,28,31,27,24,24,32,32,18,26,32,29,35,15,32,20,26,30,27,29,29,26,30,30,28,26,19,29,21,27,25,28,26,29,21,29,33,31,31,20,27,28,30,19,30,16,28,29,29,30,27,27,30,33,28,27,28,26,33,29,29,26,28,27,34,33,27,30,22,31,18,21,26,18,13,33,29,19,16,30,28,29,19,19,21,27,23,22,27,30,24,21,29,21,29,27,20,17,19,28,33,29,13,28,32,28,27,29,26,29,17,17,17,29,23,18,33,26,29,14,32,30,25,23,27,17,29,28,28,28,29,27,30,31,30,27,29,21,31,18,14,27,23,18,28,29,28,30,31,30,29,29,20,28,31,27,33,27,15,30,29,28,33,27,26,27,28,26,22,28,16,28,26,26,29,29,29,26,26,25,35,26,17,31,30,26,31,31,25,31,22,27,30,19,28,17,29,22,32,24,28,26,29,27,29,31,32,28,27,29,23,31,31,19,23,30,29,28,24,30,28,30,30,24,22,35,26,27,21,28,30,33,14,17,28,28,27,18,27,27,25,28,17,27,31,30,29,32,24,33,27,32]
[null,"Počet zastávek",{"$f":"SUM(IF(C4>=1,1,0),IF(C5>=1,1,0),IF(C6>=1,1,0),IF(C7>=1,1,0),IF(C8>=1,1,0),IF(C9>=1,1,0),IF(C10>=1,1,0),IF(C11>=1,1,0),IF(C12>=1,1,0),IF(C13>=1,1,0),IF(C14>=1,1,0),IF(C15>=1,1,0),IF(C16>=1,1,0),IF(C17>=1,1,0),IF(C18>=1,1,0),IF(C19>=1,1,0),IF(C20>=1,1,0),IF(C21>=1,1,0))","v":4},{"$f":"SUM(IF(D4>=1,1,0),IF(D5>=1,1,0),IF(D6>=1,1,0),IF(D7>=1,1,0),IF(D8>=1,1,0),IF(D9>=1,1,0),IF(D10>=1,1,0),IF(D11>=1,1,0),IF(D12>=1,1,0),IF(D13>=1,1,0),IF(D14>=1,1,0),IF(D15>=1,1,0),IF(D16>=1,1,0),IF(D17>=1,1,0),IF(D18>=1,1,0),IF(D19>=1,1,0),IF(D20>=1,1,0),IF(D21>=1,1,0))","v":7},{"$f":"SUM(IF(E4>=1,1,0),IF(E5>=1,1,0),IF(E6>=1,1,0),IF(E7>=1,1,0),IF(E8>=1,1,0),IF(E9>=1,1,0),IF(E10>=1,1,0),IF(E11>=1,1,0),IF(E12>=1,1,0),IF(E13>=1,1,0),IF(E14>=1,1,0),IF(E15>=1,1,0),IF(E16>=1,1,0),IF(E17>=1,1,0),IF(E18>=1,1,0),IF(E19>=1,1,0),IF(E20>=1,1,0),IF(E21>=1,1,0))","v":5},{"$f":"SUM(IF(F4>=1,1,0),IF(F5>=1,1,0),IF(F6>=1,1,0),IF(F7>=1,1,0),IF(F8>=1,1,0),IF(F9>=1,1,0),IF(F10>=1,1,0),IF(F11>=1,1,0),IF(F12>=1,1,0),IF(F13>=1,1,0),IF(F14>=1,1,0),IF(F15>=1,1,0),IF(F16>=1,1,0),IF(F17>=1,1,0),IF(F18>=1,1,0),IF(F19>=1,1,0),IF(F20>=1,1,0),IF(F21>=1,1,0))","v":5},5,9,4,7,5,5,7,5,4,4,6,4,6,5,6,5,5,5,7,6,7,4,4,5,5,4,5,7,4,4,5,6,6,4,6,6,7,5,8,5,7,4,5,8,4,5,4,6,7,9,5,4,7,5,4,5,8,7,6,4,5,5,5,{"$f":"SUM(IF(BR4>=1,1,0),IF(BR5>=1,1,0),IF(BR6>=1,1,0),IF(BR7>=1,1,0),IF(BR8>=1,1,0),IF(BR9>=1,1,0),IF(BR10>=1,1,0),IF(BR11>=1,1,0),IF(BR12>=1,1,0),IF(BR13>=1,1,0),IF(BR14>=1,1,0),IF(BR15>=1,1,0),IF(BR16>=1,1,0),IF(BR17>=1,1,0),IF(BR18>=1,1,0),IF(BR19>=1,1,0),IF(BR20>=1,1,0),IF(BR21>=1,1,0))","v":9},6,7,7,4,5,7,7,4,6,4,6,5,5,8,7,5,6,4,4,4,5,4,6,4,7,6,8,7,7,7,4,4,5,8,4,5,7,4,5,4,8,4,8,4,6,5,6,6,6,6,6,4,4,4,6,8,6,6,6,5,4,4,6,{"$f":"SUM(IF(ED4>=1,1,0),IF(ED5>=1,1,0),IF(ED6>=1,1,0),IF(ED7>=1,1,0),IF(ED8>=1,1,0),IF(ED9>=1,1,0),IF(ED10>=1,1,0),IF(ED11>=1,1,0),IF(ED12>=1,1,0),IF(ED13>=1,1,0),IF(ED14>=1,1,0),IF(ED15>=1,1,0),IF(ED16>=1,1,0),IF(ED17>=1,1,0),IF(ED18>=1,1,0),IF(ED19>=1,1,0),IF(ED20>=1,1,0),IF(ED21>=1,1,0))","v":5},5,5,5,5,4,4,9,4,7,5,5,6,8,4,5,6,4,6,7,5,7,7,7,5,5,6,5,6,5,6,7,5,8,5,4,6,5,6,6,5,6,6,7,7,6,4,7,5,6,6,5,5,7,5,7,6,5,11,4,4,10,6,7,{"$f":"SUM(IF(GP4>=1,1,0),IF(GP5>=1,1,0),IF(GP6>=1,1,0),IF(GP7>=1,1,0),IF(GP8>=1,1,0),IF(GP9>=1,1,0),IF(GP10>=1,1,0),IF(GP11>=1,1,0),IF(GP12>=1,1,0),IF(GP13>=1,1,0),IF(GP14>=1,1,0),IF(GP15>=1,1,0),IF(GP16>=1,1,0),IF(GP17>=1,1,0),IF(GP18>=1,1,0),IF(GP19>=1,1,0),IF(GP20>=1,1,0),IF(GP21>=1,1,0))","v":5},9,7,6,9,6,7,8,5,5,4,5,7,5,4,8,6,5,7,6,10,5,6,5,7,8,6,5,5,5,5,7,6,6,8,8,4,4,8,6,6,7,5,7,4,4,5,9,4,8,4,5,5,6,7,8,6,5,4,4,4,6,8,7,{"$f":"SUM(IF(JB4>=1,1,0),IF(JB5>=1,1,0),IF(JB6>=1,1,0),IF(JB7>=1,1,0),IF(JB8>=1,1,0),IF(JB9>=1,1,0),IF(JB10>=1,1,0),IF(JB11>=1,1,0),IF(JB12>=1,1,0),IF(JB13>=1,1,0),IF(JB14>=1,1,0),IF(JB15>=1,1,0),IF(JB16>=1,1,0),IF(JB17>=1,1,0),IF(JB18>=1,1,0),IF(JB19>=1,1,0),IF(JB20>=1,1,0),IF(JB21>=1,1,0))","v":6},6,5,5,6,9,5,6,7,5,8,6,8,4,6,4,4,4,5,7,7,8,6,7,6,5,5,5,8,5,7,4,6,4,5,7,6,8,6,6,7,7,4,5,6,5,4,4,4,4,5,4,5,4,5,9,8,4,6,6,5,6,5,6,{"$f":"SUM(IF(LN4>=1,1,0),IF(LN5>=1,1,0),IF(LN6>=1,1,0),IF(LN7>=1,1,0),IF(LN8>=1,1,0),IF(LN9>=1,1,0),IF(LN10>=1,1,0),IF(LN11>=1,1,0),IF(LN12>=1,1,0),IF(LN13>=1,1,0),IF(LN14>=1,1,0),IF(LN15>=1,1,0),IF(LN16>=1,1,0),IF(LN17>=1,1,0),IF(LN18>=1,1,0),IF(LN19>=1,1,0),IF(LN20>=1,1,0),IF(LN21>=1,1,0))","v":8},6,5,6,5,7,5,4,4,7,5,6,8,7,4,7,6,7,6,5,6,6,4,6,8,6,5,7,5,4,6,8,5,5,4,6,6,6,5,6,5,8,5,6,6,5,4,8,5,7,8,6,6,7,5,4,4,7,5,7,4,8,5,5,{"$f":"SUM(IF(NZ4>=1,1,0),IF(NZ5>=1,1,0),IF(NZ6>=1,1,0),IF(NZ7>=1,1,0),IF(NZ8>=1,1,0),IF(NZ9>=1,1,0),IF(NZ10>=1,1,0),IF(NZ11>=1,1,0),IF(NZ12>=1,1,0),IF(NZ13>=1,1,0),IF(NZ14>=1,1,0),IF(NZ15>=1,1,0),IF(NZ16>=1,1,0),IF(NZ17>=1,1,0),IF(NZ18>=1,1,0),IF(NZ19>=1,1,0),IF(NZ20>=1,1,0),IF(NZ21>=1,1,0))","v":8},6,6,4,6,4,10,4,9,4,6,6,6,6,5,4,6,7,8,4,9,7,9,4,4,6,4,6,7,9,5,4,6,4,6,6,4,6,4,6,5,10,7,9,4,6,5,6,9,6,5,4,7,6,4,5,5,6,5,6,7,5,4,6,{"$f":"SUM(IF(QL4>=1,1,0),IF(QL5>=1,1,0),IF(QL6>=1,1,0),IF(QL7>=1,1,0),IF(QL8>=1,1,0),IF(QL9>=1,1,0),IF(QL10>=1,1,0),IF(QL11>=1,1,0),IF(QL12>=1,1,0),IF(QL13>=1,1,0),IF(QL14>=1,1,0),IF(QL15>=1,1,0),IF(QL16>=1,1,0),IF(QL17>=1,1,0),IF(QL18>=1,1,0),IF(QL19>=1,1,0),IF(QL20>=1,1,0),IF(QL21>=1,1,0))","v":4},4,4,5,5,6,4,4,5,6,7,7,7,5,5,4,11,8,6,5,4,8,5,5,6,6,4,6,5,5,4,9,5,7,5,8,6,5,7,6,4,6,4,4,11,5,9,6,8,5,4,5,8,6,8,6,4,7,6,6,6,5,5,6,{"$f":"SUM(IF(SX4>=1,1,0),IF(SX5>=1,1,0),IF(SX6>=1,1,0),IF(SX7>=1,1,0),IF(SX8>=1,1,0),IF(SX9>=1,1,0),IF(SX10>=1,1,0),IF(SX11>=1,1,0),IF(SX12>=1,1,0),IF(SX13>=1,1,0),IF(SX14>=1,1,0),IF(SX15>=1,1,0),IF(SX16>=1,1,0),IF(SX17>=1,1,0),IF(SX18>=1,1,0),IF(SX19>=1,1,0),IF(SX20>=1,1,0),IF(SX21>=1,1,0))","v":6},6,5,6,6,7,6,9,5,7,4,8,6,5,7,7,5,10,6,8,4,5,5,5,5,6,4,6,6,6,5,6,4,4,4,4,5,6,4,5,5,5,8,4,7,7,8,6,7,4,5,6,4,5,5,7,6,4,4,7,5,7,6,6,{"$f":"SUM(IF(VJ4>=1,1,0),IF(VJ5>=1,1,0),IF(VJ6>=1,1,0),IF(VJ7>=1,1,0),IF(VJ8>=1,1,0),IF(VJ9>=1,1,0),IF(VJ10>=1,1,0),IF(VJ11>=1,1,0),IF(VJ12>=1,1,0),IF(VJ13>=1,1,0),IF(VJ14>=1,1,0),IF(VJ15>=1,1,0),IF(VJ16>=1,1,0),IF(VJ17>=1,1,0),IF(VJ18>=1,1,0),IF(VJ19>=1,1,0),IF(VJ20>=1,1,0),IF(VJ21>=1,1,0))","v":8},9,4,8,9,5,6,5,7,8,4,7,5,5,4,4,8,6,4,6,6,5,4,4,5,6,9,7,8,4,7,6,6,8,6,4,7,5,8,7,4,4,5,5,7,9,8,5,5,7,7,10,6,4,7,5,5,7,9,6,7,6,5,6,{"$f":"SUM(IF(XV4>=1,1,0),IF(XV5>=1,1,0),IF(XV6>=1,1,0),IF(XV7>=1,1,0),IF(XV8>=1,1,0),IF(XV9>=1,1,0),IF(XV10>=1,1,0),IF(XV11>=1,1,0),IF(XV12>=1,1,0),IF(XV13>=1,1,0),IF(XV14>=1,1,0),IF(XV15>=1,1,0),IF(XV16>=1,1,0),IF(XV17>=1,1,0),IF(XV18>=1,1,0),IF(XV19>=1,1,0),IF(XV20>=1,1,0),IF(XV21>=1,1,0))","v":6},5,8,5,4,5,6,6,8,5,5,4,6,4,4,4,4,5,7,4,6,5,5,6,7,5,4,5,6,4,6,5,7,5,7,9,4,5,5,5,6,6,7,5,6,6,4,8,10,4,4,6,6,5,6,7,8,5,7,5,7,7,5,4,{"$f":"SUM(IF(AAH4>=1,1,0),IF(AAH5>=1,1,0),IF(AAH6>=1,1,0),IF(AAH7>=1,1,0),IF(AAH8>=1,1,0),IF(AAH9>=1,1,0),IF(AAH10>=1,1,0),IF(AAH11>=1,1,0),IF(AAH12>=1,1,0),IF(AAH13>=1,1,0),IF(AAH14>=1,1,0),IF(AAH15>=1,1,0),IF(AAH16>=1,1,0),IF(AAH17>=1,1,0),IF(AAH18>=1,1,0),IF(AAH19>=1,1,0),IF(AAH20>=1,1,0),IF(AAH21>=1,1,0))","v":7},4,6,6,4,5,5,4,6,8,5,4,8,8,5,6,5,6,6,8,5,4,8,4,6,8,7,5,6,5,5,4,6,5,5,7,7,5,6,4,4,5,7,7,6,5,5,8,8,6,6,8,5,7,5,4,4,4,5,4,4,6,6,6,{"$f":"SUM(IF(ACT4>=1,1,0),IF(ACT5>=1,1,0),IF(ACT6>=1,1,0),IF(ACT7>=1,1,0),IF(ACT8>=1,1,0),IF(ACT9>=1,1,0),IF(ACT10>=1,1,0),IF(ACT11>=1,1,0),IF(ACT12>=1,1,0),IF(ACT13>=1,1,0),IF(ACT14>=1,1,0),IF(ACT15>=1,1,0),IF(ACT16>=1,1,0),IF(ACT17>=1,1,0),IF(ACT18>=1,1,0),IF(ACT19>=1,1,0),IF(ACT20>=1,1,0),IF(ACT21>=1,1,0))","v":5},4,4,5,6,4,4,6,6,4,6,5,5,7,5,6,5,5,5,6,6,4,6,5,5,6,8,5,8,6,8,5,5,6,5,12,8,7,5,8,6,8,7,7,6,5,8,6,5,6,8,4,9,4,5,5,6,5,5,4,6,4,4,6,{"$f":"SUM(IF(AFF4>=1,1,0),IF(AFF5>=1,1,0),IF(AFF6>=1,1,0),IF(AFF7>=1,1,0),IF(AFF8>=1,1,0),IF(AFF9>=1,1,0),IF(AFF10>=1,1,0),IF(AFF11>=1,1,0),IF(AFF12>=1,1,0),IF(AFF13>=1,1,0),IF(AFF14>=1,1,0),IF(AFF15>=1,1,0),IF(AFF16>=1,1,0),IF(AFF17>=1,1,0),IF(AFF18>=1,1,0),IF(AFF19>=1,1,0),IF(AFF20>=1,1,0),IF(AFF21>=1,1,0))","v":5},6,6,5,6,7,5,4,4,5,5,5,5,9,6,4,6,5,8,5,5,5,5,4,6,4,4,4,5,8,6,8,4,6,8,4,4,5,4,5,4,6,6,7,8,6,5,7,4,6,5,7,7,4,4,6,5,4,6,6,5,10,7,8,{"$f":"SUM(IF(AHR4>=1,1,0),IF(AHR5>=1,1,0),IF(AHR6>=1,1,0),IF(AHR7>=1,1,0),IF(AHR8>=1,1,0),IF(AHR9>=1,1,0),IF(AHR10>=1,1,0),IF(AHR11>=1,1,0),IF(AHR12>=1,1,0),IF(AHR13>=1,1,0),IF(AHR14>=1,1,0),IF(AHR15>=1,1,0),IF(AHR16>=1,1,0),IF(AHR17>=1,1,0),IF(AHR18>=1,1,0),IF(AHR19>=1,1,0),IF(AHR20>=1,1,0),IF(AHR21>=1,1,0))","v":5},4,5,6,5,6,5,4,7,8,7,7,6,4,5,6,6,6,4,4,4,5,4,4,6,5,6,4,4,10,4,5,6,8,4,7,5,9,5,4,4,6,5,7,8,8,4,6,6,6,6,6,5,5,8,6,7,6,7,4,7,7,5,5,{"$f":"SUM(IF(AKD4>=1,1,0),IF(AKD5>=1,1,0),IF(AKD6>=1,1,0),IF(AKD7>=1,1,0),IF(AKD8>=1,1,0),IF(AKD9>=1,1,0),IF(AKD10>=1,1,0),IF(AKD11>=1,1,0),IF(AKD12>=1,1,0),IF(AKD13>=1,1,0),IF(AKD14>=1,1,0),IF(AKD15>=1,1,0),IF(AKD16>=1,1,0),IF(AKD17>=1,1,0),IF(AKD18>=1,1,0),IF(AKD19>=1,1,0),IF(AKD20>=1,1,0),IF(AKD21>=1,1,0))","v":6},5,7,4,6,5,7,6,7,6,11,4,5,4,4,6,8,4,4,5,4,6,4,5,6,4,9,4,5,5,5,7,7,4,7,5,7]
[]
[null,"Průměr vzdáleností [km]",{"$f":"AVERAGEA(C23:ALN23)","v":26.696999999999999},null,"Maximum",{"$f":"MAX(C23:ALN23)","v":36}]
[null,"Průměrný počet zastávek",{"$f":"AVERAGEA(C24:ALN24)","v":5.7510000000000003},null,"Minimum",{"$f":"MIN(C23:ALN23)","v":12}]
[null,"Medián vzdáleností [km]",{"$f":"MEDIAN(C23:ALN23)","v":28}]
[null,"Medián počtu zastávek",{"$f":"MEDIAN(C24:ALN24)","v":6}]

{"sheet":"Hladina 60 %","index":7,"n_rows":29,"n_cols":1002,"rows_kept":29,"cut":false,"hidden":false,"merged":[]}
["Výstup ze simulace"]
[]
[null,"Název",1,2,3,4,5,6,7,8,9,10,11,12,13,14,15,16,17,18,19,20,21,22,23,24,25,26,27,28,29,30,31,32,33,34,35,36,37,38,39,40,41,42,43,44,45,46,47,48,49,50,51,52,53,54,55,56,57,58,59,60,61,62,63,64,65,66,67,68,69,70,71,72,73,74,75,76,77,78,79,80,81,82,83,84,85,86,87,88,89,90,91,92,93,94,95,96,97,98,99,100,101,102,103,104,105,106,107,108,109,110,111,112,113,114,115,116,117,118,119,120,121,122,123,124,125,126,127,128,129,130,131,132,133,134,135,136,137,138,139,140,141,142,143,144,145,146,147,148,149,150,151,152,153,154,155,156,157,158,159,160,161,162,163,164,165,166,167,168,169,170,171,172,173,174,175,176,177,178,179,180,181,182,183,184,185,186,187,188,189,190,191,192,193,194,195,196,197,198,199,200,201,202,203,204,205,206,207,208,209,210,211,212,213,214,215,216,217,218,219,220,221,222,223,224,225,226,227,228,229,230,231,232,233,234,235,236,237,238,239,240,241,242,243,244,245,246,247,248,249,250,251,252,253,254,255,256,257,258,259,260,261,262,263,264,265,266,267,268,269,270,271,272,273,274,275,276,277,278,279,280,281,282,283,284,285,286,287,288,289,290,291,292,293,294,295,296,297,298,299,300,301,302,303,304,305,306,307,308,309,310,311,312,313,314,315,316,317,318,319,320,321,322,323,324,325,326,327,328,329,330,331,332,333,334,335,336,337,338,339,340,341,342,343,344,345,346,347,348,349,350,351,352,353,354,355,356,357,358,359,360,361,362,363,364,365,366,367,368,369,370,371,372,373,374,375,376,377,378,379,380,381,382,383,384,385,386,387,388,389,390,391,392,393,394,395,396,397,398,399,400,401,402,403,404,405,406,407,408,409,410,411,412,413,414,415,416,417,418,419,420,421,422,423,424,425,426,427,428,429,430,431,432,433,434,435,436,437,438,439,440,441,442,443,444,445,446,447,448,449,450,451,452,453,454,455,456,457,458,459,460,461,462,463,464,465,466,467,468,469,470,471,472,473,474,475,476,477,478,479,480,481,482,483,484,485,486,487,488,489,490,491,492,493,494,495,496,497,498,499,500,501,502,503,504,505,506,507,508,509,510,511,512,513,514,515,516,517,518,519,520,521,522,523,524,525,526,527,528,529,530,531,532,533,534,535,536,537,538,539,540,541,542,543,544,545,546,547,548,549,550,551,552,553,554,555,556,557,558,559,560,561,562,563,564,565,566,567,568,569,570,571,572,573,574,575,576,577,578,579,580,581,582,583,584,585,586,587,588,589,590,591,592,593,594,595,596,597,598,599,600,601,602,603,604,605,606,607,608,609,610,611,612,613,614,615,616,617,618,619,620,621,622,623,624,625,626,627,628,629,630,631,632,633,634,635,636,637,638,639,640,641,642,643,644,645,646,647,648,649,650,651,652,653,654,655,656,657,658,659,660,661,662,663,664,665,666,667,668,669,670,671,672,673,674,675,676,677,678,679,680,681,682,683,684,685,686,687,688,689,690,691,692,693,694,695,696,697,698,699,700,701,702,703,704,705,706,707,708,709,710,711,712,713,714,715,716,717,718,719,720,721,722,723,724,725,726,727,728,729,730,731,732,733,734,735,736,737,738,739,740,741,742,743,744,745,746,747,748,749,750,751,752,753,754,755,756,757,758,759,760,761,762,763,764,765,766,767,768,769,770,771,772,773,774,775,776,777,778,779,780,781,782,783,784,785,786,787,788,789,790,791,792,793,794,795,796,797,798,799,800,801,802,803,804,805,806,807,808,809,810,811,812,813,814,815,816,817,818,819,820,821,822,823,824,825,826,827,828,829,830,831,832,833,834,835,836,837,838,839,840,841,842,843,844,845,846,847,848,849,850,851,852,853,854,855,856,857,858,859,860,861,862,863,864,865,866,867,868,869,870,871,872,873,874,875,876,877,878,879,880,881,882,883,884,885,886,887,888,889,890,891,892,893,894,895,896,897,898,899,900,901,902,903,904,905,906,907,908,909,910,911,912,913,914,915,916,917,918,919,920,921,922,923,924,925,926,927,928,929,930,931,932,933,934,935,936,937,938,939,940,941,942,943,944,945,946,947,948,949,950,951,952,953,954,955,956,957,958,959,960,961,962,963,964,965,966,967,968,969,970,971,972,973,974,975,976,977,978,979,980,981,982,983,984,985,986,987,988,989,990,991,992,993,994,995,996,997,998,999,1000]
[null,"Trhové Sviny",1,1,1,1,1,1,1,1,1,1,1,1,1,1,1,1,1,1,1,1,1,1,1,1,1,1,1,1,1,1,1,1,1,1,1,1,1,1,1,1,1,1,1,1,1,1,1,1,1,1,1,1,1,1,1,1,1,1,1,1,1,1,1,1,1,1,1,1,1,1,1,1,1,1,1,1,1,1,1,1,1,1,1,1,1,1,1,1,1,1,1,1,1,1,1,1,1,1,1,1,1,1,1,1,1,1,1,1,1,1,1,1,1,1,1,1,1,1,1,1,1,1,1,1,1,1,1,1,1,1,1,1,1,1,1,1,1,1,1,1,1,1,1,1,1,1,1,1,1,1,1,1,1,1,1,1,1,1,1,1,1,1,1,1,1,1,1,1,1,1,1,1,1,1,1,1,1,1,1,1,1,1,1,1,1,1,1,1,1,1,1,1,1,1,1,1,1,1,1,1,1,1,1,1,1,1,1,1,1,1,1,1,1,1,1,1,1,1,1,1,1,1,1,1,1,1,1,1,1,1,1,1,1,1,1,1,1,1,1,1,1,1,1,1,1,1,1,1,1,1,1,1,1,1,1,1,1,1,1,1,1,1,1,1,1,1,1,1,1,1,1,1,1,1,1,1,1,1,1,1,1,1,1,1,1,1,1,1,1,1,1,1,1,1,1,1,1,1,1,1,1,1,1,1,1,1,1,1,1,1,1,1,1,1,1,1,1,1,1,1,1,1,1,1,1,1,1,1,1,1,1,1,1,1,1,1,1,1,1,1,1,1,1,1,1,1,1,1,1,1,1,1,1,1,1,1,1,1,1,1,1,1,1,1,1,1,1,1,1,1,1,1,1,1,1,1,1,1,1,1,1,1,1,1,1,1,1,1,1,1,1,1,1,1,1,1,1,1,1,1,1,1,1,1,1,1,1,1,1,1,1,1,1,1,1,1,1,1,1,1,1,1,1,1,1,1,1,1,1,1,1,1,1,1,1,1,1,1,1,1,1,1,1,1,1,1,1,1,1,1,1,1,1,1,1,1,1,1,1,1,1,1,1,1,1,1,1,1,1,1,1,1,1,1,1,1,1,1,1,1,1,1,1,1,1,1,1,1,1,1,1,1,1,1,1,1,1,1,1,1,1,1,1,1,1,1,1,1,1,1,1,1,1,1,1,1,1,1,1,1,1,1,1,1,1,1,1,1,1,1,1,1,1,1,1,1,1,1,1,1,1,1,1,1,1,1,1,1,1,1,1,1,1,1,1,1,1,1,1,1,1,1,1,1,1,1,1,1,1,1,1,1,1,1,1,1,1,1,1,1,1,1,1,1,1,1,1,1,1,1,1,1,1,1,1,1,1,1,1,1,1,1,1,1,1,1,1,1,1,1,1,1,1,1,1,1,1,1,1,1,1,1,1,1,1,1,1,1,1,1,1,1,1,1,1,1,1,1,1,1,1,1,1,1,1,1,1,1,1,1,1,1,1,1,1,1,1,1,1,1,1,1,1,1,1,1,1,1,1,1,1,1,1,1,1,1,1,1,1,1,1,1,1,1,1,1,1,1,1,1,1,1,1,1,1,1,1,1,1,1,1,1,1,1,1,1,1,1,1,1,1,1,1,1,1,1,1,1,1,1,1,1,1,1,1,1,1,1,1,1,1,1,1,1,1,1,1,1,1,1,1,1,1,1,1,1,1,1,1,1,1,1,1,1,1,1,1,1,1,1,1,1,1,1,1,1,1,1,1,1,1,1,1,1,1,1,1,1,1,1,1,1,1,1,1,1,1,1,1,1,1,1,1,1,1,1,1,1,1,1,1,1,1,1,1,1,1,1,1,1,1,1,1,1,1,1,1,1,1,1,1,1,1,1,1,1,1,1,1,1,1,1,1,1,1,1,1,1,1,1,1,1,1,1,1,1,1,1,1,1,1,1,1,1,1,1,1,1,1,1,1,1,1,1,1,1,1,1,1,1,1,1,1,1,1,1,1,1,1,1,1,1,1,1,1,1,1,1,1,1,1,1,1,1,1,1,1,1,1,1,1,1,1,1,1,1,1,1,1,1,1,1,1,1,1,1,1,1,1,1,1,1,1,1,1,1,1,1,1,1,1,1,1,1,1,1,1,1,1,1,1,1,1,1,1,1,1,1,1,1,1,1,1,1,1,1,1,1,1,1,1,1,1,1,1,1,1,1,1,1,1,1,1,1,1,1,1,1,1,1,1,1,1,1,1,1,1,1,1,1,1,1,1,1,1,1,1,1,1,1]
[null,"Nesměň",6,4,null,null,4,4,null,null,null,null,5,null,null,4,null,null,3,2,3,null,3,null,null,6,null,null,4,null,null,2,null,null,null,5,4,null,null,null,null,4,null,null,null,null,4,5,null,6,null,null,null,3,6,3,null,null,null,null,5,null,3,null,null,2,null,5,null,null,3,null,null,null,null,null,7,null,null,2,null,null,null,3,null,5,5,null,5,5,null,null,null,null,null,5,5,2,null,7,null,null,4,3,null,null,6,5,2,null,null,3,6,6,3,5,4,null,4,4,2,4,null,null,null,null,null,null,null,null,3,null,null,null,null,4,null,4,3,7,3,null,5,null,null,null,null,2,null,4,4,6,null,null,4,3,3,null,6,5,4,null,null,4,null,4,null,null,4,null,5,null,null,null,null,5,null,null,5,null,null,null,null,3,null,3,null,5,null,4,null,null,4,null,null,4,5,null,null,null,4,null,4,null,3,null,null,null,null,4,null,null,4,4,null,null,6,null,null,null,6,6,5,4,5,null,5,4,null,5,null,null,4,7,6,4,null,6,null,null,5,null,null,null,2,null,6,null,null,null,6,null,4,null,3,5,null,null,null,null,4,5,null,null,5,5,null,null,5,2,null,null,null,null,null,3,null,4,5,5,5,null,null,4,4,null,4,7,5,3,2,null,3,null,null,4,4,5,5,null,4,null,null,null,2,null,null,5,5,5,null,null,null,6,5,null,null,null,null,3,3,null,4,null,4,5,5,null,null,4,null,4,3,4,null,7,null,2,null,5,null,3,3,null,null,null,null,4,6,null,6,null,null,null,null,5,null,null,null,5,3,4,null,4,null,2,null,5,5,null,6,null,3,null,4,null,4,null,null,null,null,4,6,4,null,4,null,null,5,null,5,null,null,null,null,null,6,null,4,null,4,null,5,null,null,4,null,null,null,null,null,5,null,null,4,6,null,4,null,5,3,null,null,null,null,4,4,5,null,null,null,4,6,4,2,4,null,null,null,4,null,null,null,2,null,4,4,null,null,null,null,4,null,2,null,null,null,null,6,null,6,2,4,null,null,6,null,null,4,3,null,2,4,3,null,null,null,null,null,5,null,null,4,null,5,4,2,4,4,null,7,null,null,null,null,null,5,null,3,null,4,3,null,3,4,null,4,null,4,null,null,4,null,null,null,3,5,5,null,null,4,null,null,4,null,4,null,3,4,null,4,5,5,null,null,null,4,null,5,null,5,3,null,4,null,null,6,3,null,null,3,5,3,null,null,null,null,null,null,null,null,null,null,null,5,null,null,null,4,3,null,5,null,4,null,6,null,4,null,6,4,null,3,null,null,null,null,4,5,3,5,null,5,null,null,3,null,null,null,null,3,null,null,null,null,null,null,null,4,null,3,null,3,5,null,null,null,6,3,null,4,4,null,null,4,5,null,5,null,5,null,null,null,null,4,null,5,4,null,null,3,null,5,4,4,null,4,4,null,null,5,null,null,null,4,null,4,null,4,5,null,null,null,null,null,5,null,6,null,4,5,5,null,null,null,null,5,null,3,4,null,null,5,null,3,4,null,null,null,5,5,4,2,6,3,6,2,null,5,null,null,2,null,4,4,5,5,null,3,null,4,4,null,null,5,null,null,null,5,null,null,null,null,null,6,null,5,7,null,null,2,null,null,6,6,null,6,null,4,null,null,null,null,3,null,4,null,null,null,3,4,6,null,4,null,null,4,4,null,null,3,null,6,null,5,4,null,null,null,null,null,null,null,null,5,4,null,null,6,null,4,3,5,2,3,null,null,4,4,null,4,6,null,3,null,null,null,null,null,null,3,3,4,null,null,null,5,null,null,3,null,4,5,null,null,null,3,null,null,null,5,5,5,3,6,6,null,7,null,3,2,null,3,null,5,null,3,null,6,null,3,4,5,null,null,2,null,5,5,5,null,6,4,null,null,null,null,null,4,null,4,null,4,5,null,2,5,2,null,7,3,4,4,null,null,3,4,null,null,3,5,5,null,3,null,3,null,null,null,5,4,4,null,6,3,5,null,5,null,null,6,null,null,null,null,2,3,4,null,4,null,4,4,null,null,3,null,null,3,null,4,null,2,null,4,null,null,null,5,null,null,null,null,3,null,null,4,null,5,4,null,null,4,null,5,6,4,null,5,4,null,5,null,null,null,null,null,2,null,null,null,5,null,3,4,null,null,null,null,4,null,3,null,null,null,5,null,4,null,null,null,5,null,null,3,null,6,null,5,5,null,null,null,null,null,null,5,3,3,3,null,4]
[null,"Ločenice",5,3,5,4,3,null,5,3,null,null,4,null,3,null,null,3,null,null,null,null,null,2,4,5,null,null,null,null,null,null,3,null,null,4,null,null,null,null,null,null,null,4,null,null,3,4,null,5,null,null,5,null,5,null,null,null,null,4,4,5,null,null,2,null,null,null,5,5,null,4,4,4,4,2,6,null,null,null,null,null,3,null,null,4,null,null,null,4,null,null,null,2,null,null,4,null,4,6,null,4,3,null,4,null,5,4,null,null,null,2,null,null,null,4,3,3,null,null,null,null,null,null,4,3,null,null,null,3,null,3,5,null,5,null,5,null,null,6,null,null,4,null,4,null,null,null,null,null,null,5,null,2,null,null,null,null,5,4,3,null,null,null,null,null,null,null,null,4,4,4,null,3,null,4,null,2,4,null,null,null,null,null,null,null,3,4,4,null,null,4,3,5,3,3,null,3,null,null,3,4,3,null,null,null,null,null,3,null,null,5,3,null,4,4,null,4,null,3,5,5,null,null,null,3,4,null,null,null,4,3,null,6,5,null,null,5,3,3,null,null,3,5,null,null,5,5,null,4,5,2,null,null,null,null,6,null,null,4,null,4,null,null,4,4,4,null,4,null,null,5,5,3,4,2,5,3,null,null,null,5,3,3,null,null,3,6,4,null,null,5,null,2,null,null,null,null,null,4,3,null,null,3,null,4,null,4,4,4,null,4,null,5,4,null,null,3,4,null,null,2,null,null,null,null,4,null,4,null,null,null,null,null,6,6,4,null,null,4,null,null,null,null,null,5,3,null,5,null,5,null,4,6,null,null,2,null,null,4,null,null,4,null,null,null,null,4,null,null,5,3,null,null,null,null,null,4,3,null,null,3,5,null,5,null,4,4,4,3,null,null,4,3,null,null,5,6,null,4,null,null,4,4,null,null,3,null,null,null,4,4,null,null,null,5,null,3,null,4,null,3,5,null,3,null,null,4,4,null,3,null,5,null,null,3,4,5,5,null,null,4,null,null,null,3,null,4,4,null,null,3,4,null,null,null,3,3,5,null,null,null,3,4,4,5,null,null,3,null,null,null,3,null,5,5,null,null,null,4,4,4,3,5,4,3,null,null,3,null,6,3,4,3,3,4,null,null,null,4,null,null,5,null,null,null,null,3,null,4,2,null,3,null,null,null,4,4,null,null,3,5,4,3,null,3,null,null,null,null,null,4,4,null,null,5,null,4,4,3,4,null,4,null,null,6,5,null,5,4,2,null,null,4,5,null,null,3,null,4,5,null,4,6,null,null,null,2,3,null,null,4,3,null,null,null,5,null,2,5,null,null,null,4,6,null,4,null,null,null,4,null,null,4,null,null,null,null,5,5,null,5,null,null,null,null,4,4,null,5,null,5,null,4,4,null,5,5,null,5,3,null,null,null,null,4,4,4,2,null,null,null,3,3,3,5,null,null,5,null,null,null,4,null,null,null,3,null,null,4,null,null,null,4,null,4,null,4,null,4,2,null,4,null,null,null,null,null,null,null,4,null,null,null,null,5,null,null,2,3,4,null,null,3,2,null,3,null,null,4,null,null,null,5,null,5,null,3,null,null,5,null,null,3,null,4,4,null,null,null,3,null,null,null,null,null,null,null,4,null,null,2,null,null,null,null,null,6,5,3,null,4,null,5,5,null,5,5,null,5,null,null,null,null,4,3,3,null,null,null,3,5,null,null,null,2,null,null,null,null,2,null,5,5,4,null,null,null,null,null,3,3,null,null,null,null,3,null,5,null,null,null,4,null,null,null,null,null,null,null,null,5,3,null,null,null,null,null,3,null,null,null,null,4,null,null,null,5,4,null,null,null,4,3,3,5,2,null,null,3,null,null,4,null,5,5,null,6,3,null,null,null,2,null,null,null,null,3,5,null,2,null,null,null,null,null,4,null,4,4,4,5,null,2,null,4,null,3,3,null,3,4,null,null,3,null,4,null,null,6,null,null,3,null,3,null,null,4,3,null,4,null,5,null,null,null,null,4,3,null,3,null,null,5,null,4,null,4,4,null,5,6,5,4,null,null,null,null,null,3,4,null,null,null,null,null,null,3,null,null,3,4,null,null,3,4,null,null,4,2,null,5,4,null,null,4,null,null,4,3,null,3,3,null,4,5,null,null,null,null,null,4,null,null,2,5,5,null,5,3,3,4,null,null,3,null,null,4,5,3,null,2,null,null,null,4,2,null,null,null,3,null,null,4,null,null,5,5,4,null,4,null,4,null,null,3,null,2,2,2]
[null,"Todně",4,null,4,2,2,3,3,null,null,2,3,4,2,null,null,null,2,null,null,3,null,null,null,4,null,null,null,null,null,null,null,null,null,null,3,null,null,null,3,null,3,3,null,null,2,3,null,4,null,null,null,null,null,null,null,4,null,null,3,3,2,null,null,null,3,3,4,null,null,null,null,null,null,null,4,2,4,null,null,null,null,2,null,null,3,null,3,null,3,2,2,null,null,3,3,null,null,4,null,null,null,null,3,null,3,2,null,3,null,null,4,4,null,3,null,null,null,null,null,3,null,null,3,2,null,null,null,null,null,null,3,null,3,null,null,3,null,4,null,4,3,3,3,3,null,null,2,null,3,3,2,null,null,null,null,4,4,null,null,null,null,null,null,null,4,3,null,null,null,null,null,2,null,null,2,null,3,3,null,null,2,null,null,null,null,null,null,3,3,3,null,3,null,null,3,2,null,4,null,3,null,4,null,null,null,3,null,2,null,null,null,null,null,null,4,3,null,2,3,3,3,null,3,2,3,null,3,3,2,2,null,4,null,null,4,3,null,null,3,4,null,3,null,4,3,null,2,3,4,null,3,3,2,3,4,null,3,null,3,3,3,null,3,null,null,3,null,null,2,4,3,null,null,null,3,null,4,4,null,null,null,2,null,null,null,4,null,2,null,3,null,null,null,3,2,3,null,3,null,null,null,null,null,null,4,3,3,null,null,null,3,3,null,null,null,null,2,null,null,null,null,null,null,3,null,null,3,null,4,2,null,null,4,4,3,null,null,null,null,2,2,2,null,3,null,null,3,null,null,null,3,4,null,3,null,null,2,2,null,null,2,3,2,null,null,null,null,null,3,2,null,2,null,null,null,3,null,3,null,2,3,3,3,null,2,null,3,null,4,null,3,2,3,4,4,4,null,null,null,4,null,null,3,null,null,3,null,null,3,3,null,null,null,3,null,null,3,2,null,2,3,3,null,2,3,null,2,2,null,null,null,null,null,2,3,3,null,3,null,null,null,null,null,2,null,2,null,3,2,null,null,null,2,3,null,null,3,null,4,null,null,3,null,4,null,3,null,null,3,null,2,2,null,null,2,null,3,3,3,2,null,3,3,null,null,null,null,null,4,null,null,null,null,null,3,4,2,null,2,null,3,null,null,null,null,null,null,null,null,null,null,null,null,null,null,3,null,null,2,4,3,null,null,null,2,null,null,null,2,3,3,3,3,3,2,3,3,null,null,2,3,3,3,4,3,2,3,null,null,4,null,2,3,null,4,null,null,2,null,null,3,4,null,3,3,null,null,null,null,null,null,3,null,4,3,2,null,null,null,3,null,2,4,null,2,2,3,null,null,2,3,null,3,2,null,null,3,3,null,3,4,3,2,2,null,3,3,null,null,4,null,null,3,2,3,3,null,null,null,null,4,4,null,null,null,null,null,3,3,3,null,2,2,3,3,null,3,null,null,3,null,null,3,3,null,null,2,null,3,null,null,3,2,null,2,2,null,null,null,null,null,3,3,3,4,4,null,3,null,3,null,3,null,null,null,null,null,null,null,null,3,2,null,null,null,null,3,3,3,3,null,null,null,4,null,null,null,null,null,null,null,null,3,null,null,null,null,3,null,null,null,null,null,3,2,4,null,null,2,null,3,3,4,2,null,4,null,null,null,null,2,3,3,4,4,3,null,3,null,null,null,null,null,null,null,null,null,null,null,3,3,null,null,null,3,null,3,null,null,null,null,3,null,2,null,3,null,null,null,null,2,3,3,null,2,3,3,3,null,null,null,null,null,null,2,null,null,null,2,4,null,2,null,null,2,null,null,2,null,null,3,3,null,null,4,3,3,null,3,null,3,null,null,3,null,2,null,null,null,null,null,null,null,4,3,4,null,null,null,3,null,4,3,3,2,null,3,3,null,2,3,null,null,null,null,null,null,2,null,null,3,null,null,3,null,2,null,null,null,2,null,null,null,null,2,null,null,4,null,3,null,null,null,2,3,null,null,null,3,4,3,null,null,null,2,null,null,3,null,3,3,4,2,3,null,3,null,null,4,4,3,2,4,null,2,3,2,null,null,null,null,null,null,null,null,2,null,null,null,3,null,3,null,3,null,3,2,null,null,3,null,null,2,null,null,3,3,2,null,null,null,2,null,3,3,null,4,null,null,2,null,3,null,3,null,null,4,null,null,3,3,null,null,null,3,3,3,2,4,null,null,null,null,null,null,null,3,null,null,3,3,3,2,3,null,3,3,3,null,4,3,3,2,null,3,null,null,null,null,3]
[null,"Nežetice",3,null,3,null,null,null,null,2,null,null,null,3,null,3,3,2,null,null,2,null,null,null,null,3,3,3,null,null,2,null,null,null,3,3,null,null,null,null,null,2,null,null,2,null,null,2,null,3,null,2,3,null,3,null,null,3,3,null,null,2,null,null,null,null,null,2,3,3,null,3,3,3,2,null,3,null,3,null,null,2,null,null,null,3,2,null,2,null,null,null,null,null,null,null,2,null,null,3,2,2,null,2,2,2,null,null,null,null,2,null,3,3,null,null,null,null,2,2,null,null,2,3,2,null,2,null,3,null,2,2,null,2,2,null,3,null,2,3,2,3,2,null,null,null,null,null,null,3,null,null,null,null,null,null,2,3,3,null,2,2,null,2,null,2,3,null,3,null,null,2,null,null,2,null,null,null,2,null,2,3,null,null,2,null,null,3,null,null,null,null,null,null,null,2,null,null,null,3,null,2,null,3,null,3,null,2,null,null,2,3,2,2,null,3,3,2,null,null,null,null,null,2,2,null,null,null,2,null,null,null,3,3,3,3,3,2,2,null,null,3,2,2,null,3,null,3,null,null,3,null,2,2,null,null,3,null,2,null,2,null,2,2,null,null,null,2,null,null,null,3,null,null,null,null,null,null,3,3,3,3,null,null,null,3,null,3,3,null,null,null,2,null,2,null,null,2,3,null,null,3,null,null,null,3,3,2,null,3,2,null,2,null,3,3,null,null,null,2,null,null,null,2,null,null,3,3,null,null,3,null,2,2,3,3,2,null,null,null,3,null,null,null,3,null,null,2,2,null,3,null,null,3,3,null,null,2,null,null,null,3,null,2,null,null,null,3,3,3,null,null,null,null,null,null,3,null,null,null,2,null,2,null,null,2,null,null,null,2,3,null,2,null,null,3,3,3,null,null,3,3,null,2,2,2,2,null,null,null,2,null,null,null,2,2,2,null,null,null,null,null,null,2,2,null,null,null,null,null,null,2,3,3,null,null,null,2,3,null,null,2,null,null,null,null,2,null,null,2,null,null,null,null,null,2,2,null,2,2,3,null,null,null,3,3,3,null,null,2,2,null,null,null,3,3,null,null,2,2,null,null,null,2,null,null,null,null,null,null,3,null,3,2,null,2,2,3,null,null,null,2,2,2,3,null,null,2,null,2,null,null,null,null,2,null,null,null,null,3,null,3,2,null,3,null,null,null,3,null,null,null,null,2,null,2,null,2,null,2,2,null,null,2,2,3,null,null,2,null,null,3,null,null,null,null,3,null,2,null,3,2,null,3,3,2,2,null,null,null,null,null,2,2,2,3,2,null,null,3,null,2,2,null,3,null,null,null,null,null,3,null,null,3,null,null,3,null,null,2,2,null,3,null,null,null,2,null,2,3,null,3,null,2,2,null,null,null,null,3,2,2,3,3,2,null,null,3,null,null,2,2,null,null,null,2,null,2,null,3,null,2,null,2,2,2,null,null,null,3,null,null,null,null,null,null,null,null,2,3,null,null,null,null,2,null,3,3,2,null,3,2,3,2,2,3,3,null,null,null,2,3,2,null,null,null,2,null,2,2,null,2,null,3,2,3,null,null,3,null,3,null,null,2,null,3,null,2,2,2,null,3,2,2,3,null,null,3,null,2,null,null,2,2,3,null,3,3,3,2,null,null,null,2,null,3,3,2,null,2,2,2,null,2,null,null,null,2,null,null,null,2,null,3,null,null,2,null,2,null,null,3,3,2,2,null,null,null,2,3,null,null,null,2,null,2,null,null,null,2,2,2,2,null,2,3,null,3,3,null,null,3,2,null,null,3,null,null,2,null,null,2,null,2,null,2,3,2,null,2,2,3,null,null,null,2,null,null,3,null,3,3,null,null,3,3,2,3,null,null,null,null,null,3,null,null,null,2,null,null,null,null,null,null,2,null,3,3,3,null,null,3,2,null,3,2,null,null,null,null,null,null,null,3,2,null,null,null,2,3,null,null,2,null,null,null,2,null,null,2,null,3,2,null,null,null,null,null,null,2,null,2,null,3,null,2,3,2,2,3,3,3,null,null,3,null,null,2,null,null,null,null,2,null,null,null,null,null,null,null,null,null,null,2,null,null,3,null,null,null,3,2,3,null,null,null,null,null,2,null,null,null,null,null,null,null,2,3,3,3,2,null,null,null,null,null,3,null,3,2,null,2,2,null,null,2,2,null,2,null,3,null,null,2,null,3,null,null,2,3,null,null,null,2,null,2,3,null,null,2,2,3,2,null,null,2,2,null,null,null,3,2]
[null,"Březí",2,null,2,null,null,2,2,null,null,null,2,2,null,2,2,null,null,null,null,2,null,null,2,2,2,2,2,null,null,null,2,2,2,2,2,null,null,2,2,null,2,2,null,null,null,null,2,2,2,null,2,null,2,null,null,2,2,2,2,null,null,null,null,null,2,null,2,2,null,2,2,2,null,null,2,null,2,null,2,null,null,null,2,2,null,null,null,2,2,null,null,null,null,2,null,null,2,2,null,null,null,null,null,null,2,null,null,2,null,null,2,2,2,2,2,null,null,null,null,2,null,2,null,null,null,2,2,2,null,null,2,null,null,2,2,2,null,2,null,2,null,2,2,2,null,null,null,2,2,2,null,null,2,null,null,2,2,2,null,null,2,null,null,null,2,2,2,2,2,null,null,null,null,2,null,null,null,2,null,2,null,null,null,null,null,2,2,2,2,2,null,2,2,null,2,null,null,2,2,null,null,2,null,2,null,null,2,null,null,2,null,null,2,2,2,null,2,null,2,2,2,null,null,null,2,2,null,2,null,null,2,2,2,2,2,null,null,null,2,2,null,null,null,2,2,2,null,2,2,null,null,null,null,2,2,null,null,2,null,2,null,null,2,2,2,null,2,null,null,2,2,2,2,null,2,2,2,2,2,2,null,null,2,2,null,2,2,null,null,2,null,null,null,2,null,null,2,2,null,2,null,2,null,2,2,null,2,2,null,2,null,2,2,2,null,2,null,null,null,null,2,null,2,2,2,2,2,2,2,null,null,null,2,2,null,null,null,2,2,null,null,null,2,2,null,null,null,null,2,2,2,2,2,2,null,null,null,null,2,2,null,null,null,null,2,2,2,2,2,null,null,null,2,null,2,2,null,2,null,null,null,2,2,null,null,2,2,null,2,2,null,null,2,2,2,2,2,2,2,2,2,null,null,null,null,2,2,2,null,2,null,null,null,null,null,2,2,null,2,null,2,null,null,null,2,2,null,null,null,null,2,2,null,null,2,null,2,2,2,null,null,null,2,null,null,null,2,null,null,null,2,null,null,null,null,null,null,null,2,null,2,2,2,2,2,2,null,null,null,null,null,null,2,2,null,2,null,null,2,null,2,null,2,null,null,2,2,null,2,2,2,null,2,null,null,2,null,2,null,null,null,null,2,2,2,null,2,null,null,2,null,null,null,null,2,2,null,2,null,2,null,null,2,null,null,null,2,null,null,2,2,null,2,null,null,null,2,null,null,null,2,null,null,2,2,null,null,2,null,2,null,null,2,2,2,null,null,null,2,null,2,2,2,null,null,null,2,2,null,2,null,null,null,2,null,null,null,2,2,null,null,null,2,null,null,null,2,null,2,null,2,2,2,null,2,null,2,null,null,2,2,2,null,null,null,2,null,2,null,2,null,null,null,null,2,2,null,2,null,null,2,2,null,2,2,2,null,2,null,null,null,null,null,null,2,null,2,2,2,null,2,null,null,null,null,2,null,2,2,null,2,2,null,2,null,null,null,2,null,2,2,2,null,2,2,2,null,2,2,null,2,null,null,2,2,null,null,2,null,2,null,null,null,2,null,null,null,null,2,null,null,2,null,2,null,2,2,2,2,null,null,null,2,2,2,null,null,null,2,2,null,null,2,2,null,2,2,null,null,null,null,null,2,null,2,2,2,null,null,2,null,null,2,2,2,null,2,null,null,null,2,null,2,null,2,null,null,null,2,null,2,2,null,null,null,2,null,null,null,2,2,null,null,null,2,2,null,2,2,2,null,null,2,null,null,2,2,null,null,null,null,null,null,2,null,2,2,null,null,2,null,null,null,2,null,null,null,null,2,null,2,null,null,null,2,null,2,null,null,2,2,null,null,null,null,null,2,2,2,2,2,null,2,2,null,2,null,2,null,2,null,2,2,2,null,null,2,2,null,null,2,2,null,null,2,2,2,null,2,2,null,null,2,null,2,null,null,2,2,null,2,2,null,null,null,null,null,2,2,2,null,2,2,null,null,2,2,null,2,2,null,2,null,null,null,2,null,null,2,null,2,2,null,null,2,null,null,2,2,2,2,null,2,null,null,null,null,2,2,2,null,null,null,null,null,null,2,null,null,2,null,null,2,2,2,2,null,null,2,null,2,null,null,2,2,2,null,null,null,null,2,null,2,2,null,2,2,2,null,null,null,2,null,2,2,null,2,null,null,null,null,null,2,null,null,2,null,null,2,null,2,null,2,2,null,2,null,2,null,2,2,null,null,null,2,2,2,null,null,2,null,2,null,null,null,null,null,null,2]
[null,"Něchov",null,2,null,3,null,null,4,null,null,3,null,null,null,null,null,null,null,null,null,null,2,null,3,null,4,4,3,null,3,null,null,3,null,null,null,2,null,null,4,3,null,null,3,2,null,null,null,null,3,null,4,2,4,2,null,5,null,3,null,4,null,2,null,null,4,4,null,4,2,null,null,null,3,null,5,null,5,null,null,3,2,null,3,null,4,2,4,3,null,null,3,null,null,4,null,null,3,5,3,3,2,null,null,null,4,3,null,null,3,null,5,5,null,null,null,2,3,3,null,null,null,4,null,null,3,3,4,null,null,null,4,null,4,3,4,null,null,5,null,5,null,null,null,4,2,null,3,null,null,4,3,null,3,2,null,null,null,3,null,null,3,3,null,3,null,4,null,3,3,3,null,null,3,3,null,null,null,null,3,null,3,2,null,2,2,null,3,null,4,null,2,4,null,null,4,null,null,null,null,null,2,null,2,4,null,null,null,3,3,4,null,3,3,null,5,null,null,null,4,4,4,3,4,null,null,3,null,4,3,null,null,5,4,null,null,4,null,2,4,null,null,4,null,5,4,4,3,null,null,null,null,null,null,4,5,2,null,3,null,null,null,null,null,3,3,null,3,null,null,null,4,null,3,null,4,null,null,null,4,4,2,null,3,4,2,5,null,null,null,4,null,null,3,null,3,4,4,null,2,null,null,null,null,null,null,null,null,null,null,3,4,4,null,4,null,null,3,null,2,null,3,3,3,4,null,null,null,3,5,3,null,3,5,5,null,null,2,3,null,null,null,3,null,4,2,3,4,null,4,null,null,5,null,4,null,null,null,3,null,null,3,null,null,null,null,null,4,4,4,null,2,3,3,null,null,null,2,null,null,null,4,null,4,3,3,3,null,null,null,3,null,null,4,5,null,5,3,3,null,null,3,3,4,3,null,null,null,null,null,null,2,null,3,4,3,null,4,3,null,null,4,4,null,3,null,3,3,3,2,3,4,null,null,null,null,4,4,null,3,3,2,null,null,null,3,3,3,null,null,2,3,null,null,4,null,2,4,null,5,null,null,null,null,null,null,null,2,null,4,null,null,null,4,4,null,3,null,null,null,3,null,4,null,2,null,3,null,null,5,null,null,null,null,3,4,5,null,3,3,null,4,null,null,3,3,null,3,3,null,3,2,2,null,2,3,null,2,4,null,null,null,2,4,2,null,2,null,null,3,null,null,null,4,4,3,null,null,null,3,null,null,null,null,5,4,null,4,3,null,null,2,3,4,3,null,2,3,3,4,3,null,5,4,4,null,null,null,null,null,3,null,null,null,5,4,3,null,4,3,4,null,3,5,2,3,3,4,2,null,3,4,null,null,null,null,2,4,4,null,4,null,null,null,null,3,null,null,4,2,null,2,3,null,3,4,4,2,4,null,3,null,5,3,3,3,null,null,4,null,4,2,null,null,4,4,3,4,null,null,null,3,3,null,null,2,3,null,null,4,null,3,null,3,3,3,3,3,null,null,null,3,null,null,4,null,5,null,null,null,4,null,4,3,4,4,2,null,null,3,4,4,null,null,3,null,null,4,null,4,null,null,4,null,null,null,null,4,null,4,null,null,null,null,null,3,null,null,null,null,null,3,3,4,null,null,5,3,null,3,null,null,4,5,null,4,5,4,null,null,3,null,4,4,5,null,4,3,4,3,null,null,null,3,2,null,3,2,2,null,4,null,null,2,null,null,3,4,2,null,4,4,4,3,3,null,null,null,4,null,null,3,null,4,3,null,null,4,null,3,null,3,null,null,null,3,null,null,2,3,null,null,null,null,null,3,null,null,null,null,null,null,null,2,3,null,4,null,null,null,null,null,2,2,4,null,3,4,null,4,4,3,2,4,null,4,5,2,null,null,4,null,5,4,4,null,null,4,4,null,3,4,3,null,null,null,4,null,3,3,4,null,null,null,null,3,null,2,3,null,3,3,4,null,null,3,null,3,5,null,null,null,null,null,null,null,3,null,null,null,null,4,null,2,2,3,3,2,4,null,null,null,null,null,null,4,null,3,4,null,5,4,3,null,null,null,null,3,null,3,3,3,2,2,2,null,null,null,null,2,null,null,4,null,null,null,null,3,null,null,4,null,2,3,3,3,4,null,null,2,2,null,null,3,4,null,null,null,null,null,3,null,4,null,4,4,null,null,null,2,null,null,2,null,3,null,null,4,null,null,null,3,null,null,null,null,3,4,4,2,4,null,null,null,null,4,4,null,4,3,null,null,null,3,null,4,null,null,null,4]
[null,"Besednice",null,5,null,null,null,5,null,null,null,null,null,5,null,5,null,null,4,null,null,null,4,3,null,7,null,null,null,null,null,3,4,4,4,null,null,3,null,null,5,5,4,5,null,null,null,6,3,7,4,3,6,null,null,null,null,6,null,5,6,6,4,3,null,null,null,null,6,null,null,null,null,5,null,null,null,null,null,3,null,4,null,null,null,6,6,3,null,null,4,null,4,3,2,null,null,null,5,8,null,5,null,null,5,3,null,6,3,null,4,null,7,null,4,6,null,4,null,5,null,null,3,null,5,null,null,null,null,4,null,null,null,null,null,null,null,null,4,null,null,6,6,null,null,5,null,null,null,null,null,7,4,null,null,4,null,5,null,null,5,3,null,5,2,null,null,null,5,null,null,5,2,4,4,null,null,3,null,4,null,null,4,4,null,4,4,null,null,null,null,5,5,6,4,null,6,null,2,5,5,null,5,null,null,null,2,4,4,5,null,null,null,null,null,5,null,null,3,4,null,null,6,null,6,null,null,null,4,null,null,null,null,8,7,null,null,7,null,null,null,null,null,6,null,null,7,null,null,5,7,null,null,null,4,6,7,null,4,null,null,6,null,null,null,null,null,4,null,null,null,6,null,4,null,null,null,null,6,6,6,null,null,null,null,5,null,null,6,null,3,null,null,3,null,5,5,null,null,null,null,4,null,4,null,null,5,6,null,6,null,null,null,null,null,null,2,4,null,null,4,3,null,null,5,null,6,null,5,null,null,null,null,null,null,8,5,3,3,6,4,4,4,4,4,6,null,null,null,2,7,3,null,null,null,6,3,null,3,null,null,null,null,5,3,null,3,6,null,5,7,4,null,null,5,2,5,5,4,null,null,5,null,null,null,5,5,null,null,null,6,4,5,4,null,6,null,null,5,5,null,5,6,5,null,null,null,null,3,null,null,null,3,null,5,7,4,null,null,6,null,null,null,null,null,5,5,null,5,4,4,5,7,null,3,5,null,6,null,5,null,null,null,3,3,5,null,5,5,null,3,null,null,3,3,null,null,null,null,null,null,null,null,null,null,null,null,null,5,null,null,null,null,4,null,6,null,null,null,null,null,null,5,6,6,5,null,null,5,null,null,4,null,4,null,5,6,6,4,null,null,4,6,4,null,4,5,null,5,null,null,5,null,3,3,null,6,6,null,5,5,null,5,null,null,null,null,null,null,2,null,null,null,null,5,6,5,null,6,4,null,null,null,null,null,null,7,null,null,5,null,null,null,null,null,null,5,4,4,null,null,null,5,null,null,null,4,null,5,4,null,6,4,5,3,7,null,5,3,7,5,5,null,null,7,null,5,5,null,null,6,4,6,null,null,4,null,null,6,null,4,null,5,4,null,null,null,5,5,6,null,null,4,null,5,null,null,null,null,6,5,5,null,6,null,6,5,null,3,null,null,5,null,4,null,6,null,5,6,4,null,null,6,5,null,4,5,5,null,5,null,null,null,null,5,5,5,null,null,null,3,3,null,null,4,null,null,7,null,5,6,6,null,5,null,6,6,null,4,5,null,5,6,4,4,5,null,2,null,6,6,null,3,7,null,null,null,4,null,null,null,null,2,null,null,6,null,null,null,null,null,null,4,null,null,null,null,null,6,3,null,3,null,5,null,null,null,null,6,4,3,null,3,null,7,null,null,null,null,null,4,3,null,4,null,null,null,4,null,4,5,7,4,5,null,null,null,null,5,null,null,null,null,null,null,null,3,4,3,5,4,null,null,4,6,null,null,4,7,4,null,4,6,3,null,null,null,5,null,null,null,null,4,4,null,null,null,null,null,null,null,4,5,null,3,null,6,null,null,null,4,null,6,4,null,null,4,null,null,4,6,6,6,4,null,7,null,null,4,4,null,5,4,null,null,null,null,4,null,null,null,5,null,null,null,3,5,null,6,null,null,null,5,null,null,null,4,4,null,4,null,null,null,null,null,3,null,null,null,8,null,null,null,null,4,null,null,5,null,null,null,null,null,null,null,4,4,null,null,6,null,null,4,null,4,null,null,null,null,null,7,null,null,5,null,null,null,null,4,5,5,5,5,3,null,4,null,4,null,null,null,null,3,null,null,null,4,4,null,3,4,6,null,null,null,null,5,null,6,5,null,4,5,3,6,null,5,null,null,null,null,6,2,null,null,6,null,null,6,4,null,6,4,null,5,null,null,5,6,5,5,4,null,3,null,null,3,null,5,null,4,6,null,5,4,null,null,6,6,6,5,5,null,4,null,4,6,null,null,4,null,5]
[null,"Keblany",null,null,6,5,null,null,null,4,2,4,null,6,null,null,4,null,null,3,null,4,null,null,null,null,null,5,5,null,4,4,5,5,null,6,5,4,null,null,6,6,null,6,4,3,5,null,null,8,null,4,null,null,null,4,null,7,4,6,null,null,null,4,null,null,null,6,null,6,4,5,5,null,5,3,null,null,6,null,3,null,null,4,null,null,null,4,null,null,5,null,5,null,null,null,null,null,null,null,null,6,null,null,6,4,7,7,4,null,null,null,null,null,null,null,5,null,null,null,null,null,null,5,6,null,4,null,5,null,null,null,6,3,null,5,6,5,null,null,4,null,7,4,null,null,3,3,null,null,5,8,5,null,5,5,4,6,null,6,6,4,null,6,3,null,5,null,null,null,6,null,3,5,5,null,null,4,6,null,4,4,null,null,null,5,5,null,null,5,null,6,6,null,null,5,7,null,null,6,6,5,6,null,4,null,3,null,5,6,4,null,5,null,null,null,null,null,4,5,null,null,null,5,null,null,6,null,5,null,null,null,5,9,null,5,5,null,4,4,6,null,4,null,3,null,8,null,null,6,null,null,5,null,null,null,null,3,null,5,5,7,4,3,6,null,null,5,null,null,null,7,6,5,5,null,6,null,null,7,null,null,null,5,5,null,null,8,null,4,null,6,4,4,null,6,null,null,null,5,null,5,2,5,3,5,null,null,6,null,3,null,null,null,6,null,3,5,null,null,null,null,5,null,6,null,null,4,null,null,6,5,null,5,7,null,6,null,null,null,null,null,null,null,null,null,4,null,null,3,null,4,5,null,null,7,null,null,4,null,null,null,null,6,null,3,4,7,null,6,8,null,4,null,null,3,null,null,null,4,null,6,7,5,6,6,null,null,6,null,null,null,null,null,null,7,null,7,null,null,null,null,null,null,5,5,4,4,4,null,null,null,null,2,null,8,5,5,5,null,4,null,null,null,4,6,null,6,null,null,null,6,null,5,4,null,5,7,null,null,null,null,null,null,4,6,null,null,6,null,null,5,null,null,null,null,null,null,null,null,7,null,null,null,5,null,4,4,6,4,null,null,null,null,null,null,null,4,null,null,null,5,6,null,null,null,3,null,null,null,8,null,5,5,null,null,null,null,5,null,null,5,null,null,null,null,null,null,null,null,3,null,4,4,null,4,null,7,3,null,null,6,null,null,5,5,3,null,5,3,null,6,null,null,6,null,null,5,null,5,null,4,5,5,4,7,null,null,6,null,null,null,null,5,6,null,null,null,5,null,6,4,null,null,null,5,null,null,null,null,null,null,5,6,null,null,null,null,null,null,null,6,4,5,null,3,6,null,6,null,null,null,7,5,null,null,null,null,7,null,null,null,6,5,null,3,5,6,null,null,null,null,null,null,null,null,6,7,null,7,null,null,null,null,5,7,null,null,null,6,null,6,4,5,5,null,null,null,null,null,null,4,7,null,5,null,6,6,null,6,6,null,null,5,6,6,6,5,null,6,null,4,5,4,5,null,5,null,3,null,7,null,null,6,null,null,null,null,null,6,null,6,null,null,5,null,null,3,null,null,null,null,4,null,null,7,null,null,null,null,null,null,3,5,null,null,6,null,4,null,5,null,5,null,null,null,null,6,7,4,4,4,4,6,null,null,null,null,null,5,4,5,null,7,8,6,null,6,5,6,5,4,null,5,5,5,4,5,null,null,null,8,5,null,null,null,null,null,6,null,null,5,7,6,null,5,4,5,null,null,null,4,4,5,7,null,null,5,8,5,null,5,null,4,null,4,null,6,null,null,null,7,null,null,null,null,4,null,4,3,null,null,null,null,null,null,null,6,null,4,null,null,null,5,null,null,null,null,5,null,7,7,null,5,7,null,5,null,null,5,null,6,5,6,null,null,4,null,null,null,null,null,null,4,null,4,null,null,null,6,5,null,6,3,4,null,5,null,null,5,null,5,5,6,null,4,null,null,4,9,null,5,null,3,5,null,null,6,4,4,null,null,6,null,3,5,5,null,4,7,5,5,null,null,null,6,5,null,null,5,null,7,6,null,null,3,4,null,5,null,null,null,6,null,3,null,null,null,null,null,5,null,null,5,null,5,null,5,null,null,null,7,null,4,null,5,null,null,7,null,3,5,6,null,null,7,null,4,null,5,3,7,3,5,null,7,null,3,7,null,4,7,5,null,null,null,null,null,null,null,null,null,null,null,3,null,4,null,6,null,null,null,null,null,null,null,null,7,7,7,6,6,null,null,null,null,null,null,null,null,5,6]
[null,"Mohuřice",null,null,7,null,null,6,6,6,null,null,null,7,null,7,null,null,null,null,null,null,null,null,null,null,5,null,null,2,5,6,null,null,null,null,7,null,null,null,8,null,null,8,5,null,null,8,null,10,5,null,null,4,null,null,null,9,null,null,null,8,null,null,null,3,5,8,8,7,null,7,null,6,null,5,null,null,null,null,5,5,4,5,5,null,null,null,6,7,7,4,null,null,4,6,7,3,null,10,4,8,null,null,null,6,null,9,null,5,null,4,9,null,null,7,null,null,null,null,3,6,null,7,8,null,6,null,null,6,null,null,7,4,7,null,null,null,null,null,null,null,null,5,null,null,null,null,4,5,7,9,null,3,6,6,null,7,null,null,null,5,null,null,null,5,null,6,6,5,null,6,null,null,6,6,4,6,null,null,5,5,null,null,3,7,6,null,6,null,null,8,7,7,null,null,null,null,3,null,null,null,null,5,null,null,5,null,6,null,null,null,null,null,null,6,8,null,6,null,8,7,null,7,null,5,8,null,null,6,null,5,null,11,null,7,null,null,null,null,8,null,null,null,4,null,10,null,null,null,9,3,7,null,5,7,null,null,6,6,null,8,null,null,null,7,null,6,null,null,3,8,7,6,null,null,null,null,null,8,null,null,null,7,null,null,6,9,null,null,5,8,5,null,null,null,null,7,null,6,null,null,3,null,null,null,6,7,8,7,4,6,null,null,null,5,null,null,5,5,5,null,7,null,null,null,null,null,null,null,8,null,null,null,9,10,7,null,null,null,null,6,5,6,6,null,5,null,null,null,8,null,null,null,5,8,null,4,null,null,null,null,null,8,5,5,5,9,null,8,null,5,null,5,6,null,6,null,null,5,3,8,9,7,7,null,7,5,null,5,7,6,null,null,5,null,8,9,null,null,null,null,8,7,7,6,null,5,null,4,null,6,4,3,null,9,6,6,null,null,5,null,7,null,6,null,6,8,null,null,6,null,8,6,5,null,null,null,6,7,null,5,3,null,null,null,null,null,null,4,null,null,5,null,4,null,null,5,7,null,null,3,null,null,null,7,null,5,7,5,6,null,5,5,null,null,3,5,null,6,5,7,7,null,8,null,null,6,6,null,null,null,null,null,5,null,8,7,null,6,null,7,null,null,null,5,null,4,6,null,null,null,null,5,5,null,8,9,null,6,6,null,6,5,null,7,4,4,null,4,6,8,null,null,null,null,7,6,null,7,7,6,null,null,5,null,null,4,null,null,null,null,null,7,null,5,null,null,null,5,7,null,6,null,6,6,null,null,null,6,3,7,6,null,5,9,7,6,null,9,null,7,null,null,8,null,null,null,null,null,null,6,9,6,null,5,4,null,8,6,5,null,null,7,3,5,6,7,null,null,null,6,6,null,7,4,null,8,null,8,6,7,5,null,6,null,null,6,null,7,null,null,6,6,7,8,null,null,7,null,null,null,null,7,7,6,null,7,null,null,7,2,null,6,7,8,8,6,5,7,null,null,6,null,6,null,null,8,null,7,null,null,null,null,4,7,7,3,5,null,null,7,7,6,7,null,4,4,5,null,null,null,null,null,4,null,3,null,6,4,null,null,null,null,null,null,null,3,null,null,6,5,null,null,null,null,null,7,9,null,5,5,5,null,7,null,null,9,8,null,6,null,5,9,null,null,7,null,null,null,null,null,4,null,null,6,5,6,3,null,6,9,7,7,null,null,5,null,null,null,4,7,9,null,null,null,null,6,null,null,6,null,6,null,8,6,5,6,9,null,5,null,null,6,4,null,4,null,null,4,5,null,null,null,null,4,null,null,6,5,null,null,null,null,5,null,8,null,null,5,null,6,null,7,null,6,6,null,6,5,null,null,8,7,9,null,null,null,6,null,3,7,7,8,7,null,null,null,7,null,null,7,6,null,null,null,6,7,null,null,6,null,null,4,null,6,null,5,6,6,null,7,7,null,null,null,null,3,null,null,4,7,null,4,null,4,null,null,5,5,7,7,null,null,5,6,6,null,null,null,null,null,null,8,null,7,7,7,null,7,8,9,null,null,null,null,null,null,6,null,7,6,null,4,5,null,2,null,4,null,7,6,5,6,5,null,5,null,null,5,null,null,null,null,null,null,null,5,null,6,5,6,null,4,null,8,null,5,7,null,4,null,null,6,null,9,6,null,null,6,5,8,6,4,7,null,5,null,7,null,7,null,null,null,4,7,null,null,8,5,null,null,null,null,5,null,null,8,null,null,null,null,null,null,null,null,null,4]
[null,"Dobrkovská Lhotka",7,null,null,null,7,null,null,null,3,6,null,8,null,8,5,5,null,null,null,6,null,null,7,null,null,6,null,null,null,7,6,null,null,8,8,6,null,null,9,8,6,10,null,6,null,null,null,11,null,5,null,5,7,6,null,11,null,8,8,null,null,7,null,null,6,null,null,8,6,null,6,null,null,6,null,null,null,5,null,6,5,null,7,null,7,6,null,null,8,null,null,5,null,null,9,null,null,12,null,10,null,6,null,null,10,null,null,null,null,5,10,8,6,null,null,5,null,null,4,null,6,null,10,null,8,6,null,null,null,null,null,null,null,null,null,null,null,8,null,null,null,7,5,null,5,5,5,6,9,11,7,4,7,null,5,9,7,null,7,null,null,8,5,null,null,7,8,6,8,8,null,null,null,null,null,7,null,null,7,null,null,null,4,8,8,7,null,null,6,null,9,8,null,null,null,null,5,null,null,null,8,6,null,6,null,7,null,null,7,7,null,6,null,7,9,7,null,null,10,null,8,null,null,null,10,6,6,null,null,null,null,12,null,null,6,9,null,null,null,null,5,null,null,8,12,null,5,8,null,5,null,null,null,null,9,null,null,null,8,9,null,5,null,null,null,8,null,null,null,10,9,null,null,4,null,null,null,10,9,7,4,9,null,null,null,11,null,5,7,10,6,null,4,7,null,8,null,7,6,6,null,null,null,8,7,null,null,null,6,7,null,null,null,6,5,null,null,7,null,4,null,null,8,6,null,6,null,6,null,6,null,8,null,11,8,null,5,null,6,null,6,null,8,null,7,6,8,5,9,null,null,8,7,null,null,5,6,null,null,null,null,null,6,null,null,null,null,10,9,null,null,6,null,null,7,null,null,6,4,9,null,9,null,7,null,null,null,null,null,7,7,6,null,9,10,null,null,null,null,7,null,8,8,null,null,null,null,5,6,7,null,4,null,null,8,null,null,null,null,5,9,null,7,null,null,null,null,null,null,7,null,null,null,7,8,null,8,8,6,null,5,4,null,null,null,null,9,6,5,null,null,null,5,null,null,null,null,3,null,5,null,7,null,9,null,7,null,6,null,null,6,null,null,8,4,6,null,null,7,null,null,9,null,null,null,null,null,4,null,null,null,8,6,8,null,8,7,null,null,8,null,null,5,6,null,null,null,7,null,7,6,null,6,null,9,11,5,null,null,8,8,null,null,8,null,5,null,6,null,9,8,null,null,null,null,null,9,null,null,null,null,6,6,null,null,null,null,8,5,7,null,null,null,null,null,null,null,null,null,6,null,null,null,null,null,null,8,null,null,8,null,null,6,10,null,null,null,11,7,null,null,8,9,5,8,null,8,null,7,7,11,null,4,null,6,3,null,null,null,7,9,9,5,7,8,null,null,8,null,7,7,null,8,null,null,null,6,null,8,null,6,null,null,null,7,null,null,null,6,8,null,8,null,null,7,7,null,null,4,null,null,8,null,7,8,9,null,null,8,4,null,null,null,null,null,null,7,9,null,null,8,null,null,7,null,null,4,8,9,null,5,null,null,null,8,null,null,null,7,8,null,8,null,null,null,6,null,null,7,null,5,8,5,9,4,5,7,null,7,null,null,null,null,null,null,null,6,null,null,null,null,5,7,null,null,null,11,null,null,null,7,null,null,null,6,null,null,6,7,null,null,11,null,null,null,8,null,null,null,null,6,8,null,null,7,8,null,5,null,null,null,null,null,5,6,7,8,4,null,null,11,null,6,null,5,null,5,6,null,null,7,null,null,7,null,7,11,7,null,null,8,null,6,null,null,7,null,6,null,null,5,null,null,6,5,3,null,6,null,null,null,null,6,4,10,9,null,6,null,null,8,8,6,null,7,null,null,7,8,9,null,8,10,null,null,9,8,null,5,null,8,9,null,5,6,7,null,6,5,null,7,null,null,null,null,null,9,7,null,8,9,5,7,8,7,null,7,null,null,null,8,8,null,null,6,null,null,null,5,null,5,null,null,null,null,8,7,6,null,8,null,4,6,null,7,null,6,8,null,6,null,null,null,9,null,null,6,8,null,null,7,null,null,4,5,6,7,null,null,7,8,null,null,6,4,null,null,null,9,null,7,null,null,7,null,null,null,null,5,9,7,6,null,8,null,null,9,null,7,7,8,null,null,10,null,null,null,null,5,null,4,null,null,11,8,6,null,7,6,9,null,6,null,5,null,null,null,null,null,null,4,4,null,null,7,6,10,7,null,8,4,6,null,null,null,null,8,null,null,8,null,5,4,5,9,null,null,null,7]
[null,"Dolní Lhotka",null,null,null,null,8,7,null,null,4,null,null,9,null,null,6,6,null,null,null,7,7,null,8,8,null,null,8,null,null,8,7,7,null,null,9,7,4,null,null,null,null,11,7,7,8,null,5,null,null,6,null,6,null,null,null,12,null,null,9,null,null,null,4,null,null,null,null,null,7,null,7,null,8,null,null,null,null,null,null,7,6,6,8,null,null,null,null,9,null,null,null,6,5,7,10,5,null,null,5,null,5,7,null,8,null,null,null,6,null,6,null,null,null,null,7,6,null,null,5,7,7,null,null,null,null,null,7,7,null,null,9,null,8,6,null,8,6,9,null,8,null,null,6,null,6,6,null,7,10,12,null,null,null,8,6,10,null,8,null,null,6,9,6,null,null,null,null,null,null,null,null,null,null,null,5,null,8,null,null,7,6,null,null,9,null,8,null,6,7,null,null,null,null,null,10,null,null,null,null,null,9,null,6,null,6,null,null,9,null,null,null,7,null,null,null,null,null,6,11,null,9,null,9,6,null,7,7,null,null,6,null,null,9,9,7,10,6,null,9,5,6,8,5,9,null,7,null,9,10,null,null,4,6,null,null,6,null,null,9,null,null,null,null,8,null,null,null,4,5,null,null,7,8,null,null,7,null,null,null,null,5,null,7,null,null,12,9,null,8,null,7,5,null,null,null,null,null,8,null,null,null,null,4,9,8,null,9,null,7,null,5,null,8,null,6,null,6,null,null,5,null,null,9,null,null,7,6,null,9,null,5,null,10,null,null,null,6,null,7,8,7,7,9,9,8,7,9,null,10,6,7,null,8,10,null,null,null,null,5,7,null,null,null,7,6,11,6,11,null,null,null,7,null,5,8,null,6,null,null,null,null,null,null,null,null,null,9,7,null,8,null,null,null,null,null,11,null,6,6,null,null,9,9,8,null,6,null,null,null,8,5,null,null,11,null,null,null,null,7,null,10,null,null,null,8,null,8,null,8,8,null,null,null,8,9,9,null,9,null,null,6,5,null,null,null,null,null,null,null,6,6,5,6,null,4,7,9,null,9,null,5,8,null,null,null,8,8,7,7,null,null,null,6,9,null,null,6,null,null,null,9,10,null,6,null,8,null,5,null,null,6,9,null,null,9,9,8,null,null,9,null,null,null,7,null,null,8,null,5,null,null,7,7,5,null,null,null,7,7,9,9,null,null,null,null,null,7,null,null,10,9,6,null,9,9,7,10,null,8,null,6,7,7,9,null,5,8,null,6,8,4,null,8,null,null,6,null,null,9,null,null,8,7,null,null,null,9,8,4,9,null,null,7,null,8,null,5,12,8,null,5,null,null,6,9,6,9,5,8,null,null,8,5,null,7,4,10,null,7,8,10,null,6,null,null,null,7,9,5,8,8,null,null,6,8,10,7,null,9,null,null,7,7,null,8,8,null,null,null,null,7,null,null,null,null,8,null,null,null,5,null,null,null,8,9,10,null,8,null,null,4,null,null,null,null,8,8,null,null,6,9,null,null,8,8,10,null,9,null,7,6,8,5,null,null,null,null,null,null,9,null,9,null,6,null,7,6,9,null,null,6,null,null,10,null,6,null,5,null,5,null,7,null,8,null,5,null,null,8,6,7,6,null,null,null,8,null,5,null,null,8,null,null,null,null,null,null,null,null,8,6,null,9,null,9,null,null,null,null,null,7,9,null,null,8,null,4,null,7,10,null,null,null,null,null,null,9,null,6,9,null,8,7,6,null,7,6,7,7,6,null,null,null,8,null,null,null,null,7,null,9,null,7,6,5,null,null,7,null,null,6,null,3,null,6,4,7,null,5,5,6,6,7,null,11,null,null,null,null,null,null,null,7,7,8,null,8,8,null,10,9,null,11,null,8,10,9,null,6,null,null,null,9,null,null,null,null,null,null,9,null,null,4,5,7,null,10,8,null,9,null,null,8,9,8,7,null,null,6,null,null,9,5,null,null,null,null,11,null,null,null,null,null,5,6,null,8,7,null,9,null,null,null,8,null,6,7,9,null,7,null,9,null,10,9,8,7,9,9,11,null,null,6,null,null,null,null,null,null,8,null,null,6,null,5,6,6,null,null,null,8,null,6,8,null,8,6,null,6,null,null,7,null,null,null,7,null,8,null,8,9,5,null,null,6,null,null,8,6,null,null,null,null,12,9,7,null,8,null,10,null,7,null,null,null,null,null,null,9,6,5,5,6,null,8,7,null,null,7,null,5,null,null,null,null,null,null,8,7,9,5,6,5,6,10,5,null,7,8]
[null,"Záluží",8,null,null,null,null,8,null,7,null,null,null,null,null,null,null,null,6,4,5,null,8,null,9,null,7,7,9,null,7,null,8,null,null,9,null,null,5,4,10,9,null,12,8,null,9,9,null,12,6,7,9,7,8,null,3,13,null,null,10,null,7,null,5,null,null,10,null,null,null,null,null,8,null,null,null,null,8,null,7,null,null,7,null,null,null,null,null,10,null,6,null,7,null,8,11,6,null,13,null,null,null,null,9,null,null,null,6,null,null,7,null,null,null,null,null,null,null,null,null,8,8,8,11,5,9,null,8,null,null,null,10,null,null,null,null,null,7,null,null,9,9,null,7,null,null,7,null,null,null,null,null,5,8,null,7,null,8,9,null,6,null,null,null,6,null,null,9,7,9,9,null,null,7,null,null,8,null,6,8,8,null,6,5,10,null,null,8,null,null,9,10,9,5,6,null,null,6,8,8,null,null,7,7,7,null,null,7,null,null,8,null,null,7,null,null,null,7,null,null,8,10,null,10,7,null,8,8,7,6,7,null,13,null,10,8,null,7,7,null,null,null,null,null,10,null,null,6,10,null,null,null,null,7,8,10,null,7,null,null,10,null,6,null,null,7,9,null,5,6,11,10,null,null,null,null,null,null,11,null,8,null,10,null,7,8,13,null,6,9,null,null,6,5,null,7,null,7,9,null,null,4,7,null,null,null,9,null,null,null,8,null,null,null,7,7,7,7,8,6,6,null,5,null,7,null,null,null,null,10,null,6,null,11,null,null,5,7,null,null,null,null,null,null,10,null,8,10,6,null,null,8,9,null,11,null,6,7,null,6,null,5,9,null,null,null,null,null,null,null,7,6,null,8,null,9,null,null,null,null,null,null,null,9,null,null,null,10,8,null,9,8,7,null,null,null,12,null,7,null,8,9,10,10,null,6,7,null,6,7,null,null,null,null,12,null,null,null,null,null,null,null,5,8,null,null,null,9,null,9,9,null,8,6,null,null,10,9,null,null,7,7,6,null,8,null,8,10,null,6,null,null,6,7,null,null,8,10,4,10,6,6,null,null,10,null,9,9,8,null,null,7,7,null,10,null,7,7,7,8,9,10,null,9,null,null,9,null,6,9,null,null,null,7,null,null,10,null,null,6,10,null,null,null,null,null,null,null,null,null,8,7,null,null,null,10,null,6,null,null,null,null,null,6,9,null,6,8,null,8,null,null,7,null,10,null,null,null,9,9,null,null,null,8,null,null,null,null,null,7,null,5,null,null,6,null,7,null,7,null,7,null,9,8,7,null,4,null,null,null,10,7,null,null,null,9,null,null,13,9,9,null,9,10,null,null,7,10,null,null,null,null,9,null,null,8,5,11,7,8,9,11,10,7,null,9,9,null,10,6,null,9,null,null,7,null,null,null,null,10,null,null,8,null,null,9,9,null,8,7,null,null,9,null,10,8,null,null,null,null,null,null,null,null,9,10,11,null,null,null,null,5,null,9,9,null,9,9,10,null,null,10,null,null,null,9,11,5,10,10,null,null,9,null,null,null,null,null,7,null,null,8,null,9,null,null,null,null,null,8,null,7,null,6,11,null,null,null,null,null,6,4,8,5,null,null,null,null,null,null,null,8,null,8,5,null,null,12,6,7,7,null,null,null,null,null,11,null,7,8,null,null,12,10,8,null,null,null,7,7,5,null,null,null,8,null,9,5,null,8,11,8,null,null,null,7,8,10,5,null,10,12,null,8,null,null,8,null,null,null,7,8,7,10,null,6,8,null,8,null,6,10,7,null,7,6,null,null,null,7,null,7,null,4,null,7,null,8,null,6,6,7,null,8,null,12,10,7,null,5,8,null,9,8,null,9,null,null,null,9,11,null,9,12,null,9,null,null,null,7,8,null,null,null,6,null,8,null,null,null,10,null,null,null,null,null,9,11,9,null,10,null,6,9,10,null,null,null,8,7,null,null,null,null,6,7,null,null,12,null,null,6,null,6,null,null,null,9,8,8,10,null,5,null,null,null,7,8,null,7,8,null,null,6,null,10,null,null,10,null,12,null,7,7,null,null,null,null,7,null,9,null,5,null,7,null,7,7,3,null,null,9,null,null,9,6,null,null,7,null,null,8,8,null,9,7,null,10,null,8,9,null,null,7,11,7,7,8,null,7,null,null,null,null,13,10,8,9,9,null,11,7,null,8,null,6,null,null,null,10,null,6,null,7,8,null,null,null,8,8,null,null,null,null,null,null,null,null,null,null,10,6,7,6,null,null,null,5,null,9]
[null,"Slavče",null,6,8,null,6,null,null,null,null,5,null,null,5,null,null,4,null,null,null,5,6,5,6,null,6,null,7,3,6,null,null,null,5,7,null,null,3,3,null,7,null,9,6,5,7,null,4,null,null,null,8,null,null,null,2,10,5,7,7,null,6,6,null,4,null,9,9,null,5,null,null,7,7,null,null,3,7,4,6,null,null,null,6,7,null,5,null,8,null,5,6,4,null,null,8,4,6,11,null,9,null,5,8,7,9,null,5,null,null,null,null,null,5,8,null,null,null,null,null,null,5,null,9,null,7,5,6,null,5,4,8,null,null,null,null,7,5,null,6,7,8,6,null,null,null,null,null,null,8,10,null,null,null,7,null,8,null,7,null,null,5,null,null,null,null,null,7,null,null,7,null,6,null,null,null,null,7,null,6,6,5,5,null,null,7,6,7,null,5,null,8,null,null,null,9,4,4,null,7,null,7,null,null,null,null,6,null,8,6,6,6,5,6,null,null,6,null,null,9,null,7,8,8,null,9,5,null,null,5,null,6,null,null,8,null,8,5,6,null,null,null,7,null,7,11,6,4,null,null,4,null,null,null,null,8,5,null,null,7,null,null,4,null,null,6,7,6,3,4,9,8,null,7,null,null,6,null,9,8,null,null,8,null,null,7,10,8,null,6,9,null,null,null,null,null,null,null,null,null,null,null,6,null,7,null,8,null,8,5,null,null,8,7,null,4,6,null,6,null,null,null,4,null,null,8,null,null,null,null,null,4,7,null,null,null,4,4,null,5,7,null,null,7,8,6,null,7,4,null,null,null,null,6,9,5,null,5,7,4,6,null,null,null,6,null,10,null,9,null,6,null,null,7,4,null,null,5,null,null,null,null,8,8,null,8,null,8,6,8,null,6,null,6,8,9,10,null,null,null,null,null,null,null,7,5,null,6,null,5,null,null,null,null,10,7,null,6,8,6,4,8,null,null,null,7,null,7,null,7,null,null,7,null,6,7,8,7,null,5,6,4,null,5,7,5,7,8,5,4,null,null,null,null,null,null,6,8,null,8,4,null,6,6,8,null,6,null,null,null,null,null,6,null,7,null,null,5,null,6,8,8,8,null,null,null,7,7,3,null,null,null,7,null,7,null,null,null,null,null,null,null,null,null,null,null,5,7,6,4,6,5,6,null,null,null,10,4,null,null,7,7,6,null,null,5,null,null,5,7,null,7,5,null,8,8,null,8,8,null,7,null,null,null,8,null,null,7,7,4,6,null,null,null,null,7,null,null,6,8,5,null,7,null,null,null,null,7,7,null,null,null,8,null,null,null,7,null,10,6,8,null,7,null,4,7,null,7,4,null,null,10,7,null,6,5,null,9,null,6,null,8,8,4,6,7,8,6,null,4,null,null,null,null,5,null,9,5,null,7,8,null,null,null,null,null,7,null,null,5,null,null,7,null,9,null,6,null,null,null,null,null,null,null,null,7,8,3,null,null,3,null,null,8,null,null,7,6,8,4,null,7,null,null,null,7,9,null,null,8,null,4,null,null,8,null,null,6,null,6,null,null,7,8,null,5,5,null,8,null,5,null,null,null,null,null,null,null,null,null,4,null,6,null,null,8,4,null,null,7,null,6,4,null,null,null,null,10,null,6,6,6,8,null,null,null,10,null,null,null,7,null,10,null,null,8,7,null,null,null,null,5,7,7,7,6,7,null,null,null,null,null,8,4,4,null,6,7,3,5,8,10,null,null,null,null,null,4,null,null,5,null,6,9,null,null,null,10,6,6,null,null,null,5,5,null,null,null,5,6,9,null,5,null,5,null,null,null,null,null,null,null,null,null,null,9,8,6,null,null,7,null,null,5,null,null,null,7,6,null,8,null,null,null,9,7,null,7,null,4,null,null,null,8,null,null,6,null,null,null,8,null,null,3,null,null,8,8,null,null,7,8,null,6,7,6,6,null,7,null,8,null,7,4,null,null,null,null,null,null,8,null,5,null,null,null,7,6,null,null,null,null,null,null,7,null,5,null,null,null,null,null,null,5,8,8,null,5,null,null,10,null,6,5,null,null,null,null,6,null,null,null,null,null,null,3,null,5,2,8,null,6,7,null,6,null,7,null,6,null,8,6,5,4,7,null,6,8,7,6,null,null,null,null,9,null,6,null,7,null,null,null,null,null,10,7,5,null,null,null,null,null,5,null,null,null,null,null,6,8,null,null,null,5,null,6,5,9,6,6,7,null,null,null,null,8,null,null,null,null,7,null,null,null,null,8,null,null,6,6,7]
[null,"Lniště",null,null,null,null,5,null,null,5,null,null,6,null,4,6,null,null,5,null,4,null,5,4,5,null,null,null,6,null,null,5,null,6,null,null,6,5,2,null,7,null,5,7,null,4,6,7,null,9,null,null,7,null,null,5,null,8,null,null,null,7,5,5,3,null,null,7,7,null,null,6,null,null,6,4,8,null,null,null,4,null,null,null,4,null,null,null,null,6,6,3,null,null,3,null,6,null,null,9,null,7,null,4,7,5,8,8,null,4,5,null,8,7,null,null,6,null,5,6,null,5,4,6,7,4,5,4,null,5,4,null,null,null,6,null,null,6,null,null,5,null,null,null,null,6,4,4,null,null,6,null,6,null,null,null,null,null,null,null,null,null,4,7,4,null,null,5,null,null,7,null,4,null,null,null,3,5,null,5,null,null,null,null,null,6,null,null,5,null,null,7,null,null,null,null,8,null,null,7,null,null,null,null,5,5,4,5,null,7,5,null,null,null,5,null,7,5,5,null,7,null,null,6,7,4,7,null,null,null,null,4,null,10,8,6,null,null,null,5,7,null,null,null,null,6,9,null,null,7,8,null,6,null,null,null,null,4,5,null,6,null,5,null,7,6,5,null,null,null,null,null,null,null,6,null,null,5,null,null,7,6,null,6,6,6,5,null,7,null,4,7,null,null,null,null,6,6,6,null,5,null,null,null,null,6,null,null,7,null,null,5,null,7,null,null,null,null,null,4,null,null,6,null,7,null,7,5,null,5,7,null,null,6,8,9,null,null,null,null,null,5,null,5,5,7,null,5,null,null,null,5,6,7,4,null,4,3,null,6,null,5,null,7,4,4,null,8,null,7,null,null,5,4,null,null,null,null,null,null,null,7,8,6,null,null,6,null,7,4,null,5,null,5,null,null,7,8,6,null,5,6,7,6,6,null,null,null,5,3,null,null,null,null,6,null,null,null,null,7,null,null,6,null,5,7,null,7,6,5,5,null,null,null,null,null,6,null,null,6,4,null,null,null,null,null,null,6,7,null,null,null,null,4,null,null,null,4,null,null,null,null,null,5,null,null,null,null,null,null,5,3,null,null,null,null,null,null,4,null,null,6,null,7,7,null,4,5,null,2,null,null,null,6,4,6,7,null,6,5,5,6,null,null,null,null,null,null,null,5,null,null,null,null,4,null,7,8,null,null,null,null,null,null,null,6,null,null,6,null,5,7,6,4,null,7,6,null,7,6,6,5,null,null,null,null,8,null,null,6,null,null,null,6,7,4,6,5,null,null,null,null,null,null,null,null,null,3,6,5,2,null,null,7,4,8,6,null,4,8,null,null,null,6,null,null,null,null,null,null,null,5,8,null,null,null,null,null,null,null,null,6,7,6,null,4,null,null,null,7,null,null,5,null,6,null,7,null,4,null,null,6,null,null,null,null,6,null,4,null,4,7,5,null,6,7,6,null,null,5,null,null,8,6,6,5,null,null,null,7,null,null,null,null,null,7,7,null,null,null,null,5,null,null,null,6,6,null,null,6,null,null,null,7,null,null,null,null,null,null,5,null,null,5,6,null,null,null,null,7,null,null,null,null,null,8,null,null,null,3,6,3,null,null,null,7,7,null,5,null,null,null,null,null,6,4,3,null,8,null,null,null,null,7,null,null,null,8,7,null,5,6,4,8,null,7,null,null,null,null,6,null,3,6,6,null,null,null,null,null,null,null,6,6,3,3,null,5,null,null,null,6,8,7,null,null,null,null,null,null,5,null,5,null,null,5,4,null,null,null,null,null,7,5,null,null,null,null,5,3,null,8,null,null,2,null,null,2,5,4,4,null,null,5,4,null,7,7,5,null,null,5,7,6,4,null,5,4,null,null,null,null,7,6,8,8,6,8,5,null,null,null,6,7,6,null,5,5,null,5,4,6,null,null,null,null,null,6,7,null,null,null,7,null,5,5,null,null,5,null,5,6,6,null,null,5,null,null,5,10,null,6,null,null,null,null,5,null,null,null,6,6,7,null,4,null,null,null,5,null,6,null,5,7,null,null,6,6,null,6,null,8,null,null,null,null,null,5,null,null,6,null,7,null,4,5,null,5,null,null,6,5,4,null,null,null,null,6,null,4,null,null,5,null,null,6,6,null,null,null,4,null,7,null,null,null,null,null,6,6,null,8,null,null,null,8,null,4,8,5,null,null,null,null,6,4,4,null,null,null,6,5,null,null,null,6,5,null,7,null,5,null,null,null,null,4,7,null,null,null,null,null,null,null,null,null,7,null,4,5]
[null,"Chvalkov",9,null,9,null,null,9,7,null,null,null,7,null,null,null,null,null,7,5,6,null,null,null,null,null,8,null,null,null,8,null,null,null,6,null,10,null,null,5,11,null,7,null,null,8,null,null,null,13,7,null,10,8,null,7,null,14,6,null,11,9,8,8,null,null,7,11,null,null,8,8,8,null,null,null,9,null,9,null,null,null,null,8,null,8,8,7,null,11,9,null,7,8,null,9,null,null,7,14,null,11,null,8,null,null,11,10,null,7,null,8,null,null,null,9,null,null,6,null,6,null,9,null,null,null,null,7,null,8,6,null,11,5,null,null,null,9,null,null,null,null,10,8,8,null,null,8,null,null,null,13,8,null,null,null,null,null,9,null,null,null,null,null,null,7,6,null,10,null,null,null,5,null,null,null,null,9,null,null,9,9,null,null,6,11,null,9,null,null,8,10,null,10,6,null,null,null,7,9,null,null,null,8,8,8,null,8,8,null,null,null,7,null,8,null,null,null,null,7,null,9,null,9,null,8,null,null,null,null,7,8,null,14,10,11,9,null,null,8,null,null,null,null,6,11,null,null,7,null,11,6,8,null,null,9,11,null,null,7,null,11,6,7,8,9,null,10,null,6,7,12,null,null,null,5,null,null,null,12,null,null,null,11,null,null,null,null,10,null,null,11,8,null,6,null,8,null,8,null,null,null,5,null,null,null,null,10,10,null,null,null,null,null,9,null,8,null,8,9,null,null,null,null,null,8,9,8,7,7,11,null,null,9,null,null,9,6,8,7,null,null,null,null,null,null,null,null,11,null,null,7,9,null,null,null,6,7,8,null,null,null,null,10,null,null,null,12,7,null,10,8,7,8,9,6,10,6,null,7,null,null,null,null,null,null,null,null,null,null,null,null,9,null,null,10,null,null,7,null,7,9,null,null,11,null,7,8,null,null,null,null,6,5,null,null,9,null,7,9,null,null,null,null,null,8,9,null,null,6,null,null,9,9,null,9,10,11,null,10,7,8,8,7,6,9,null,null,11,null,null,7,7,null,8,null,5,null,11,null,11,7,null,null,null,11,null,10,null,null,8,null,null,null,7,11,null,null,null,null,null,10,11,null,10,null,null,null,8,null,10,5,null,null,8,null,10,11,null,7,7,11,7,null,null,null,null,6,null,8,null,9,null,null,8,6,11,null,7,8,8,10,10,null,7,10,null,null,null,7,null,11,10,null,7,11,null,null,11,null,null,8,null,8,null,null,9,null,9,null,null,null,6,null,null,null,8,null,null,8,10,null,7,10,null,null,null,null,null,9,null,11,null,null,8,null,null,8,null,14,10,10,6,10,11,null,null,null,11,null,9,null,12,10,null,null,9,null,12,null,9,10,null,null,null,8,10,10,8,null,null,null,null,6,null,null,null,11,null,9,11,null,null,null,null,null,null,null,5,9,null,9,null,null,null,11,9,null,8,null,5,null,null,null,8,null,null,null,4,null,null,5,null,null,null,10,null,null,null,null,null,null,null,5,7,9,10,12,6,null,11,8,null,10,null,null,null,4,7,8,8,null,9,10,10,7,6,8,7,10,null,null,null,null,null,null,null,null,8,null,null,null,null,null,null,null,9,null,7,4,null,null,9,null,9,6,4,null,null,null,null,null,null,null,null,3,null,null,null,8,9,null,null,null,null,9,null,9,6,8,null,6,null,null,8,9,null,null,6,6,9,12,9,null,null,6,8,9,11,null,7,null,13,null,null,null,null,null,null,null,8,8,null,8,11,9,null,null,12,9,8,null,null,8,null,null,null,8,null,8,null,null,8,6,5,null,8,5,9,null,null,7,null,null,9,null,13,11,null,null,null,9,null,null,null,8,null,null,null,null,null,null,10,null,13,null,null,11,null,6,8,null,9,null,10,null,7,null,8,null,null,11,null,null,null,6,null,10,12,10,null,11,10,null,null,11,null,8,null,null,null,null,9,10,null,null,null,4,6,13,6,null,7,null,null,null,7,null,10,null,null,null,null,6,7,9,null,null,null,10,8,9,null,null,null,null,null,null,null,null,10,null,null,8,8,5,6,7,null,8,null,null,9,6,null,null,6,null,8,null,10,7,null,8,null,null,7,null,7,null,7,null,null,null,5,10,8,8,11,null,9,10,null,null,null,12,8,8,9,9,8,null,null,7,3,null,null,9,null,null,null,null,8,8,null,null,null,6,8,7,null,7,null,null,null,9,9,null,null,9,null,9,null,7,6,null,9,null,9,9,null,11,null,8,null,null,11,null,6,null,null,8]
[null,"Čížkrajice",null,7,10,null,null,null,8,8,null,null,null,null,null,9,null,7,null,null,7,null,null,6,null,9,null,8,null,null,null,null,null,8,null,10,null,null,null,6,null,10,8,null,null,9,null,null,null,null,8,null,11,9,null,null,4,15,null,null,12,null,null,null,null,5,null,12,null,null,9,null,null,null,null,7,null,null,10,6,8,8,null,null,null,null,null,8,null,null,null,null,null,null,6,null,null,null,null,15,null,null,null,null,10,9,12,11,7,null,null,null,null,null,7,10,null,7,null,7,null,null,null,null,null,null,null,null,9,9,null,null,12,null,9,7,null,10,8,null,null,10,null,null,9,null,7,9,null,null,11,null,null,null,null,null,8,null,10,10,8,null,null,10,null,null,null,8,null,null,null,10,6,null,8,7,null,null,null,7,null,null,null,null,null,null,null,null,null,null,null,null,null,null,7,null,null,null,null,null,9,null,10,9,null,9,7,9,9,null,8,9,8,null,9,null,10,null,8,8,null,10,11,10,null,9,11,null,9,8,null,null,7,15,null,12,10,null,null,null,null,null,null,null,7,null,null,null,null,null,null,7,null,null,null,10,null,null,null,8,10,12,7,8,9,null,null,11,7,7,8,null,11,null,null,6,7,null,7,13,null,null,null,null,8,null,9,null,11,7,10,null,null,null,null,8,null,9,9,null,null,7,6,8,5,null,null,null,11,null,null,9,6,9,null,8,9,null,null,10,null,null,null,6,10,9,null,9,8,8,12,7,7,10,12,null,null,7,null,null,null,null,null,null,null,null,null,null,null,7,null,null,null,null,null,12,7,8,null,8,null,8,null,null,null,8,7,null,null,12,null,null,null,null,null,null,null,null,null,null,null,10,null,10,10,null,null,6,11,9,null,null,10,null,null,null,11,13,8,null,8,10,10,11,null,9,8,9,7,7,8,9,null,6,7,null,10,7,8,null,null,null,null,null,9,null,null,null,null,7,null,10,10,null,7,10,null,12,10,null,8,null,9,8,7,10,null,9,null,null,null,8,8,7,null,null,6,9,null,null,null,null,null,null,null,12,5,11,10,null,null,4,8,null,null,null,5,null,null,8,9,11,12,11,null,7,5,10,9,7,11,null,7,10,9,null,null,null,null,null,8,null,null,null,6,8,null,null,null,null,6,10,8,null,9,null,12,12,null,null,9,11,11,7,null,null,6,null,9,null,null,12,11,8,null,null,10,8,null,null,10,null,null,9,9,10,null,6,10,null,null,9,7,null,9,7,null,8,null,null,11,null,8,11,9,null,null,null,10,10,null,null,null,null,null,null,10,9,6,15,11,null,null,null,null,null,10,8,12,6,null,null,null,11,null,null,null,6,13,null,10,null,12,11,8,null,11,11,9,11,null,9,10,null,null,null,null,null,null,null,null,null,7,9,null,8,10,10,null,null,null,null,null,null,8,12,null,null,null,null,6,null,null,null,null,10,null,null,5,null,9,6,null,7,null,null,9,null,10,11,5,7,null,null,8,null,null,13,null,11,12,9,null,11,6,null,9,null,8,null,null,null,null,null,null,null,7,9,8,null,9,6,8,null,null,null,5,null,null,null,8,null,null,null,null,null,null,null,null,5,null,null,null,7,null,7,5,null,null,null,null,8,9,9,8,null,null,12,null,null,null,null,null,13,null,null,10,10,null,9,null,7,null,null,9,10,9,10,null,null,null,null,10,null,5,7,9,null,null,6,null,11,14,null,null,7,null,9,null,null,9,null,9,null,null,null,7,9,null,10,9,null,null,9,null,null,null,null,null,null,null,null,null,null,6,7,null,null,null,7,null,null,8,7,10,5,14,null,null,null,null,10,9,10,null,9,10,null,null,9,10,12,null,null,null,null,null,null,10,7,null,9,null,10,null,null,8,9,null,null,null,12,null,null,5,7,8,null,null,null,7,12,null,7,10,12,9,null,null,9,8,null,null,null,null,null,8,5,null,null,null,null,null,null,null,6,8,null,null,null,null,null,8,null,null,10,8,8,null,null,9,10,null,null,7,null,11,null,null,null,11,null,8,null,9,6,null,null,null,9,8,null,null,null,null,8,7,null,null,4,null,8,null,null,null,10,null,null,null,8,8,10,9,null,null,11,9,null,12,9,null,null,null,null,null,13,null,null,null,null,9,9,null,null,4,null,11,null,10,null,null,null,9,null,9,6,7,null,9,null,null,8,null,6,null,null,null,8,null,null,null,null,null,null,7,null,10,null,null,10,8,12,null,9,null,null,null,null,null,null,10,9]
[null,"Boršíkov",null,8,null,6,9,null,null,9,5,null,8,null,null,null,null,8,null,6,8,null,null,null,null,null,null,null,10,4,9,null,null,null,7,null,null,null,null,null,12,11,9,null,null,10,null,null,6,null,9,8,null,null,null,null,5,null,7,null,null,null,9,null,6,null,null,null,null,9,10,9,null,null,null,null,null,4,null,7,null,9,7,null,9,9,null,null,null,12,null,null,8,null,7,null,12,7,8,16,null,12,null,null,null,10,13,null,null,null,null,null,null,null,8,11,null,8,7,null,null,9,10,null,12,null,10,8,null,10,7,null,null,6,10,null,null,null,null,null,7,null,null,null,null,null,null,null,6,8,null,14,9,6,null,9,null,null,null,null,null,null,7,null,null,null,null,9,null,null,null,null,7,null,null,null,null,10,null,null,10,null,null,7,null,12,9,null,9,null,null,11,11,11,8,7,null,null,null,10,null,6,null,10,null,null,null,10,null,10,null,10,null,null,10,8,11,null,9,9,12,11,null,11,11,null,12,null,10,null,8,null,8,16,11,13,11,11,8,9,10,6,null,9,null,null,null,8,8,null,null,8,null,5,null,null,null,null,8,null,null,13,null,9,null,null,8,12,8,8,9,null,null,8,null,null,null,null,8,14,null,null,null,null,null,null,10,null,12,8,11,12,9,null,null,null,null,10,null,null,null,8,null,9,6,10,null,11,12,null,8,null,null,null,10,null,10,8,null,null,7,null,8,7,11,null,10,null,9,9,null,8,null,null,null,12,10,8,null,8,null,null,null,null,10,11,9,9,12,8,null,8,10,null,9,null,8,9,null,null,null,9,null,null,7,9,8,null,8,null,null,null,null,null,10,null,null,7,null,null,5,null,10,11,11,8,null,null,12,null,9,10,11,8,7,11,12,14,9,8,9,11,null,null,null,10,9,null,8,8,null,10,7,7,null,null,11,null,null,10,null,6,11,6,10,9,null,null,null,8,null,11,null,null,null,null,null,13,11,null,9,null,null,9,null,null,6,null,null,7,7,9,null,null,9,null,null,null,null,null,null,8,null,null,null,13,null,null,null,null,9,5,null,null,8,null,null,null,null,9,null,null,13,12,null,null,null,11,null,8,12,6,8,null,10,9,null,12,9,8,9,null,8,5,null,null,null,7,null,null,7,11,null,8,10,null,13,13,8,null,10,null,12,8,null,11,null,7,10,null,null,null,12,null,8,null,null,null,null,null,null,null,null,null,null,null,10,7,11,null,8,null,8,null,null,8,null,null,null,null,12,null,9,null,null,8,5,5,null,null,null,12,8,null,9,11,11,10,7,16,null,11,null,11,12,null,null,null,13,7,10,8,null,null,null,null,10,7,14,null,null,11,null,null,null,9,null,null,10,null,7,10,null,7,null,8,9,null,null,null,null,null,8,null,null,null,null,null,null,null,null,null,null,null,null,13,null,null,9,6,null,null,9,9,9,null,11,null,6,9,null,null,6,null,null,null,null,null,null,null,6,null,null,null,9,10,11,null,null,null,null,10,null,null,7,9,null,null,9,9,9,null,null,null,11,8,null,10,null,null,null,null,9,null,null,12,6,null,null,6,9,7,5,null,null,9,null,null,null,null,null,null,null,8,10,null,6,9,13,null,8,null,null,10,9,4,7,null,null,null,null,null,null,null,null,null,11,11,null,null,null,null,null,null,10,null,null,null,null,7,null,13,null,9,6,8,10,10,null,null,8,null,15,null,null,8,6,null,7,8,null,9,null,null,12,10,8,10,13,null,10,7,null,10,null,null,7,9,null,9,null,10,null,null,null,null,null,6,null,8,null,8,null,null,11,6,15,null,null,null,6,null,10,null,9,null,null,null,9,null,11,null,11,null,null,null,null,12,null,8,null,10,null,null,null,7,9,null,null,null,6,13,null,null,6,null,9,null,null,11,null,null,11,8,11,13,10,null,null,10,9,9,10,11,6,null,9,null,null,null,7,null,null,null,7,null,null,null,null,9,null,null,9,null,null,null,null,null,null,11,null,11,null,null,8,null,null,9,null,11,null,null,9,null,null,7,null,8,8,null,null,10,10,null,7,null,8,8,9,5,null,null,null,9,7,11,8,null,8,9,9,11,null,null,null,null,null,null,13,10,10,11,null,null,null,14,9,9,null,null,10,10,5,8,null,14,null,null,11,null,7,null,10,null,10,7,8,7,10,null,null,9,7,null,null,null,10,null,11,null,9,null,null,null,8,null,11,null,10,11,9,null,null,10,null,null,12,null,7]
[]
[null,"Vzdálenost [km]",30,28,31,30,31,31,31,32,20,30,33,29,28,33,27,29,31,29,32,32,27,30,29,28,28,32,36,13,30,30,30,32,30,35,35,29,17,20,34,37,30,33,31,27,31,29,28,35,32,33,31,33,30,33,14,36,24,30,31,33,31,33,29,30,30,37,29,35,33,31,33,27,32,33,33,25,29,28,20,34,31,32,27,30,30,32,27,33,34,23,30,29,23,32,35,28,29,35,29,39,25,33,34,29,37,36,30,28,28,31,30,30,30,32,31,25,35,35,29,34,29,26,38,28,30,25,32,32,34,28,35,24,32,34,27,37,29,28,35,28,33,33,29,28,27,31,29,34,38,36,32,32,32,34,35,30,29,33,33,30,26,38,24,33,28,26,33,28,32,34,25,29,34,31,25,35,30,30,33,28,26,28,26,37,32,30,30,31,31,35,34,34,27,32,33,28,25,32,32,30,32,29,32,27,24,31,32,36,29,30,31,30,29,32,37,28,26,32,35,33,32,37,32,32,38,30,33,34,28,31,32,39,31,34,31,29,33,31,38,29,30,27,29,27,33,29,29,32,32,31,34,29,27,34,30,26,32,31,37,37,24,28,33,32,30,35,30,27,28,34,36,34,31,27,30,28,30,36,31,30,26,36,36,30,32,32,30,34,30,35,36,27,31,34,31,35,32,31,27,31,16,31,29,36,27,32,39,29,29,32,29,33,33,30,25,31,30,36,32,27,34,27,36,31,32,25,28,31,28,33,29,39,34,34,34,28,29,30,28,28,28,27,28,30,33,35,30,25,29,26,35,29,23,36,30,23,34,32,28,31,27,34,32,30,29,34,30,34,34,30,33,27,33,24,33,30,24,32,26,36,33,38,33,36,29,30,36,32,31,33,29,31,26,34,34,34,33,27,31,30,34,37,29,36,31,32,28,20,29,34,30,18,35,30,36,32,29,32,31,28,34,27,35,32,32,28,27,31,25,36,32,35,29,29,36,32,35,33,25,31,27,28,31,32,32,30,35,29,29,31,32,28,33,12,28,30,30,25,34,30,27,30,29,34,23,33,32,32,26,31,34,28,29,31,28,31,25,32,34,32,34,31,33,26,31,35,31,18,31,29,33,36,33,32,33,35,36,28,30,36,29,32,29,33,27,30,28,32,32,31,32,33,28,32,34,38,30,32,32,34,32,29,30,37,28,33,33,25,29,37,32,25,31,30,33,34,33,31,34,34,31,33,31,33,33,32,33,28,29,29,26,27,36,23,32,26,28,30,35,32,31,28,34,29,30,29,31,31,17,34,33,31,28,35,31,31,28,36,31,33,34,35,34,29,33,27,37,27,28,32,38,34,30,29,25,27,34,27,33,32,34,37,29,28,36,33,28,31,27,33,33,31,28,29,36,34,28,33,32,32,28,27,32,30,30,32,31,35,26,33,29,31,34,35,34,30,31,30,29,31,33,36,35,32,33,33,25,35,37,16,29,32,31,33,34,30,36,36,28,26,31,29,31,32,28,33,28,35,35,29,25,31,30,31,35,24,30,31,31,31,32,31,36,29,30,24,29,32,31,30,30,29,30,37,28,27,33,20,30,29,24,30,29,30,34,25,35,23,30,28,34,30,33,24,22,32,38,29,29,31,32,34,32,23,31,34,27,33,32,31,27,38,30,26,32,33,32,30,32,31,20,33,31,31,35,37,27,27,30,34,33,35,20,29,34,33,35,27,31,29,40,31,30,33,30,34,29,30,32,33,28,32,35,38,30,36,36,34,34,33,31,30,29,26,29,34,28,24,28,33,29,31,18,24,32,19,33,27,29,28,28,31,30,29,38,35,29,31,28,34,31,34,29,32,34,14,33,32,36,37,33,31,37,30,27,30,34,31,30,34,33,27,34,31,35,32,33,26,30,34,30,24,26,29,31,34,33,34,31,31,37,34,25,33,34,30,27,33,29,31,38,36,28,30,29,30,26,33,34,32,30,21,31,32,31,30,34,37,30,30,30,31,26,33,34,28,29,34,33,34,27,28,29,31,29,33,29,30,32,33,33,29,28,29,33,31,34,29,32,35,38,29,27,30,17,29,33,14,33,30,29,28,32,35,30,31,28,32,28,33,31,31,26,35,31,31,35,32,27,33,31,26,28,37,27,25,32,35,28,32,24,28,28,39,34,33,32,29,32,31,32,30,33,26,23,30,30,31,27,29,30,28,24,32,34,30,33,31,27,32,30,28,31,14,35,27,34,34,33,34,27,29,29,27,33,26,29,27,33,31]
[null,"Počet zastávek",{"$f":"SUM(IF(C4>=1,1,0),IF(C5>=1,1,0),IF(C6>=1,1,0),IF(C7>=1,1,0),IF(C8>=1,1,0),IF(C9>=1,1,0),IF(C10>=1,1,0),IF(C11>=1,1,0),IF(C12>=1,1,0),IF(C13>=1,1,0),IF(C14>=1,1,0),IF(C15>=1,1,0),IF(C16>=1,1,0),IF(C17>=1,1,0),IF(C18>=1,1,0),IF(C19>=1,1,0),IF(C20>=1,1,0),IF(C21>=1,1,0))","v":9},{"$f":"SUM(IF(D4>=1,1,0),IF(D5>=1,1,0),IF(D6>=1,1,0),IF(D7>=1,1,0),IF(D8>=1,1,0),IF(D9>=1,1,0),IF(D10>=1,1,0),IF(D11>=1,1,0),IF(D12>=1,1,0),IF(D13>=1,1,0),IF(D14>=1,1,0),IF(D15>=1,1,0),IF(D16>=1,1,0),IF(D17>=1,1,0),IF(D18>=1,1,0),IF(D19>=1,1,0),IF(D20>=1,1,0),IF(D21>=1,1,0))","v":8},10,6,9,9,8,9,5,6,8,9,5,9,6,8,7,6,8,7,8,6,9,9,8,8,10,4,9,8,8,8,7,10,10,7,5,6,12,11,9,12,8,10,9,9,6,13,9,8,11,9,8,7,5,15,7,8,12,9,9,8,6,5,7,{"$f":"SUM(IF(BP4>=1,1,0),IF(BP5>=1,1,0),IF(BP6>=1,1,0),IF(BP7>=1,1,0),IF(BP8>=1,1,0),IF(BP9>=1,1,0),IF(BP10>=1,1,0),IF(BP11>=1,1,0),IF(BP12>=1,1,0),IF(BP13>=1,1,0),IF(BP14>=1,1,0),IF(BP15>=1,1,0),IF(BP16>=1,1,0),IF(BP17>=1,1,0),IF(BP18>=1,1,0),IF(BP19>=1,1,0),IF(BP20>=1,1,0),IF(BP21>=1,1,0))","v":12},9,9,10,9,8,8,8,7,9,4,10,7,8,9,7,8,9,9,8,8,6,12,9,6,8,8,7,9,12,7,8,16,5,12,5,8,10,10,13,11,7,7,5,8,10,8,8,11,7,8,7,7,6,9,10,8,12,5,10,8,9,10,7,{"$f":"SUM(IF(EB4>=1,1,0),IF(EB5>=1,1,0),IF(EB6>=1,1,0),IF(EB7>=1,1,0),IF(EB8>=1,1,0),IF(EB9>=1,1,0),IF(EB10>=1,1,0),IF(EB11>=1,1,0),IF(EB12>=1,1,0),IF(EB13>=1,1,0),IF(EB14>=1,1,0),IF(EB15>=1,1,0),IF(EB16>=1,1,0),IF(EB17>=1,1,0),IF(EB18>=1,1,0),IF(EB19>=1,1,0),IF(EB20>=1,1,0),IF(EB21>=1,1,0))","v":4},12,6,10,7,6,10,8,9,7,10,10,8,9,6,7,9,6,8,11,14,9,6,8,9,8,10,10,10,8,6,7,10,6,7,6,9,10,7,9,10,7,6,8,7,5,10,8,7,10,9,6,7,6,12,9,9,9,6,8,11,11,11,8,{"$f":"SUM(IF(GN4>=1,1,0),IF(GN5>=1,1,0),IF(GN6>=1,1,0),IF(GN7>=1,1,0),IF(GN8>=1,1,0),IF(GN9>=1,1,0),IF(GN10>=1,1,0),IF(GN11>=1,1,0),IF(GN12>=1,1,0),IF(GN13>=1,1,0),IF(GN14>=1,1,0),IF(GN15>=1,1,0),IF(GN16>=1,1,0),IF(GN17>=1,1,0),IF(GN18>=1,1,0),IF(GN19>=1,1,0),IF(GN20>=1,1,0),IF(GN21>=1,1,0))","v":7},10,4,7,10,9,6,10,10,8,9,7,10,9,10,8,10,8,7,10,8,11,7,9,9,12,11,11,11,11,9,12,8,10,8,8,8,8,16,11,13,11,11,8,9,10,6,6,9,7,11,12,8,8,10,11,8,8,5,7,10,11,6,8,{"$f":"SUM(IF(IZ4>=1,1,0),IF(IZ5>=1,1,0),IF(IZ6>=1,1,0),IF(IZ7>=1,1,0),IF(IZ8>=1,1,0),IF(IZ9>=1,1,0),IF(IZ10>=1,1,0),IF(IZ11>=1,1,0),IF(IZ12>=1,1,0),IF(IZ13>=1,1,0),IF(IZ14>=1,1,0),IF(IZ15>=1,1,0),IF(IZ16>=1,1,0),IF(IZ17>=1,1,0),IF(IZ18>=1,1,0),IF(IZ19>=1,1,0),IF(IZ20>=1,1,0),IF(IZ21>=1,1,0))","v":8},10,13,7,9,9,9,8,12,8,8,9,12,11,8,8,6,7,7,8,14,9,8,5,11,8,7,10,13,12,8,11,12,9,6,6,8,8,10,9,9,6,8,6,9,6,10,8,11,12,8,8,9,6,9,10,8,10,8,8,10,7,6,8,{"$f":"SUM(IF(LL4>=1,1,0),IF(LL5>=1,1,0),IF(LL6>=1,1,0),IF(LL7>=1,1,0),IF(LL8>=1,1,0),IF(LL9>=1,1,0),IF(LL10>=1,1,0),IF(LL11>=1,1,0),IF(LL12>=1,1,0),IF(LL13>=1,1,0),IF(LL14>=1,1,0),IF(LL15>=1,1,0),IF(LL16>=1,1,0),IF(LL17>=1,1,0),IF(LL18>=1,1,0),IF(LL19>=1,1,0),IF(LL20>=1,1,0),IF(LL21>=1,1,0))","v":7},11,9,10,9,9,9,12,8,7,10,12,12,10,8,8,8,7,8,7,7,10,11,9,9,12,8,10,8,10,9,9,12,8,9,8,8,6,9,5,10,7,9,8,12,8,12,10,8,7,8,10,6,10,7,6,7,5,10,10,11,11,8,8,{"$f":"SUM(IF(NX4>=1,1,0),IF(NX5>=1,1,0),IF(NX6>=1,1,0),IF(NX7>=1,1,0),IF(NX8>=1,1,0),IF(NX9>=1,1,0),IF(NX10>=1,1,0),IF(NX11>=1,1,0),IF(NX12>=1,1,0),IF(NX13>=1,1,0),IF(NX14>=1,1,0),IF(NX15>=1,1,0),IF(NX16>=1,1,0),IF(NX17>=1,1,0),IF(NX18>=1,1,0),IF(NX19>=1,1,0),IF(NX20>=1,1,0),IF(NX21>=1,1,0))","v":6},12,9,9,10,11,8,7,11,12,14,9,8,9,11,10,11,11,10,9,9,8,8,8,10,7,7,7,12,11,7,8,10,7,6,11,6,10,9,9,8,9,8,9,11,10,9,7,10,10,13,11,10,9,8,9,9,7,10,6,9,11,7,7,{"$f":"SUM(IF(QJ4>=1,1,0),IF(QJ5>=1,1,0),IF(QJ6>=1,1,0),IF(QJ7>=1,1,0),IF(QJ8>=1,1,0),IF(QJ9>=1,1,0),IF(QJ10>=1,1,0),IF(QJ11>=1,1,0),IF(QJ12>=1,1,0),IF(QJ13>=1,1,0),IF(QJ14>=1,1,0),IF(QJ15>=1,1,0),IF(QJ16>=1,1,0),IF(QJ17>=1,1,0),IF(QJ18>=1,1,0),IF(QJ19>=1,1,0),IF(QJ20>=1,1,0),IF(QJ21>=1,1,0))","v":9},8,7,9,4,6,9,11,4,11,8,6,8,6,13,5,11,10,8,9,5,8,7,8,11,5,7,7,9,9,11,13,12,10,7,5,11,9,8,12,6,8,10,10,9,10,12,9,8,9,11,8,5,6,8,5,7,8,8,7,11,8,8,10,{"$f":"SUM(IF(SV4>=1,1,0),IF(SV5>=1,1,0),IF(SV6>=1,1,0),IF(SV7>=1,1,0),IF(SV8>=1,1,0),IF(SV9>=1,1,0),IF(SV10>=1,1,0),IF(SV11>=1,1,0),IF(SV12>=1,1,0),IF(SV13>=1,1,0),IF(SV14>=1,1,0),IF(SV15>=1,1,0),IF(SV16>=1,1,0),IF(SV17>=1,1,0),IF(SV18>=1,1,0),IF(SV19>=1,1,0),IF(SV20>=1,1,0),IF(SV21>=1,1,0))","v":6},13,13,8,8,10,11,12,8,7,11,6,7,10,7,8,12,12,8,8,11,10,8,11,9,10,8,6,9,9,10,10,7,11,8,8,9,8,7,9,8,8,8,5,8,12,7,9,11,9,8,5,5,10,10,4,12,8,8,9,11,11,10,7,{"$f":"SUM(IF(VH4>=1,1,0),IF(VH5>=1,1,0),IF(VH6>=1,1,0),IF(VH7>=1,1,0),IF(VH8>=1,1,0),IF(VH9>=1,1,0),IF(VH10>=1,1,0),IF(VH11>=1,1,0),IF(VH12>=1,1,0),IF(VH13>=1,1,0),IF(VH14>=1,1,0),IF(VH15>=1,1,0),IF(VH16>=1,1,0),IF(VH17>=1,1,0),IF(VH18>=1,1,0),IF(VH19>=1,1,0),IF(VH20>=1,1,0),IF(VH21>=1,1,0))","v":16},11,11,6,11,12,6,10,8,13,7,10,8,12,11,5,6,10,7,14,7,10,11,12,11,8,9,11,11,10,11,7,10,10,7,8,8,9,11,7,9,11,8,8,9,7,8,10,10,5,9,7,9,7,9,8,13,9,8,9,6,6,5,9,{"$f":"SUM(IF(XT4>=1,1,0),IF(XT5>=1,1,0),IF(XT6>=1,1,0),IF(XT7>=1,1,0),IF(XT8>=1,1,0),IF(XT9>=1,1,0),IF(XT10>=1,1,0),IF(XT11>=1,1,0),IF(XT12>=1,1,0),IF(XT13>=1,1,0),IF(XT14>=1,1,0),IF(XT15>=1,1,0),IF(XT16>=1,1,0),IF(XT17>=1,1,0),IF(XT18>=1,1,0),IF(XT19>=1,1,0),IF(XT20>=1,1,0),IF(XT21>=1,1,0))","v":9},9,10,11,11,6,9,9,6,6,7,9,10,9,9,10,11,6,7,10,5,9,10,11,13,6,11,12,10,6,11,7,9,9,4,9,9,9,9,9,10,11,8,7,10,8,10,9,6,9,8,6,12,6,6,8,6,9,7,5,8,5,9,9,{"$f":"SUM(IF(AAF4>=1,1,0),IF(AAF5>=1,1,0),IF(AAF6>=1,1,0),IF(AAF7>=1,1,0),IF(AAF8>=1,1,0),IF(AAF9>=1,1,0),IF(AAF10>=1,1,0),IF(AAF11>=1,1,0),IF(AAF12>=1,1,0),IF(AAF13>=1,1,0),IF(AAF14>=1,1,0),IF(AAF15>=1,1,0),IF(AAF16>=1,1,0),IF(AAF17>=1,1,0),IF(AAF18>=1,1,0),IF(AAF19>=1,1,0),IF(AAF20>=1,1,0),IF(AAF21>=1,1,0))","v":5},7,5,8,6,9,8,10,7,6,9,13,6,8,8,9,10,9,4,7,12,8,8,9,8,6,13,10,9,11,11,6,9,7,7,7,9,10,10,9,10,6,7,9,13,10,9,6,8,10,10,11,6,8,11,15,8,8,8,6,9,7,8,9,{"$f":"SUM(IF(ACR4>=1,1,0),IF(ACR5>=1,1,0),IF(ACR6>=1,1,0),IF(ACR7>=1,1,0),IF(ACR8>=1,1,0),IF(ACR9>=1,1,0),IF(ACR10>=1,1,0),IF(ACR11>=1,1,0),IF(ACR12>=1,1,0),IF(ACR13>=1,1,0),IF(ACR14>=1,1,0),IF(ACR15>=1,1,0),IF(ACR16>=1,1,0),IF(ACR17>=1,1,0),IF(ACR18>=1,1,0),IF(ACR19>=1,1,0),IF(ACR20>=1,1,0),IF(ACR21>=1,1,0))","v":9},9,8,12,10,8,10,13,10,10,7,10,10,7,7,7,9,5,9,7,10,8,6,6,7,8,6,9,8,6,8,8,7,11,6,15,11,7,6,6,10,10,10,9,9,10,4,9,9,11,12,11,9,13,9,9,12,10,8,8,10,9,10,10,{"$f":"SUM(IF(AFD4>=1,1,0),IF(AFD5>=1,1,0),IF(AFD6>=1,1,0),IF(AFD7>=1,1,0),IF(AFD8>=1,1,0),IF(AFD9>=1,1,0),IF(AFD10>=1,1,0),IF(AFD11>=1,1,0),IF(AFD12>=1,1,0),IF(AFD13>=1,1,0),IF(AFD14>=1,1,0),IF(AFD15>=1,1,0),IF(AFD16>=1,1,0),IF(AFD17>=1,1,0),IF(AFD18>=1,1,0),IF(AFD19>=1,1,0),IF(AFD20>=1,1,0),IF(AFD21>=1,1,0))","v":7},9,9,8,6,6,13,7,4,6,7,9,10,12,11,7,12,11,8,11,13,10,8,7,10,9,9,10,11,6,6,9,5,6,13,7,8,7,5,7,6,8,8,10,9,8,10,9,6,7,10,8,8,8,11,9,11,5,9,8,10,11,9,7,{"$f":"SUM(IF(AHP4>=1,1,0),IF(AHP5>=1,1,0),IF(AHP6>=1,1,0),IF(AHP7>=1,1,0),IF(AHP8>=1,1,0),IF(AHP9>=1,1,0),IF(AHP10>=1,1,0),IF(AHP11>=1,1,0),IF(AHP12>=1,1,0),IF(AHP13>=1,1,0),IF(AHP14>=1,1,0),IF(AHP15>=1,1,0),IF(AHP16>=1,1,0),IF(AHP17>=1,1,0),IF(AHP18>=1,1,0),IF(AHP19>=1,1,0),IF(AHP20>=1,1,0),IF(AHP21>=1,1,0))","v":11},11,12,9,8,9,7,6,8,8,9,8,10,10,6,7,8,8,8,9,5,10,8,9,9,7,11,8,8,8,9,9,11,9,8,5,11,9,8,13,10,10,11,9,5,7,14,9,9,9,9,10,10,5,8,4,14,11,9,11,9,7,11,10,{"$f":"SUM(IF(AKB4>=1,1,0),IF(AKB5>=1,1,0),IF(AKB6>=1,1,0),IF(AKB7>=1,1,0),IF(AKB8>=1,1,0),IF(AKB9>=1,1,0),IF(AKB10>=1,1,0),IF(AKB11>=1,1,0),IF(AKB12>=1,1,0),IF(AKB13>=1,1,0),IF(AKB14>=1,1,0),IF(AKB15>=1,1,0),IF(AKB16>=1,1,0),IF(AKB17>=1,1,0),IF(AKB18>=1,1,0),IF(AKB19>=1,1,0),IF(AKB20>=1,1,0),IF(AKB21>=1,1,0))","v":8},10,7,8,7,10,7,10,9,7,6,7,9,10,8,11,9,9,9,5,7,8,4,11,8,10,11,9,12,6,10,6,6,12,5,7,7,10,9]
[]
[null,"Průměr vzdálenosti [km]",{"$f":"AVERAGEA(C23:ALN23)","v":30.687000000000001},null,"Maximum",{"$f":"MAX(C23:ALN23)","v":40}]
[null,"Průměrný počet zastávek",{"$f":"AVERAGEA(C24:ALN24)","v":8.6780000000000008},null,"Minimum",{"$f":"MIN(C23:ALN23)","v":12}]
[null,"Medián vzdáleností [km]",{"$f":"MEDIAN(C23:ALN23)","v":31}]
[null,"Medián počtu zastávek",{"$f":"MEDIAN(C24:ALN24)","v":9}]

{"sheet":"Hladina 40 %","index":8,"n_rows":29,"n_cols":1002,"rows_kept":29,"cut":false,"hidden":false,"merged":[]}
["Výstup ze simulace"]
[]
[null,"Název",1,2,3,4,5,6,7,8,9,10,11,12,13,14,15,16,17,18,19,20,21,22,23,24,25,26,27,28,29,30,31,32,33,34,35,36,37,38,39,40,41,42,43,44,45,46,47,48,49,50,51,52,53,54,55,56,57,58,59,60,61,62,63,64,65,66,67,68,69,70,71,72,73,74,75,76,77,78,79,80,81,82,83,84,85,86,87,88,89,90,91,92,93,94,95,96,97,98,99,100,101,102,103,104,105,106,107,108,109,110,111,112,113,114,115,116,117,118,119,120,121,122,123,124,125,126,127,128,129,130,131,132,133,134,135,136,137,138,139,140,141,142,143,144,145,146,147,148,149,150,151,152,153,154,155,156,157,158,159,160,161,162,163,164,165,166,167,168,169,170,171,172,173,174,175,176,177,178,179,180,181,182,183,184,185,186,187,188,189,190,191,192,193,194,195,196,197,198,199,200,201,202,203,204,205,206,207,208,209,210,211,212,213,214,215,216,217,218,219,220,221,222,223,224,225,226,227,228,229,230,231,232,233,234,235,236,237,238,239,240,241,242,243,244,245,246,247,248,249,250,251,252,253,254,255,256,257,258,259,260,261,262,263,264,265,266,267,268,269,270,271,272,273,274,275,276,277,278,279,280,281,282,283,284,285,286,287,288,289,290,291,292,293,294,295,296,297,298,299,300,301,302,303,304,305,306,307,308,309,310,311,312,313,314,315,316,317,318,319,320,321,322,323,324,325,326,327,328,329,330,331,332,333,334,335,336,337,338,339,340,341,342,343,344,345,346,347,348,349,350,351,352,353,354,355,356,357,358,359,360,361,362,363,364,365,366,367,368,369,370,371,372,373,374,375,376,377,378,379,380,381,382,383,384,385,386,387,388,389,390,391,392,393,394,395,396,397,398,399,400,401,402,403,404,405,406,407,408,409,410,411,412,413,414,415,416,417,418,419,420,421,422,423,424,425,426,427,428,429,430,431,432,433,434,435,436,437,438,439,440,441,442,443,444,445,446,447,448,449,450,451,452,453,454,455,456,457,458,459,460,461,462,463,464,465,466,467,468,469,470,471,472,473,474,475,476,477,478,479,480,481,482,483,484,485,486,487,488,489,490,491,492,493,494,495,496,497,498,499,500,501,502,503,504,505,506,507,508,509,510,511,512,513,514,515,516,517,518,519,520,521,522,523,524,525,526,527,528,529,530,531,532,533,534,535,536,537,538,539,540,541,542,543,544,545,546,547,548,549,550,551,552,553,554,555,556,557,558,559,560,561,562,563,564,565,566,567,568,569,570,571,572,573,574,575,576,577,578,579,580,581,582,583,584,585,586,587,588,589,590,591,592,593,594,595,596,597,598,599,600,601,602,603,604,605,606,607,608,609,610,611,612,613,614,615,616,617,618,619,620,621,622,623,624,625,626,627,628,629,630,631,632,633,634,635,636,637,638,639,640,641,642,643,644,645,646,647,648,649,650,651,652,653,654,655,656,657,658,659,660,661,662,663,664,665,666,667,668,669,670,671,672,673,674,675,676,677,678,679,680,681,682,683,684,685,686,687,688,689,690,691,692,693,694,695,696,697,698,699,700,701,702,703,704,705,706,707,708,709,710,711,712,713,714,715,716,717,718,719,720,721,722,723,724,725,726,727,728,729,730,731,732,733,734,735,736,737,738,739,740,741,742,743,744,745,746,747,748,749,750,751,752,753,754,755,756,757,758,759,760,761,762,763,764,765,766,767,768,769,770,771,772,773,774,775,776,777,778,779,780,781,782,783,784,785,786,787,788,789,790,791,792,793,794,795,796,797,798,799,800,801,802,803,804,805,806,807,808,809,810,811,812,813,814,815,816,817,818,819,820,821,822,823,824,825,826,827,828,829,830,831,832,833,834,835,836,837,838,839,840,841,842,843,844,845,846,847,848,849,850,851,852,853,854,855,856,857,858,859,860,861,862,863,864,865,866,867,868,869,870,871,872,873,874,875,876,877,878,879,880,881,882,883,884,885,886,887,888,889,890,891,892,893,894,895,896,897,898,899,900,901,902,903,904,905,906,907,908,909,910,911,912,913,914,915,916,917,918,919,920,921,922,923,924,925,926,927,928,929,930,931,932,933,934,935,936,937,938,939,940,941,942,943,944,945,946,947,948,949,950,951,952,953,954,955,956,957,958,959,960,961,962,963,964,965,966,967,968,969,970,971,972,973,974,975,976,977,978,979,980,981,982,983,984,985,986,987,988,989,990,991,992,993,994,995,996,997,998,999,1000]
[null,"Trhové Sviny",1,1,1,1,1,1,1,1,1,1,1,1,1,1,1,1,1,1,1,1,1,1,1,1,1,1,1,1,1,1,1,1,1,1,1,1,1,1,1,1,1,1,1,1,1,1,1,1,1,1,1,1,1,1,1,1,1,1,1,1,1,1,1,1,1,1,1,1,1,1,1,1,1,1,1,1,1,1,1,1,1,1,1,1,1,1,1,1,1,1,1,1,1,1,1,1,1,1,1,1,1,1,1,1,1,1,1,1,1,1,1,1,1,1,1,1,1,1,1,1,1,1,1,1,1,1,1,1,1,1,1,1,1,1,1,1,1,1,1,1,1,1,1,1,1,1,1,1,1,1,1,1,1,1,1,1,1,1,1,1,1,1,1,1,1,1,1,1,1,1,1,1,1,1,1,1,1,1,1,1,1,1,1,1,1,1,1,1,1,1,1,1,1,1,1,1,1,1,1,1,1,1,1,1,1,1,1,1,1,1,1,1,1,1,1,1,1,1,1,1,1,1,1,1,1,1,1,1,1,1,1,1,1,1,1,1,1,1,1,1,1,1,1,1,1,1,1,1,1,1,1,1,1,1,1,1,1,1,1,1,1,1,1,1,1,1,1,1,1,1,1,1,1,1,1,1,1,1,1,1,1,1,1,1,1,1,1,1,1,1,1,1,1,1,1,1,1,1,1,1,1,1,1,1,1,1,1,1,1,1,1,1,1,1,1,1,1,1,1,1,1,1,1,1,1,1,1,1,1,1,1,1,1,1,1,1,1,1,1,1,1,1,1,1,1,1,1,1,1,1,1,1,1,1,1,1,1,1,1,1,1,1,1,1,1,1,1,1,1,1,1,1,1,1,1,1,1,1,1,1,1,1,1,1,1,1,1,1,1,1,1,1,1,1,1,1,1,1,1,1,1,1,1,1,1,1,1,1,1,1,1,1,1,1,1,1,1,1,1,1,1,1,1,1,1,1,1,1,1,1,1,1,1,1,1,1,1,1,1,1,1,1,1,1,1,1,1,1,1,1,1,1,1,1,1,1,1,1,1,1,1,1,1,1,1,1,1,1,1,1,1,1,1,1,1,1,1,1,1,1,1,1,1,1,1,1,1,1,1,1,1,1,1,1,1,1,1,1,1,1,1,1,1,1,1,1,1,1,1,1,1,1,1,1,1,1,1,1,1,1,1,1,1,1,1,1,1,1,1,1,1,1,1,1,1,1,1,1,1,1,1,1,1,1,1,1,1,1,1,1,1,1,1,1,1,1,1,1,1,1,1,1,1,1,1,1,1,1,1,1,1,1,1,1,1,1,1,1,1,1,1,1,1,1,1,1,1,1,1,1,1,1,1,1,1,1,1,1,1,1,1,1,1,1,1,1,1,1,1,1,1,1,1,1,1,1,1,1,1,1,1,1,1,1,1,1,1,1,1,1,1,1,1,1,1,1,1,1,1,1,1,1,1,1,1,1,1,1,1,1,1,1,1,1,1,1,1,1,1,1,1,1,1,1,1,1,1,1,1,1,1,1,1,1,1,1,1,1,1,1,1,1,1,1,1,1,1,1,1,1,1,1,1,1,1,1,1,1,1,1,1,1,1,1,1,1,1,1,1,1,1,1,1,1,1,1,1,1,1,1,1,1,1,1,1,1,1,1,1,1,1,1,1,1,1,1,1,1,1,1,1,1,1,1,1,1,1,1,1,1,1,1,1,1,1,1,1,1,1,1,1,1,1,1,1,1,1,1,1,1,1,1,1,1,1,1,1,1,1,1,1,1,1,1,1,1,1,1,1,1,1,1,1,1,1,1,1,1,1,1,1,1,1,1,1,1,1,1,1,1,1,1,1,1,1,1,1,1,1,1,1,1,1,1,1,1,1,1,1,1,1,1,1,1,1,1,1,1,1,1,1,1,1,1,1,1,1,1,1,1,1,1,1,1,1,1,1,1,1,1,1,1,1,1,1,1,1,1,1,1,1,1,1,1,1,1,1,1,1,1,1,1,1,1,1,1,1,1,1,1,1,1,1,1,1,1,1,1,1,1,1,1,1,1,1,1,1,1,1,1,1,1,1,1,1,1,1,1,1,1,1,1,1,1,1,1,1,1,1,1,1,1,1,1,1,1,1,1,1,1,1,1,1,1,1,1,1,1,1,1,1,1,1,1,1,1,1,1,1,1,1,1,1,1,1,1,1,1,1,1,1,1,1,1,1,1,1,1,1,1,1,1,1,1,1,1,1,1,1,1,1,1,1,1,1,1,1,1,1,1]
[null,"Nesměň",null,null,6,null,4,null,5,5,5,6,6,null,5,null,5,null,3,null,3,5,6,null,5,7,5,null,6,4,6,6,null,5,5,4,3,4,6,5,4,5,5,null,6,6,6,null,null,5,null,5,5,6,null,5,4,null,4,null,6,null,6,7,5,4,5,null,3,null,7,5,null,5,6,7,5,5,4,4,5,5,5,5,5,5,7,5,4,null,6,7,7,7,null,null,6,6,5,6,7,null,null,7,null,5,null,5,4,null,4,null,null,5,null,6,6,5,6,null,7,null,7,6,null,5,4,4,null,5,null,null,3,null,5,7,null,5,null,6,5,4,5,5,4,3,7,null,null,6,4,null,null,6,5,null,5,6,5,7,7,6,5,null,5,5,5,null,6,6,5,4,null,4,5,7,7,4,null,null,null,4,null,5,7,null,4,7,5,5,null,null,5,7,null,4,6,null,6,6,null,4,6,5,null,null,null,5,null,null,4,3,5,null,5,5,5,null,null,5,null,7,7,null,null,null,6,5,6,null,null,6,null,5,6,3,null,null,5,null,null,null,null,null,5,null,null,7,6,4,null,null,5,null,6,5,5,4,3,null,5,6,7,5,null,null,5,null,6,5,null,6,3,null,6,null,7,3,4,null,4,null,7,7,4,null,5,5,6,6,4,null,4,null,null,7,null,null,5,3,7,5,5,5,4,5,6,null,null,7,6,4,6,5,null,5,5,null,5,7,6,6,null,5,5,null,4,null,5,6,null,4,4,5,5,4,null,3,null,3,5,null,5,null,null,4,null,7,4,5,6,null,null,4,null,5,6,5,5,4,4,6,4,null,6,null,7,5,5,4,6,4,7,6,6,null,null,5,6,5,4,6,5,6,5,6,5,5,null,6,4,null,6,6,null,6,4,null,5,5,5,6,6,null,null,6,null,null,6,null,null,null,5,null,null,4,null,5,5,6,7,null,null,null,6,null,5,5,5,null,5,6,null,4,6,6,4,null,6,null,5,null,7,7,3,6,3,7,null,6,4,7,6,6,3,5,4,7,3,4,4,null,null,6,4,5,6,4,5,5,5,7,5,4,null,5,6,3,4,7,5,6,5,5,6,6,null,null,5,null,null,6,null,null,3,null,null,null,null,6,null,null,null,3,6,4,5,6,5,null,null,null,5,4,null,7,null,5,null,4,5,6,6,null,null,5,5,6,6,null,5,6,6,4,null,6,6,null,5,3,4,4,null,6,5,null,7,5,6,5,3,null,5,6,5,4,5,5,null,6,null,null,null,6,5,4,null,4,5,null,6,null,null,6,null,null,null,5,null,5,3,3,5,6,5,4,5,6,7,4,6,5,null,null,5,null,null,4,7,6,7,4,3,6,5,null,6,5,5,6,5,7,5,5,null,5,null,6,3,6,6,null,6,null,6,5,6,5,null,null,5,null,5,null,5,7,5,7,null,6,4,4,4,null,null,4,6,null,null,6,null,null,6,null,4,6,6,null,null,4,null,6,7,4,null,5,6,4,6,null,null,null,4,5,null,5,6,5,3,6,5,6,null,null,null,null,4,null,3,5,6,7,5,6,null,7,4,6,6,7,4,null,5,5,null,4,4,null,4,null,null,5,null,4,4,5,null,6,6,6,3,null,null,4,null,4,7,6,5,6,6,6,4,null,null,7,5,null,null,6,5,5,7,7,5,4,null,7,5,null,5,5,4,4,5,null,5,6,null,5,4,5,6,null,null,5,null,null,6,null,null,null,5,3,7,6,5,null,6,null,null,null,4,null,4,null,null,null,null,5,7,null,5,5,5,7,5,7,null,6,6,null,3,7,null,4,5,5,6,4,null,5,null,7,4,5,4,4,6,4,null,6,null,6,6,5,null,null,6,5,null,7,6,6,7,null,5,null,6,6,null,6,5,null,5,5,null,6,5,5,6,null,7,5,4,7,7,6,4,5,6,3,6,null,null,5,3,6,4,5,4,5,6,null,null,3,null,6,null,4,5,7,3,5,6,5,5,null,5,4,4,5,5,3,7,6,null,null,null,6,5,null,6,null,3,6,null,null,null,5,null,null,6,null,6,null,5,null,4,5,4,null,7,4,7,5,null,6,5,null,null,5,4,4,7,4,5,null,6,null,4,3,6,null,6,null,4,6,null,5,null,null,6,7,7,3,6,5,null,5,null,7,7,null,null,5,null,6,6,7,6,6,6,5,6,null,3,6,null,null,4,null,4,4,6,7,6,6,4,null,7,7,5,7,6,5,4,3,null,null,5]
[null,"Ločenice",5,4,5,null,null,5,null,4,4,5,5,6,4,null,null,5,null,null,null,4,5,4,null,6,4,4,5,3,5,null,5,null,4,null,null,null,5,null,null,null,null,null,null,5,5,5,3,4,null,null,4,null,4,null,null,4,null,3,5,5,5,6,4,3,4,5,null,null,6,null,4,null,null,6,4,null,null,null,4,4,4,4,4,4,6,4,null,3,5,6,6,6,6,5,5,5,4,5,6,null,6,6,5,4,null,null,3,4,3,null,4,4,4,5,5,null,null,null,6,null,6,5,null,4,null,null,null,4,5,null,null,null,null,6,6,null,6,5,null,null,4,null,null,null,6,null,4,5,null,3,6,5,4,3,null,5,4,6,6,5,4,5,null,4,null,4,null,5,null,3,4,null,4,6,6,null,null,6,3,3,4,null,6,null,3,6,4,4,null,null,null,6,5,null,5,5,null,5,5,3,5,4,6,6,null,null,null,5,null,null,4,6,4,null,null,null,5,4,6,6,6,5,null,4,null,4,5,4,4,null,null,4,5,2,4,null,4,null,5,3,5,4,4,null,null,6,5,3,5,null,null,5,5,4,null,3,2,5,4,null,6,null,null,null,4,5,null,null,5,5,null,5,5,4,6,null,3,5,3,6,6,6,3,null,null,4,5,5,3,4,3,4,6,6,5,5,null,null,6,4,null,4,null,4,5,5,5,6,5,3,null,null,5,4,4,5,null,6,5,5,null,null,null,null,null,5,null,5,null,null,null,4,4,null,4,null,6,null,4,6,4,null,6,3,5,6,null,4,5,5,null,3,5,null,5,4,4,null,3,null,null,5,5,4,6,4,4,null,5,null,6,5,5,5,3,4,null,null,null,5,4,5,null,5,4,null,4,5,3,4,5,5,5,null,null,null,4,null,null,5,5,6,6,5,5,4,5,4,5,4,4,null,3,3,6,null,null,5,6,6,null,4,null,null,4,4,4,4,4,5,5,null,5,null,null,null,5,5,null,5,6,6,null,5,2,6,6,5,null,6,5,5,null,null,null,6,null,null,null,4,4,5,null,4,null,null,4,4,4,6,4,null,4,4,5,null,null,6,4,5,4,4,5,null,6,null,4,6,null,5,null,3,null,4,5,5,5,5,4,3,5,null,5,3,4,5,null,null,6,6,null,3,5,6,null,4,null,3,4,5,null,3,5,null,null,5,5,null,4,5,5,3,4,5,null,null,null,null,3,3,5,5,4,null,6,4,5,4,2,null,null,5,4,null,4,null,5,5,4,5,6,5,4,null,5,3,4,4,5,5,3,5,4,null,5,4,null,null,null,null,4,5,null,null,4,5,6,3,5,4,4,4,4,5,null,3,6,null,6,null,null,null,null,4,null,4,null,null,4,6,null,4,6,null,5,5,null,5,5,null,null,null,5,4,5,null,6,null,4,2,4,5,4,6,4,6,5,5,3,3,null,4,null,3,5,4,null,5,null,4,5,6,null,null,5,6,null,null,6,5,6,3,4,4,5,null,null,6,null,null,3,4,null,null,5,null,2,5,4,null,null,null,4,null,3,5,null,4,5,6,null,5,null,6,3,null,5,6,null,5,null,4,4,null,null,null,3,2,null,null,4,null,null,4,5,5,5,5,null,3,null,null,3,3,6,5,null,null,5,5,null,4,6,6,null,5,4,null,4,null,6,6,4,null,5,6,4,null,4,4,null,null,4,3,null,5,null,4,3,null,5,5,5,4,5,null,null,null,null,5,4,null,6,5,null,4,5,3,null,4,null,null,null,null,null,5,4,4,6,null,4,4,4,6,4,6,4,5,null,6,null,6,null,3,4,4,null,null,5,4,5,6,3,null,null,null,null,3,3,5,4,5,5,4,6,5,null,4,5,6,5,null,6,null,4,null,null,null,null,5,null,3,4,4,6,5,null,4,5,4,6,4,null,6,6,5,null,4,5,null,5,5,null,4,null,5,null,4,null,4,5,4,5,null,5,5,4,null,4,6,null,4,5,4,null,4,4,3,3,4,4,null,6,5,null,null,4,5,null,5,5,null,null,5,5,5,5,4,5,4,5,4,5,2,4,5,null,null,3,null,6,null,6,null,4,5,null,3,null,null,null,null,6,null,4,null,5,5,3,null,5,6,5,null,3,5,4,4,2,5,null,6,6,null,5,null,null,4,3,6,6,4,null,4,5,5,5,6,5,null,5,null,null,null,null,5,5,null,null,null,3,3,5,6,5,5,null,3,6,6,null,6,5,4,3,2,4,3,4]
[null,"Todně",3,3,3,4,null,3,null,null,3,3,4,4,2,null,4,3,2,4,2,null,null,3,3,4,null,3,4,null,null,4,3,4,null,null,2,null,4,4,null,null,3,4,4,4,null,3,null,null,4,4,null,4,3,3,null,3,null,2,null,3,4,4,2,null,null,3,null,4,4,4,3,3,4,4,null,3,null,null,2,null,2,null,null,null,4,null,3,null,3,4,4,4,4,3,null,3,2,null,4,null,4,4,3,3,3,3,null,null,null,3,3,null,null,3,4,4,4,3,4,null,4,null,3,null,3,null,4,3,3,4,2,4,4,4,4,4,4,3,null,3,2,3,3,null,4,null,2,4,3,null,4,3,null,null,3,4,null,4,4,4,null,4,null,null,4,3,4,3,3,null,null,3,3,4,4,null,3,4,null,null,3,3,4,null,null,4,2,null,null,null,4,4,4,null,3,null,4,null,3,2,3,2,4,4,2,3,4,3,3,null,2,4,null,3,null,4,3,null,4,4,4,3,3,2,4,2,3,3,3,4,3,3,null,null,3,3,null,null,3,null,3,null,2,3,2,4,4,null,null,4,3,null,4,null,4,2,null,3,3,4,4,null,4,3,null,3,4,3,null,3,null,null,4,null,4,null,2,null,null,4,4,4,null,null,3,3,3,3,null,3,null,3,4,4,3,4,4,null,4,3,3,null,null,null,3,4,3,4,3,null,4,null,3,3,null,3,4,4,3,4,4,3,3,4,null,null,3,4,3,null,null,3,null,null,null,null,4,null,3,4,null,null,4,2,null,4,null,3,null,null,4,null,3,3,3,2,3,3,2,4,3,3,null,2,4,3,null,null,null,2,4,3,3,3,null,null,4,3,null,4,3,4,3,3,null,null,3,3,null,null,4,3,3,4,null,4,3,4,4,3,3,4,4,4,4,null,3,3,4,null,3,null,null,null,4,null,3,4,4,4,4,null,4,3,null,null,3,3,3,3,4,3,4,4,2,3,null,3,3,3,4,4,2,4,null,4,4,null,3,4,4,4,2,4,2,4,null,null,2,null,null,4,null,2,4,null,2,null,3,4,2,3,2,2,4,null,null,4,null,3,2,null,3,4,4,null,null,4,4,3,4,2,null,3,null,3,null,4,null,null,null,null,null,2,3,4,null,4,4,4,3,null,3,4,null,null,4,null,null,null,4,null,3,3,3,3,3,null,3,null,3,null,3,4,4,3,3,null,null,null,4,4,3,4,4,3,null,3,null,4,4,3,3,2,3,null,3,3,3,3,4,null,3,3,3,null,null,3,null,4,null,4,3,3,null,null,null,4,2,null,3,null,3,2,null,null,4,null,null,null,2,null,null,null,2,null,4,4,4,3,null,4,4,null,4,3,4,4,3,4,3,2,4,4,4,null,null,3,4,3,4,4,null,null,4,3,4,null,2,null,2,null,null,4,3,4,null,4,2,null,null,3,4,2,4,null,3,4,null,null,null,4,3,4,null,4,3,null,4,null,4,null,3,null,3,3,4,4,null,null,null,null,null,3,3,null,null,3,null,4,null,null,null,4,null,3,2,null,3,4,3,3,3,4,null,4,null,4,3,4,3,null,null,null,3,null,2,null,null,3,null,null,3,null,4,4,3,4,null,null,null,3,2,null,4,3,3,4,4,3,2,null,4,4,3,3,3,4,3,3,4,4,null,3,3,4,null,null,null,null,2,null,null,null,null,3,4,3,null,4,3,3,null,null,4,3,4,3,3,3,2,null,4,3,4,2,3,null,4,3,null,4,null,null,3,3,3,3,4,null,null,null,3,4,null,4,3,null,4,4,2,4,3,null,null,3,4,3,null,3,3,4,null,null,3,3,4,null,null,3,3,null,3,null,4,3,4,null,4,4,3,4,4,3,null,null,4,4,4,4,3,null,null,3,4,null,null,null,3,3,4,null,null,4,4,3,null,2,4,null,3,4,null,null,null,null,3,3,2,3,3,null,4,null,null,4,null,3,null,4,null,2,3,2,3,2,2,2,null,2,3,null,4,4,4,null,3,null,3,null,3,null,null,3,null,3,4,3,3,3,3,3,null,null,null,3,null,3,null,null,4,3,4,3,3,null,3,null,3,null,null,2,4,3,null,4,null,4,null,2,3,4,4,4,null,3,null,null,null,3,4,4,4,null,3,3,2,2,null,4,4,null,4,3,3,3,null,4,4,4,4,null,4,null,null,null,null,4,2,null,null,2,null,4,3,3,3,null,4,4,3,4,3,null,2,null,3,null,3,3]
[null,"Nežetice",2,null,null,3,2,2,3,2,2,2,3,3,null,3,3,2,null,3,null,null,3,2,null,3,3,2,3,2,3,3,2,3,2,3,null,2,3,3,3,3,null,3,3,3,3,2,2,2,3,3,3,3,2,null,2,null,null,null,3,2,3,3,null,null,2,2,2,3,3,3,null,2,3,3,null,2,3,2,null,2,null,2,2,3,3,null,null,null,null,3,3,3,3,null,3,2,null,3,3,3,3,3,2,null,null,2,null,2,2,null,null,2,null,null,3,3,3,2,3,3,3,3,2,2,null,2,3,null,null,3,null,3,3,3,3,3,3,2,3,null,null,null,2,2,3,2,null,3,null,null,3,2,2,2,2,3,null,3,3,3,2,3,3,null,3,2,3,2,2,null,2,null,null,3,3,null,null,3,null,null,2,2,3,3,2,3,null,3,3,3,3,3,3,2,null,3,3,3,2,null,2,null,3,3,null,2,3,2,null,null,null,3,2,2,3,3,null,3,3,3,3,null,2,null,3,null,2,2,2,3,2,2,3,null,null,null,2,3,null,null,null,3,null,2,null,3,3,null,3,3,null,3,3,2,3,null,null,2,2,3,3,3,3,2,3,null,3,2,3,null,null,3,3,3,3,2,null,3,null,3,3,3,2,3,null,null,2,2,2,2,null,null,3,3,null,3,3,null,3,null,2,2,null,null,2,3,2,3,2,null,3,3,2,2,3,2,3,3,null,3,3,2,null,3,2,3,null,3,2,null,null,null,3,2,2,null,3,null,null,3,null,null,3,null,3,3,2,2,3,3,3,null,2,null,2,null,2,null,null,3,null,null,3,null,3,2,null,null,3,null,3,null,2,null,2,2,3,2,null,3,null,3,null,null,2,3,2,2,null,2,3,null,2,3,null,3,null,3,3,null,2,3,3,3,3,2,null,2,3,2,null,null,2,null,3,3,2,3,3,3,3,null,3,2,2,2,2,null,2,null,3,2,3,3,null,null,3,2,null,null,3,3,null,3,null,3,3,3,null,3,3,3,null,3,null,3,null,3,null,3,null,3,null,null,3,2,null,null,2,3,null,2,null,null,3,null,2,3,2,null,null,null,null,3,3,2,null,3,3,null,3,null,null,null,3,null,3,3,3,null,3,null,3,null,null,3,3,3,3,3,2,null,null,3,3,3,3,null,3,3,3,null,null,2,null,null,null,2,null,3,2,2,null,3,3,null,2,2,null,2,3,3,null,3,3,2,3,2,null,3,3,null,null,null,null,3,2,null,null,null,3,3,2,null,2,null,2,2,3,3,2,3,2,null,3,3,2,3,null,null,null,3,null,null,2,3,3,null,3,3,null,2,null,3,null,null,3,3,3,null,2,3,3,3,3,null,3,3,2,3,2,null,3,3,3,3,null,null,3,null,3,3,3,2,3,2,3,null,null,null,null,3,2,3,null,3,3,3,null,2,null,null,3,null,3,3,2,3,3,null,3,3,2,3,3,3,null,null,3,3,3,null,null,3,null,null,3,3,3,null,null,null,2,null,2,3,null,null,null,3,3,3,null,3,null,null,null,3,2,3,2,null,2,3,null,3,3,3,null,3,2,3,2,2,2,null,null,null,3,null,2,null,null,2,3,3,null,3,null,null,null,2,null,null,3,2,null,3,3,2,null,null,3,3,null,2,null,3,null,2,3,3,3,2,2,3,null,2,2,2,null,3,2,2,3,2,3,2,null,3,2,null,3,2,3,2,3,2,2,null,null,null,3,null,3,null,null,null,3,null,3,3,null,3,null,2,2,2,3,3,null,2,null,3,null,3,null,3,3,3,null,3,null,null,2,null,3,null,3,2,null,3,null,3,2,null,3,null,2,null,2,3,2,3,3,null,3,2,3,3,2,3,3,2,3,3,3,3,3,3,2,null,2,2,3,3,3,2,null,2,3,2,3,3,3,2,null,null,3,2,2,3,2,null,null,3,null,2,null,null,2,null,3,null,3,3,null,null,null,3,null,null,2,null,null,null,null,null,null,null,2,2,3,3,3,3,2,3,2,3,2,null,null,null,3,null,3,2,null,2,null,null,3,null,null,null,2,2,2,null,3,2,3,2,null,3,2,2,null,3,null,null,3,null,3,3,3,3,2,null,null,3,3,3,null,2,3,2,null,2,3,3,3,null,null,null,null,null,null,3,3,2,3,null,null,null,3,3,3,3,3,3,3,null,null,3,3,3,null,3,null,null,3,3,2,2,2,null,3,3,null,3,null,2,null,null,null,null,null,2]
[null,"Březí",null,2,2,2,null,null,2,null,null,null,2,2,null,2,2,null,null,2,null,2,2,null,2,2,2,null,2,null,2,2,null,2,null,2,null,null,2,2,2,2,2,2,2,2,2,null,null,null,2,2,2,2,null,2,null,2,2,null,2,null,2,2,null,2,null,null,null,2,2,2,2,null,2,2,2,null,2,null,null,null,null,null,null,2,2,2,2,null,2,2,2,2,2,2,2,null,null,2,2,2,2,2,null,2,2,null,null,null,null,2,2,null,2,2,2,2,2,null,2,2,2,2,null,null,2,null,2,2,2,2,null,2,2,2,2,2,2,null,2,2,null,2,null,null,2,null,null,2,2,2,2,null,null,null,null,2,2,2,2,2,null,2,2,2,2,null,2,null,null,null,null,2,2,2,2,2,2,2,null,2,null,null,2,2,null,2,null,2,2,2,2,2,2,null,2,2,2,2,null,null,null,null,2,2,null,null,2,null,2,null,null,2,null,null,2,2,2,2,2,2,2,2,null,null,2,null,null,null,null,2,null,null,2,null,2,2,null,2,2,null,2,2,null,null,null,2,2,null,2,2,2,2,2,null,2,null,null,null,null,2,2,2,2,null,2,2,2,null,2,2,null,2,2,2,2,null,null,2,null,2,2,2,null,2,2,2,null,null,null,null,2,2,2,2,2,2,2,2,2,2,null,null,2,2,null,2,null,2,null,null,2,2,null,null,2,null,2,2,2,2,2,null,2,2,null,2,2,2,null,2,2,2,2,null,null,2,2,2,2,2,2,2,2,null,2,2,null,null,2,2,2,2,null,2,null,null,null,2,null,2,2,2,2,null,2,null,2,2,2,null,2,2,null,2,null,null,2,null,2,2,2,2,2,2,null,2,null,null,2,null,2,2,null,2,2,2,2,2,2,2,null,2,2,2,2,null,2,null,2,null,2,2,null,2,2,2,null,2,2,2,2,2,2,null,null,null,null,2,null,2,2,null,2,2,null,2,2,null,2,2,2,2,null,2,null,2,2,2,2,2,2,2,null,2,null,2,null,2,null,2,2,2,2,null,2,null,null,2,null,2,null,null,null,null,2,null,null,2,null,2,null,2,2,2,2,null,2,2,2,2,2,null,2,2,2,2,2,2,2,2,2,null,2,null,2,2,2,2,2,2,null,null,2,2,2,2,2,null,2,2,2,null,2,null,2,2,2,null,2,2,null,null,2,2,2,2,null,null,2,null,2,2,2,2,2,null,2,null,null,2,2,2,2,null,2,2,null,2,2,2,2,2,null,2,null,null,null,null,2,2,null,2,null,2,2,2,null,2,null,2,2,2,2,null,null,2,2,2,2,2,null,null,2,2,null,null,2,2,2,2,null,2,2,2,2,2,2,2,null,2,null,null,2,2,2,2,null,2,2,2,2,2,2,null,2,null,2,2,null,null,null,2,null,2,2,2,2,2,null,null,2,2,2,null,2,2,null,2,2,2,2,2,null,2,2,2,2,2,2,2,2,null,2,2,2,2,2,2,2,2,2,2,null,2,null,2,null,2,2,2,2,2,2,2,null,2,null,2,null,2,null,2,null,2,2,2,2,2,2,2,null,2,null,null,null,null,null,null,2,2,null,2,2,null,2,2,2,2,null,null,null,null,null,2,2,null,2,2,2,null,null,2,2,2,2,null,2,2,2,null,2,2,2,null,null,2,2,null,null,null,null,2,null,null,2,null,2,null,2,2,null,2,2,null,2,null,2,null,null,2,null,null,2,2,2,null,2,2,2,2,2,2,2,2,2,null,null,null,2,2,2,null,2,2,2,2,2,2,2,2,null,2,2,null,null,2,2,2,2,null,2,2,null,2,null,2,2,2,null,2,null,2,null,2,2,2,2,null,2,2,null,2,2,null,2,2,2,2,2,2,null,2,null,null,2,2,2,null,2,null,2,null,2,2,2,null,2,null,2,null,null,2,null,2,null,2,2,null,null,2,null,2,2,null,2,2,2,2,2,2,2,null,null,null,2,null,null,null,null,null,null,null,2,2,2,2,null,2,null,2,null,2,null,2,2,2,2,null,2,null,2,2,2,null,2,2,null,null,null,2,2,null,2,null,2,2,null,null,2,2,2,null,2,2,2,2,2,2,null,null,2,2,2,2,null,null,2,null,null,null,2,2,2,2,2,2,null,null,null,2,2,null,2,2,2,2,2,2,2,2,2,2,2,2,2,2,2,2,null,2,2,null,2,2,null,null,null,2,2,2,2,2,2,null,null,null,2,null,2]
[null,"Něchov",4,null,4,5,3,4,4,3,null,4,null,5,3,4,null,4,null,null,null,3,4,null,4,5,null,null,null,null,4,5,4,null,3,null,null,3,null,null,null,4,4,5,5,null,4,4,null,3,5,null,null,5,null,4,3,null,3,null,4,4,null,5,3,null,3,4,null,5,5,null,null,4,5,5,3,4,null,3,3,3,3,3,3,null,5,3,null,2,4,5,5,5,5,4,4,4,3,4,5,4,5,5,4,null,4,4,2,3,null,4,null,3,3,4,null,null,5,4,5,null,5,4,4,3,null,3,null,null,4,null,null,5,null,5,5,null,5,4,4,null,3,4,null,null,5,3,3,null,null,null,5,4,3,null,4,null,3,5,5,null,3,null,4,3,null,null,5,4,4,2,3,null,null,5,5,3,4,5,2,null,null,4,5,null,null,5,3,null,null,4,null,5,null,3,4,4,5,4,4,null,4,3,5,5,null,4,5,4,null,2,3,5,3,4,4,5,4,null,5,5,5,4,4,3,5,3,4,null,null,5,4,null,4,null,null,null,3,4,4,2,4,null,3,4,3,5,null,2,4,5,4,4,null,3,null,null,null,4,null,5,5,4,null,null,null,4,5,4,4,4,2,4,null,null,5,null,null,4,2,5,5,5,null,4,4,null,4,4,null,null,null,null,5,5,4,null,null,null,5,null,4,3,3,3,4,null,4,5,4,2,5,4,4,null,null,4,null,5,4,null,5,4,4,null,3,4,4,null,4,3,3,null,null,3,3,null,5,null,null,5,3,3,5,null,4,5,3,null,4,4,5,null,4,4,4,3,null,null,null,5,null,4,4,3,5,null,3,3,4,3,5,4,4,4,null,3,5,4,3,null,null,null,4,4,3,4,null,4,null,3,null,4,4,5,3,5,null,null,null,4,4,5,5,null,null,3,4,null,null,3,null,null,null,null,5,4,4,null,5,5,5,3,5,null,3,3,null,null,null,4,null,null,null,5,3,4,4,4,4,4,5,5,null,null,null,5,5,4,null,5,null,null,null,null,3,5,2,null,3,null,3,null,3,3,5,3,3,3,null,5,3,null,3,3,null,2,3,5,3,4,3,3,4,5,5,3,3,5,5,4,5,null,null,null,4,4,4,null,null,null,4,2,4,null,null,null,4,5,5,5,4,2,4,5,4,null,null,2,null,4,5,2,4,4,4,4,4,null,null,4,4,null,null,null,5,4,4,null,null,null,null,null,null,5,5,null,4,null,null,5,null,4,null,3,null,4,4,4,null,4,5,4,null,null,4,2,3,null,4,null,null,null,null,null,4,null,3,null,null,null,null,4,4,3,3,4,5,null,4,null,3,3,3,4,3,2,5,5,5,null,null,5,null,null,5,null,null,5,null,5,4,3,5,null,null,4,2,4,null,null,5,null,4,3,null,4,5,3,3,null,3,4,3,5,null,5,4,null,null,null,3,null,null,null,null,null,null,null,4,3,4,5,null,5,4,5,null,3,5,4,5,2,null,null,4,null,5,5,4,3,null,3,3,4,4,4,null,4,3,5,null,4,3,5,2,4,null,null,4,5,4,4,4,5,null,5,4,5,null,null,4,null,3,3,null,2,null,null,null,4,3,3,null,3,null,null,4,null,2,2,2,null,null,null,5,4,4,5,null,4,3,3,5,5,4,4,null,5,null,4,5,5,null,null,4,5,3,3,3,3,3,null,3,null,4,4,null,null,null,null,4,4,4,3,null,4,5,4,4,4,3,2,5,4,null,3,4,null,null,null,null,5,3,4,null,4,null,null,5,null,3,3,null,5,3,5,null,4,5,5,null,5,4,2,3,null,5,null,4,null,4,5,2,4,null,null,5,null,null,4,null,4,4,null,5,4,5,3,null,5,4,5,5,4,null,null,5,5,null,null,4,null,3,null,5,4,4,3,4,null,5,3,null,5,5,4,3,3,null,null,4,null,3,3,2,4,null,null,3,null,4,3,null,2,4,null,3,null,3,5,null,3,4,3,4,3,3,null,2,3,null,null,5,null,5,4,null,4,4,4,4,3,2,4,4,4,null,null,4,null,4,null,4,null,3,4,3,4,null,3,5,null,5,4,null,4,4,null,null,4,3,3,5,null,null,null,4,null,null,null,4,5,null,5,2,4,null,3,null,4,5,5,5,null,4,4,3,3,2,5,5,3,null,null,4,4,4,5,null,5,null,4,5,3,null,4,4,5,3,4,null,null,4,5,4,4,null,null,5,5,4,5,4,3,null,null,null,2,null,4]
[null,"Besednice",6,5,7,null,5,6,6,null,6,7,7,7,6,null,6,null,null,5,null,6,7,5,6,8,6,5,7,5,7,null,6,6,null,null,null,null,null,6,5,6,6,6,null,7,7,6,null,6,6,null,6,7,5,6,5,5,5,4,7,6,7,null,null,5,6,null,4,null,8,null,null,null,7,8,6,6,null,null,6,6,6,6,null,6,null,6,null,4,7,8,8,8,7,6,7,null,null,7,8,5,null,8,null,6,5,6,5,null,null,null,null,6,5,7,7,6,7,5,8,4,8,7,null,null,5,null,5,null,6,5,4,null,6,null,null,null,7,7,6,5,6,6,5,4,null,4,5,null,5,null,7,7,6,4,6,7,6,null,8,null,6,null,6,null,6,null,7,7,null,5,5,null,6,null,8,5,5,7,4,5,null,null,8,null,5,8,6,null,4,5,6,8,null,5,7,null,7,7,6,5,null,null,7,7,null,6,null,6,5,4,6,null,6,6,6,6,null,6,null,8,8,null,5,5,7,6,null,5,null,7,5,null,7,4,5,4,6,5,6,4,6,null,6,5,null,8,null,5,6,null,null,null,7,6,null,null,null,null,6,7,null,6,null,4,null,6,7,null,null,null,null,6,7,5,8,null,null,6,5,7,null,8,null,5,6,6,7,7,null,null,5,5,7,8,6,6,null,4,8,null,6,null,5,6,7,6,6,8,7,5,7,6,6,6,null,6,6,8,null,null,null,null,6,null,5,6,6,7,5,5,null,null,6,null,null,4,null,null,6,7,6,4,7,5,null,8,null,6,7,6,6,5,null,null,7,null,6,null,5,null,5,6,7,5,null,6,6,5,null,null,8,7,7,6,null,null,7,null,5,null,null,7,6,7,6,6,5,null,5,5,7,7,null,7,5,null,6,6,null,7,null,7,7,null,6,null,7,5,6,null,6,null,4,5,null,6,null,7,null,7,null,null,7,null,6,6,6,5,null,null,6,null,null,7,null,5,7,6,null,6,8,8,4,7,4,8,null,7,5,8,7,7,null,null,null,8,null,null,5,5,5,null,null,null,7,5,6,6,6,8,6,null,5,6,null,4,null,8,null,7,6,6,7,7,null,null,6,null,6,null,6,4,4,5,6,null,null,7,5,null,null,4,7,5,6,7,6,null,null,null,null,5,6,8,null,6,5,null,null,null,null,4,null,6,6,7,null,3,6,7,7,5,null,null,null,null,6,4,5,5,6,7,6,6,null,6,7,6,null,6,6,7,6,5,6,6,6,null,5,6,null,7,null,5,6,5,6,5,7,6,null,7,null,4,6,null,4,6,4,null,6,7,6,5,6,7,8,5,7,6,5,null,6,6,4,null,null,7,8,null,4,7,null,5,7,null,6,7,6,null,null,6,7,null,null,7,null,7,7,null,7,5,7,6,7,null,7,4,null,null,6,6,null,8,6,null,null,null,5,5,5,5,5,null,7,null,4,7,5,null,7,7,5,null,7,null,4,null,null,null,null,5,5,6,null,null,7,null,5,null,5,6,4,6,null,6,4,7,6,7,null,5,null,6,5,6,4,6,7,8,6,7,null,null,null,7,7,null,null,6,6,6,null,null,null,3,null,null,null,6,null,null,5,6,6,7,7,7,null,4,3,null,4,null,null,7,null,null,7,null,5,null,7,null,6,null,5,7,6,null,8,null,null,5,null,8,null,4,6,null,5,5,6,null,6,7,null,6,5,6,null,6,null,null,null,null,7,5,5,null,null,4,null,7,null,null,7,4,5,null,null,null,null,null,4,6,5,6,null,4,null,null,null,8,6,8,null,7,7,null,4,null,5,5,6,6,7,5,6,6,6,8,5,6,null,5,7,5,4,null,5,7,null,6,7,null,null,null,null,8,7,null,8,null,6,null,7,null,5,7,null,4,null,6,null,7,6,6,7,null,8,6,5,8,8,null,5,6,null,4,7,6,4,6,4,null,5,null,5,null,7,5,6,4,6,7,null,null,null,null,null,null,7,6,6,null,null,5,5,null,6,4,null,null,6,5,5,7,null,null,7,null,4,7,null,null,6,null,null,5,null,5,7,3,6,6,5,null,null,4,8,null,null,null,5,7,null,4,4,6,null,5,null,5,6,5,7,null,null,4,null,7,null,6,5,null,5,null,3,6,7,8,8,4,7,null,4,null,4,8,8,null,5,null,6,null,7,null,7,7,null,null,7,null,null,7,6,6,null,5,null,5,7,8,null,7,5,4,8,null,null,null,7,6,5,null,null,4,null,5]
[null,"Keblany",7,6,8,null,null,null,null,6,null,8,null,8,7,5,7,6,4,6,null,7,8,6,7,null,null,6,8,null,8,null,null,null,6,5,4,5,7,null,6,7,null,null,7,8,8,7,4,7,7,6,7,8,6,null,6,6,null,null,8,null,8,8,6,6,7,6,5,null,9,6,null,6,8,9,7,7,null,null,7,7,null,null,null,null,8,null,5,5,8,null,null,9,8,7,8,7,6,null,9,null,null,null,6,7,6,7,null,null,5,5,5,7,6,8,null,7,8,6,9,5,9,null,null,null,6,null,null,6,null,6,5,null,7,null,7,6,8,8,7,null,7,7,6,null,null,null,6,7,null,null,null,8,null,5,7,null,null,8,9,null,7,6,7,null,null,null,8,null,6,6,null,5,null,8,null,6,null,null,5,null,5,6,9,4,6,null,null,null,5,6,null,null,null,null,null,6,null,null,null,6,7,6,null,8,3,null,null,7,6,5,7,7,null,7,7,7,6,7,7,9,9,null,null,null,null,null,7,6,5,8,6,null,null,5,6,null,7,6,null,5,null,5,null,null,4,null,7,null,null,6,6,null,8,7,null,null,4,null,null,null,8,null,null,5,6,null,null,6,null,7,4,7,8,6,9,null,5,null,6,8,null,9,null,6,7,null,null,8,null,5,6,null,8,null,7,7,6,5,9,6,7,6,6,null,8,null,7,9,8,null,8,7,7,7,6,7,7,9,7,null,6,6,7,5,6,7,null,8,null,6,5,6,7,5,5,null,null,4,7,null,null,null,8,6,null,9,5,null,null,7,7,null,6,null,null,6,7,5,null,null,6,7,8,null,null,7,7,null,7,5,null,8,8,7,4,6,8,6,6,7,6,null,7,8,null,null,6,7,6,6,null,8,null,null,6,6,7,7,6,8,null,8,8,7,7,null,null,6,null,null,7,null,5,6,null,7,null,null,null,8,6,5,8,null,7,7,7,6,6,null,7,null,7,8,null,6,8,null,null,null,9,null,5,null,5,9,7,8,6,9,8,null,null,null,5,null,4,5,6,6,6,7,null,6,8,null,null,null,7,9,7,null,6,null,7,5,5,9,6,8,null,null,null,null,null,4,7,null,null,7,7,5,null,null,7,null,6,8,6,4,null,5,null,null,7,null,7,null,null,7,6,6,null,9,5,null,null,5,6,7,null,5,6,null,7,8,7,4,7,8,8,null,5,7,7,5,null,null,6,6,7,null,7,7,null,7,null,7,null,7,7,null,7,null,null,7,7,7,6,null,7,8,6,6,null,6,7,6,8,7,null,8,5,5,7,null,5,7,null,null,7,8,7,null,7,8,9,null,8,7,6,5,7,7,null,null,8,8,null,5,5,null,6,null,null,6,7,null,7,8,6,null,null,6,6,null,null,null,8,null,8,6,8,7,8,6,null,5,6,null,7,7,null,null,null,8,null,null,6,null,6,6,null,5,null,null,5,8,null,null,null,8,6,null,null,null,5,5,7,null,null,6,6,7,null,null,8,7,null,4,null,null,5,7,7,7,5,null,null,8,null,null,null,7,6,7,5,null,null,null,7,8,5,8,5,8,8,8,5,7,null,7,null,5,5,4,null,null,4,null,5,null,6,7,7,8,null,8,null,5,null,null,null,null,8,null,6,null,null,null,null,null,null,null,7,null,null,null,7,null,9,8,6,null,6,null,6,5,7,6,6,6,null,4,7,8,5,7,6,7,7,7,6,null,6,5,8,null,6,6,6,5,null,8,6,5,8,5,6,5,5,6,null,5,5,7,6,7,8,5,6,6,6,null,7,9,null,8,8,null,null,null,null,null,7,7,8,6,null,null,7,9,null,7,null,6,8,6,5,7,6,8,7,7,8,6,7,6,6,9,8,7,9,null,7,4,8,7,6,8,null,null,6,7,null,null,null,7,8,5,9,null,null,9,null,null,6,null,7,5,null,7,null,7,5,7,6,6,6,null,8,6,7,5,7,null,5,null,null,null,null,null,null,null,7,null,6,6,null,null,7,5,null,7,7,6,null,null,null,6,8,4,5,null,6,6,7,6,6,6,7,null,8,4,null,null,6,null,5,5,null,null,null,null,6,null,6,null,5,7,5,null,null,null,null,6,8,6,5,5,null,8,null,7,null,null,null,null,4,null,8,null,null,5,null,null,5,null,5,9,9,null,6,null,7,7,null,8,8,null,null,6,8,4,null,8,7,7,null,6,5,6,null,9,7,null,6,5,null,8,null,null,null,7,6,null,5,null,6,6]
[null,"Mohuřice",9,8,9,null,null,8,null,8,8,10,9,null,9,null,9,null,null,null,null,null,null,null,null,9,7,null,10,null,10,8,8,8,7,7,5,7,null,8,7,9,7,7,9,null,10,9,6,null,8,8,null,10,8,7,8,null,7,null,null,8,10,10,null,8,9,8,null,null,10,8,6,7,10,null,9,null,null,6,8,9,8,null,null,8,10,8,null,null,null,10,9,null,null,8,null,8,7,9,11,6,8,10,8,9,7,null,6,null,null,null,7,8,7,9,null,null,10,8,11,7,10,8,null,7,null,6,7,7,8,8,7,null,8,9,null,8,null,10,8,6,null,null,8,6,9,6,null,9,null,null,9,null,8,7,8,9,null,null,10,null,null,7,9,null,8,null,null,9,8,7,7,6,7,9,10,null,null,8,null,7,6,8,10,6,8,10,7,null,7,7,7,10,7,7,9,7,null,null,8,null,9,null,8,9,5,7,7,8,7,6,9,null,8,8,9,9,7,null,null,11,11,7,7,6,9,7,9,null,7,9,null,6,8,7,8,6,9,8,8,null,7,6,8,7,5,null,9,null,null,null,8,6,10,9,6,6,6,7,8,null,9,8,null,7,8,8,9,8,null,8,5,null,9,null,11,5,6,null,8,null,9,11,5,7,null,null,8,10,null,7,null,7,10,null,null,null,8,6,null,8,null,8,8,7,null,null,9,10,10,6,10,8,8,9,null,9,8,10,null,7,null,8,null,6,8,9,null,null,7,null,null,null,9,7,6,6,7,6,9,null,8,null,9,null,6,10,7,8,9,9,null,6,null,null,null,null,9,null,7,8,7,8,null,7,null,8,9,7,8,7,10,null,9,8,6,8,10,8,8,null,7,9,8,10,8,null,8,null,8,8,8,10,6,null,null,8,null,null,null,10,null,9,10,null,9,5,9,7,8,null,null,3,7,8,null,8,null,null,9,10,null,6,10,5,8,null,8,7,null,8,null,6,9,null,6,7,10,8,null,8,11,9,7,9,7,11,null,10,null,null,9,9,null,null,7,10,5,null,8,7,8,9,6,null,10,7,7,7,9,11,8,6,null,8,8,7,7,11,null,10,7,8,9,9,7,5,9,null,8,8,null,null,5,6,9,null,7,10,null,6,6,7,8,7,9,8,9,7,null,9,null,7,8,11,6,7,null,7,8,9,8,7,null,null,null,10,null,6,null,null,9,null,null,9,9,7,7,5,8,8,null,9,8,null,null,null,null,null,5,8,9,8,8,7,8,9,9,null,null,7,9,null,null,7,8,null,8,7,10,null,5,10,6,null,9,7,7,9,6,5,9,9,8,7,null,9,11,7,9,9,8,7,8,null,null,5,9,10,10,null,null,8,8,null,9,null,9,null,9,10,8,null,8,7,null,8,5,9,null,4,10,7,10,9,9,7,null,7,8,null,null,null,7,9,null,10,6,8,null,null,8,null,null,7,8,null,6,null,null,null,null,null,null,8,null,null,7,6,8,8,8,8,7,8,8,6,10,9,null,null,7,8,6,9,9,null,null,null,8,null,5,7,null,8,8,9,null,8,null,10,null,10,null,null,null,null,null,10,null,null,7,8,5,null,null,null,5,null,6,8,null,5,8,null,9,10,8,null,null,7,null,null,null,5,null,null,8,null,null,7,null,null,9,9,null,7,null,8,9,null,null,null,null,null,null,null,7,7,9,8,8,null,8,null,null,10,6,9,null,9,8,null,7,null,8,null,10,null,8,7,null,null,null,10,null,7,9,null,8,6,null,null,6,null,7,9,8,null,9,6,null,8,8,10,9,11,6,9,10,8,5,8,null,6,null,9,10,7,8,null,9,null,7,null,null,8,9,null,6,8,8,9,9,8,10,null,9,8,null,11,null,null,null,null,9,null,9,9,8,10,6,null,null,9,7,9,8,9,null,null,11,7,7,11,10,8,7,7,8,null,9,null,null,9,7,9,8,null,8,6,null,8,8,6,9,9,7,5,6,8,null,7,9,null,9,5,8,null,7,7,9,6,9,null,null,8,6,9,7,8,10,5,null,null,null,7,null,8,null,8,null,7,10,6,null,null,8,null,7,6,null,6,null,7,null,null,8,null,6,9,7,null,9,7,null,8,10,7,null,6,null,null,7,9,6,null,7,null,6,8,9,10,null,7,9,null,6,6,6,11,null,6,8,7,null,9,9,9,null,8,null,8,9,5,null,null,null,8,null,8,null,7,8,11,null,null,8,6,10,null,7,8,9,null,null,5,6,5,8,8]
[null,"Dobrkovská Lhotka",null,9,10,null,7,9,9,9,null,12,10,11,null,6,11,7,null,null,null,10,11,9,10,11,9,8,11,7,12,10,null,null,null,null,null,9,null,9,9,11,9,8,null,null,null,10,7,9,null,10,null,12,9,null,10,8,9,6,null,null,null,11,null,9,11,10,7,null,12,10,null,8,null,12,null,9,null,8,10,null,null,8,6,null,12,null,8,6,null,12,11,12,10,10,11,10,9,11,13,7,9,12,null,11,9,10,null,7,8,8,null,9,9,11,null,8,11,null,13,null,12,10,null,8,9,7,9,8,9,null,9,7,10,11,null,null,null,12,9,null,9,9,null,8,null,8,null,null,8,5,11,null,9,null,9,11,8,10,12,null,9,9,11,6,10,7,9,null,10,8,8,7,null,null,12,null,8,10,7,9,null,null,null,7,null,null,9,7,9,9,9,12,9,8,10,9,null,null,9,8,10,8,9,11,6,9,null,null,9,7,null,null,null,9,null,11,9,8,null,13,12,8,8,null,10,null,10,8,9,10,null,7,10,9,null,null,11,10,10,8,9,null,9,null,7,null,11,8,7,null,10,7,null,10,7,null,7,8,10,9,11,null,null,8,10,null,11,10,null,null,6,10,null,9,13,7,8,8,10,10,11,null,7,8,null,9,null,12,6,null,9,9,11,11,null,null,9,8,10,null,null,10,null,8,9,8,10,12,12,8,12,9,9,11,null,11,9,12,10,8,9,null,null,8,10,null,null,11,8,null,7,null,11,null,null,null,8,8,10,10,9,7,null,9,7,12,9,null,11,null,null,8,null,null,null,null,null,null,8,10,9,9,10,9,10,10,11,null,10,9,12,11,11,10,7,10,12,9,10,null,9,null,null,12,null,null,9,null,null,null,9,null,null,10,8,9,null,10,8,12,9,10,12,9,null,7,10,null,10,null,null,5,8,10,9,null,null,null,10,null,9,null,null,null,10,9,10,9,null,9,8,null,11,10,8,8,12,9,6,null,null,11,null,11,null,13,10,null,9,null,11,null,null,null,8,11,7,8,null,8,10,11,8,9,null,9,8,9,11,null,10,8,null,10,10,null,8,13,null,12,8,null,null,null,9,null,10,null,10,10,9,6,7,8,11,8,null,11,8,7,8,null,10,9,null,10,null,9,8,10,9,9,10,13,7,8,null,9,10,null,null,null,null,null,10,null,null,8,9,11,11,null,6,11,null,null,null,6,null,10,null,11,10,9,10,9,9,9,null,9,10,9,10,9,null,10,null,null,8,9,null,10,9,8,null,8,10,null,12,9,6,12,8,null,null,9,9,null,null,6,null,null,10,null,9,null,null,null,10,null,10,9,9,9,5,null,10,12,null,8,null,10,null,null,null,8,11,8,11,12,10,8,10,9,8,10,null,10,11,null,null,9,12,null,11,9,9,8,null,4,8,9,null,null,8,12,null,null,9,8,null,null,8,9,10,6,null,null,7,null,null,10,9,10,null,null,9,7,null,null,9,null,8,10,null,null,null,10,null,6,8,9,null,11,null,8,7,10,9,11,6,8,7,10,10,11,null,10,9,null,9,11,7,11,8,null,10,null,7,9,null,9,6,null,null,6,6,null,7,9,7,null,null,null,10,12,null,10,5,null,5,null,6,null,null,10,null,9,null,null,6,7,null,11,9,8,8,null,null,null,null,null,null,7,8,null,null,null,10,10,9,null,9,null,8,null,null,10,8,11,9,9,9,7,null,8,12,8,10,8,null,null,9,null,9,8,10,null,null,null,null,8,8,7,null,11,null,9,11,8,null,9,null,11,11,13,8,11,12,null,7,9,6,8,10,null,12,8,9,8,11,null,8,null,null,10,10,9,null,9,null,10,11,9,null,9,null,9,8,null,10,null,12,null,11,7,11,null,null,null,null,null,null,11,9,10,9,11,null,8,13,null,9,null,12,null,null,null,10,null,11,null,6,11,9,10,10,8,9,7,10,null,10,7,10,null,9,null,8,10,6,8,11,8,11,null,10,8,9,null,11,7,11,null,10,10,null,null,9,9,null,null,null,8,null,null,10,null,8,null,10,8,null,7,null,null,9,8,9,7,10,7,9,null,8,null,10,null,8,10,null,7,null,8,9,10,12,null,6,8,9,11,9,11,8,8,8,null,null,10,10,null,10,9,11,null,null,null,7,13,null,null,null,null,10,null,10,10,10,null,9,null,null,7,6,null,null,10,null,null,null,9,null,null,8,10,9,8,null,10,null,null,11,10,9,7,null,7,10,10]
[null,"Dolní Lhotka",11,10,null,null,8,10,10,null,10,13,11,null,11,7,null,8,6,8,null,null,12,10,null,12,10,null,12,8,null,11,10,null,8,8,null,10,null,10,10,12,null,null,11,null,12,null,8,null,9,11,8,13,10,9,11,9,10,7,11,null,12,null,8,null,12,11,8,null,13,null,null,9,12,13,null,null,6,9,11,11,10,9,7,9,null,10,9,null,10,13,null,13,11,11,null,null,10,null,14,8,null,null,10,12,null,null,null,8,null,null,8,10,10,null,10,9,12,10,14,8,null,null,7,9,null,8,10,null,10,9,10,null,11,12,9,10,11,13,null,7,10,10,10,null,11,null,7,11,9,6,12,9,null,9,10,12,9,null,null,9,10,null,12,7,null,null,10,11,null,9,9,null,8,11,13,8,null,null,8,10,8,null,12,8,null,12,10,8,10,10,null,null,null,9,null,10,10,8,null,9,11,9,10,12,null,10,9,null,null,8,null,null,9,10,11,null,10,9,null,null,13,9,9,7,null,9,11,null,null,11,8,null,null,10,null,8,null,null,null,9,10,null,10,8,null,10,12,9,null,9,11,8,null,11,null,8,8,null,11,10,12,9,6,null,11,10,12,11,null,null,7,11,11,null,14,8,9,null,null,11,null,null,8,9,null,10,9,null,null,8,10,10,null,12,9,9,10,null,11,null,10,null,10,9,10,9,11,null,13,9,13,null,10,null,9,12,10,null,11,9,null,null,9,9,null,null,9,null,9,null,null,9,12,9,null,null,9,9,11,11,10,8,10,null,8,null,10,null,null,10,8,null,null,7,9,9,11,null,9,11,null,null,null,null,11,null,null,8,11,10,13,null,null,null,8,11,null,null,11,9,10,null,null,null,10,8,null,null,null,null,10,12,null,11,9,10,9,11,9,null,10,11,13,10,null,8,null,9,11,5,10,6,9,null,null,null,8,null,11,12,null,7,null,6,null,10,11,10,8,10,null,7,12,11,9,9,null,null,null,10,null,12,null,null,9,14,11,11,10,null,null,11,null,7,9,null,null,null,null,null,11,null,null,10,12,null,9,null,12,13,11,9,8,11,11,null,9,14,9,13,9,9,null,11,10,6,null,null,11,11,10,7,8,9,12,9,null,null,9,8,9,9,11,10,11,11,11,10,9,null,null,10,11,14,null,9,null,10,11,null,9,8,8,8,null,null,9,9,null,12,12,null,7,12,11,8,null,7,null,null,null,12,null,10,null,null,10,null,7,10,11,10,null,null,null,null,null,9,9,10,10,11,10,null,null,9,null,null,13,10,7,null,null,7,10,10,10,10,8,7,11,null,null,9,null,10,null,null,11,11,null,10,10,null,6,6,11,null,null,null,null,11,10,8,11,9,null,9,12,null,11,null,null,10,null,null,6,null,null,null,12,null,13,11,12,null,10,null,null,null,9,null,8,11,9,13,8,null,10,null,10,9,null,10,11,7,8,10,8,null,9,null,null,null,null,null,10,8,10,9,null,null,null,11,10,7,null,null,null,7,null,null,8,12,11,9,8,11,10,12,7,9,null,11,11,12,null,11,10,11,10,12,8,null,9,10,11,null,8,10,8,10,null,7,8,7,7,4,null,10,8,null,null,8,11,13,10,11,null,8,6,5,7,null,10,11,10,null,10,9,7,null,11,12,null,9,null,null,11,8,11,10,null,null,9,null,9,9,null,null,10,null,10,5,9,11,8,11,9,12,10,null,10,8,10,9,13,null,11,9,9,7,10,11,10,null,11,null,10,7,8,9,9,null,null,null,10,null,null,null,null,10,null,12,null,14,9,null,13,10,null,10,7,null,null,11,13,9,10,null,12,10,null,null,7,null,null,null,7,10,10,11,null,null,11,10,10,10,9,12,11,null,null,7,12,null,12,null,10,null,7,6,null,12,10,11,null,12,11,null,null,null,10,13,null,10,9,null,11,null,null,9,null,12,10,null,11,9,10,8,11,null,11,8,11,null,10,null,9,null,null,null,12,9,12,7,null,null,null,null,null,null,12,9,11,null,null,null,null,null,12,6,null,9,8,9,11,10,9,9,11,9,11,8,8,9,10,9,null,null,null,null,null,9,null,9,null,7,9,null,null,8,10,9,null,null,13,9,7,9,10,null,10,12,null,null,null,8,8,11,11,null,11,10,null,8,8,null,null,14,10,8,null,9,11,null,11,null,11,9,10,null,11,null,7,11,9,11,7,9,8,null,null,null,9,null,10,null,12,null,8,9,null,null,10,8,null,null,11,11]
[null,"Záluží",12,11,11,7,9,11,11,10,null,null,12,null,12,8,null,null,null,9,6,null,null,11,null,13,null,null,null,9,13,12,11,null,9,9,7,null,9,null,11,null,null,9,null,null,13,11,null,10,null,12,9,null,11,10,null,10,11,null,12,null,13,12,null,10,13,null,null,7,14,11,8,10,13,14,11,10,null,null,12,12,11,null,8,null,13,null,null,7,11,null,null,14,null,12,null,11,11,12,null,9,10,null,11,null,10,11,8,null,9,null,9,11,null,null,null,10,13,11,null,9,13,11,8,null,10,9,11,9,11,10,11,null,12,13,null,11,12,null,10,8,11,11,null,9,12,9,8,12,null,7,null,10,null,10,11,13,null,11,null,10,11,10,13,8,11,8,11,null,null,10,10,null,null,12,14,9,9,null,9,null,9,10,null,9,9,null,null,9,11,11,null,null,10,10,null,11,null,null,10,10,12,10,11,null,7,11,10,10,null,9,null,10,null,11,12,12,11,null,null,null,null,null,10,null,null,10,12,9,null,null,null,8,null,11,null,null,12,null,11,10,11,8,11,9,8,11,13,10,null,10,null,9,null,12,8,9,9,9,12,null,13,10,7,null,12,11,13,null,8,null,8,null,12,10,15,null,null,9,11,12,null,13,9,null,null,11,10,13,7,null,11,null,null,13,10,null,null,9,null,9,11,11,11,10,11,null,12,null,14,10,null,10,null,12,10,null,null,13,12,10,10,9,null,null,null,null,10,12,10,null,8,10,null,10,null,8,10,10,12,12,null,9,null,null,null,13,11,10,12,11,null,null,8,8,10,null,null,7,10,null,null,10,11,10,12,null,null,9,12,11,null,12,12,null,9,null,13,null,12,10,11,11,10,13,null,9,10,10,null,10,null,null,null,12,null,null,null,null,10,13,11,null,null,null,10,9,null,null,12,6,11,null,null,11,10,null,null,9,12,13,10,8,12,7,11,11,12,null,null,null,9,8,13,null,null,10,13,10,null,11,13,13,8,12,10,null,12,12,11,11,12,12,6,null,10,12,8,null,10,9,null,null,null,null,null,null,10,null,13,14,null,10,9,null,12,9,null,15,10,14,null,10,null,null,11,7,null,9,12,12,null,null,9,10,null,10,null,12,null,null,10,10,12,11,null,12,12,11,null,null,10,11,12,15,8,10,null,11,null,null,10,null,null,null,11,12,10,null,10,null,null,7,8,13,null,9,null,null,10,null,10,null,11,11,11,10,11,null,null,11,12,11,11,null,10,11,11,10,null,11,11,12,11,null,null,10,11,9,14,11,8,13,9,8,11,11,11,11,null,8,12,11,11,10,10,11,13,null,null,12,11,null,11,null,null,null,12,13,null,null,8,12,11,null,12,10,null,10,13,13,12,9,null,11,9,11,7,11,12,null,13,10,14,12,null,10,11,null,9,null,10,10,9,null,10,14,9,10,11,9,11,null,null,11,12,8,null,null,null,null,10,11,10,11,10,null,11,9,11,10,null,9,null,null,11,null,12,11,null,null,9,10,null,13,null,10,null,12,11,null,8,10,null,12,null,null,6,12,11,null,11,null,9,12,null,11,12,11,9,11,9,11,7,8,null,8,null,5,8,11,null,6,10,9,12,null,null,null,null,9,null,6,null,7,null,null,11,null,11,10,null,null,null,13,10,null,9,10,null,9,12,null,8,null,10,null,10,10,11,11,11,9,11,6,null,12,null,12,10,13,11,10,null,9,11,null,14,null,12,null,10,8,11,null,11,null,12,8,11,null,null,10,null,8,8,12,null,10,12,9,null,11,10,13,12,null,null,12,14,11,8,11,null,9,11,12,14,null,null,9,13,null,9,9,null,11,11,10,null,11,null,12,null,10,null,null,null,11,null,13,null,10,13,8,13,8,13,10,11,null,8,7,null,13,null,12,10,13,12,9,null,8,11,null,null,null,10,8,12,null,12,10,7,null,11,11,12,10,null,null,12,null,12,null,12,11,null,6,10,11,null,9,null,null,null,null,null,null,10,null,null,8,null,10,12,11,8,11,10,10,13,7,7,10,9,10,12,null,10,10,12,10,12,9,9,null,11,null,null,null,11,8,10,null,9,null,null,8,10,null,null,9,11,10,null,11,14,10,8,null,11,null,11,null,9,9,null,9,9,12,12,12,null,11,12,9,null,7,null,null,11,9,10,null,12,11,null,null,12,10,null,null,12,8,8,null,10,null,null,10,9,10,null,13,null,11,null,9,13,null,9,10,12,11,11,9,8,null,null,12]
[null,"Slavče",10,null,null,null,null,null,8,null,9,11,null,10,10,null,10,null,5,7,5,9,10,8,9,10,8,7,null,null,11,9,9,9,null,null,6,8,null,null,8,10,8,null,10,10,11,null,null,8,null,9,null,11,null,8,9,7,8,null,10,null,11,null,7,null,10,9,null,null,11,9,7,null,11,11,10,null,null,7,9,10,9,7,null,null,11,9,7,null,null,11,10,11,null,9,10,9,8,10,12,null,null,11,9,10,8,9,7,6,7,7,null,null,8,10,9,null,null,9,12,null,11,9,6,null,8,null,8,null,null,null,8,null,9,10,8,9,10,11,null,null,null,8,9,7,10,7,null,10,7,4,10,null,null,8,null,10,7,9,11,8,null,8,10,null,9,6,null,10,9,null,null,null,null,10,11,null,7,9,null,8,7,9,11,null,null,11,8,6,8,8,8,11,8,null,null,8,9,null,null,7,null,7,null,10,null,8,8,9,8,null,10,9,null,null,10,10,8,null,null,12,null,null,null,null,null,8,null,7,8,null,null,null,9,8,null,7,10,9,9,7,8,7,null,null,6,9,10,7,null,8,9,null,null,null,null,7,null,null,9,8,10,null,5,null,9,9,10,9,7,9,null,9,10,8,12,6,7,null,9,9,10,12,6,null,null,8,null,11,5,null,8,8,null,10,8,null,null,7,null,null,9,9,9,null,null,7,null,11,11,7,11,null,null,10,8,10,null,11,9,null,8,null,null,7,9,10,8,10,null,null,6,8,10,8,7,7,null,7,null,9,null,6,null,8,null,11,8,9,10,null,null,7,7,null,8,8,10,null,null,9,8,null,null,8,9,9,10,null,9,8,11,10,10,9,null,9,11,null,9,8,8,10,9,11,9,7,null,9,null,9,null,11,null,9,null,null,null,9,null,11,8,null,11,8,null,6,null,8,9,null,9,4,null,9,8,9,7,8,null,11,8,null,11,null,9,8,9,8,7,null,null,null,10,null,7,null,11,null,null,9,12,10,null,10,8,12,9,null,8,null,10,10,5,6,null,null,6,7,9,null,9,10,7,8,11,8,null,8,10,12,9,7,7,9,9,8,null,12,8,11,null,null,null,10,8,null,null,8,9,9,8,null,6,7,10,7,null,null,null,null,7,8,9,8,10,9,10,8,7,null,8,8,9,12,null,null,7,8,9,10,null,null,null,7,9,11,8,7,8,10,10,null,null,10,10,null,null,null,9,9,9,10,9,8,9,8,8,null,6,null,null,null,9,8,9,null,10,null,null,8,null,9,8,null,null,null,9,8,11,8,null,11,7,null,null,8,8,null,7,null,10,10,9,8,null,null,12,8,null,10,9,8,null,8,null,null,null,11,11,7,7,9,9,7,10,7,10,null,10,11,9,null,9,8,7,9,null,null,10,5,11,8,11,10,10,8,8,null,null,3,null,8,null,10,7,11,7,9,8,7,9,8,7,8,9,5,7,null,6,null,null,9,8,9,9,8,8,null,9,null,null,null,null,9,9,null,11,null,7,null,null,null,7,10,10,null,null,9,null,10,null,null,6,9,9,10,null,9,8,null,8,null,null,10,7,9,null,null,null,null,null,null,null,6,7,null,null,null,null,null,null,null,9,null,null,11,9,9,null,null,4,null,5,6,null,9,9,8,9,8,null,6,10,10,null,null,7,9,10,7,10,9,7,6,7,null,8,8,null,9,null,8,null,null,null,null,7,null,null,10,null,null,8,null,9,7,11,7,9,null,8,6,null,null,8,null,null,7,9,null,7,null,7,null,null,10,9,null,10,7,7,null,9,null,10,12,7,10,11,9,6,null,null,7,9,10,11,null,null,7,10,null,null,8,6,9,null,8,null,null,9,null,10,null,null,8,null,null,7,null,9,9,11,6,10,6,10,null,9,11,null,5,7,10,8,null,null,10,10,7,12,null,8,12,11,9,8,null,9,7,10,null,5,10,8,null,9,7,null,null,null,null,9,null,null,10,8,null,7,9,5,null,10,7,10,6,9,7,8,8,10,null,10,null,9,9,7,10,8,null,11,null,null,null,null,8,9,9,7,null,9,null,null,null,7,8,null,7,8,null,null,null,null,8,7,null,9,6,7,null,null,6,null,null,8,9,11,8,null,7,8,10,8,10,7,7,null,7,7,9,null,11,9,8,10,7,7,null,null,12,null,7,9,8,9,10,null,null,null,null,8,null,10,6,5,10,8,9,6,null,7,8,null,12,null,9,null,7,11,9,null,null,10,9,8,6,7,6,9,9]
[null,"Lniště",8,7,null,6,6,7,7,7,7,9,8,9,8,null,8,null,null,null,4,8,9,7,8,null,null,null,9,6,9,7,7,7,null,6,null,6,8,7,null,8,null,null,8,9,9,8,5,null,null,7,null,9,7,null,7,null,6,5,9,7,9,9,null,7,8,7,6,6,null,7,5,null,9,10,8,8,5,5,null,8,7,null,null,7,9,7,6,null,9,9,null,10,9,null,9,null,null,8,10,null,7,9,7,8,null,8,null,5,6,6,6,null,null,null,8,null,9,7,10,6,null,null,5,6,7,5,6,null,7,7,6,6,null,8,null,7,9,9,null,null,8,null,7,5,8,5,null,8,6,null,8,null,7,6,null,8,null,null,null,7,8,null,8,null,7,5,null,8,7,null,6,null,null,null,9,7,6,null,6,6,null,7,null,5,7,9,null,null,6,null,null,9,6,6,8,null,8,null,7,null,8,null,null,null,4,null,6,null,null,null,8,8,7,null,8,8,null,null,8,10,10,6,6,null,8,null,8,null,6,null,7,null,null,6,7,5,8,7,7,6,null,null,7,6,null,null,8,6,null,7,7,null,9,8,null,5,5,6,7,null,null,7,null,6,7,7,8,7,6,null,null,8,null,7,10,4,null,7,7,null,8,10,null,null,8,7,null,9,null,6,7,6,9,9,null,8,7,null,null,7,8,7,7,null,null,null,8,null,9,null,9,null,null,8,7,8,null,null,8,null,7,7,8,null,7,8,7,9,6,7,null,7,8,6,null,5,null,5,8,8,7,5,null,7,null,null,6,7,8,8,null,null,null,6,null,7,8,6,6,7,null,null,9,6,8,null,8,6,null,6,9,9,null,null,5,7,9,7,7,null,null,8,null,9,7,null,7,8,7,7,null,9,null,8,7,7,8,8,7,9,7,null,9,null,8,null,8,null,7,null,8,null,6,7,7,null,6,null,8,9,7,null,9,4,null,null,null,null,null,7,null,5,8,9,5,null,9,7,null,7,10,null,6,8,6,10,8,9,7,10,null,8,4,null,6,9,null,6,7,null,7,8,5,7,9,6,null,null,8,10,null,5,null,7,null,6,6,10,7,9,null,7,8,8,null,null,8,7,7,null,null,null,null,null,8,6,null,9,7,5,null,6,null,6,8,null,8,6,null,8,7,null,7,10,null,null,6,6,7,8,7,6,7,null,8,9,null,5,null,9,null,6,null,8,8,6,null,null,7,7,8,8,null,null,8,null,null,8,4,null,8,null,null,6,7,8,8,8,7,null,8,null,7,null,7,7,null,null,9,null,4,9,null,6,8,6,6,8,5,4,8,null,null,6,8,null,10,6,null,8,7,6,null,null,null,null,null,9,9,6,6,null,7,6,8,null,8,null,8,9,7,7,null,null,null,null,4,8,9,null,9,null,9,8,null,null,null,6,7,null,null,null,6,null,null,9,null,7,7,6,7,7,6,6,null,null,null,9,null,5,8,null,7,7,8,7,6,null,null,7,null,7,null,null,7,5,9,8,6,5,6,7,null,8,8,null,6,8,7,9,4,6,5,null,7,8,null,7,null,9,null,9,6,9,6,null,9,9,6,8,null,null,null,null,6,5,null,3,5,7,6,null,7,null,8,9,null,null,4,6,null,null,null,null,9,8,7,7,8,null,null,5,8,8,8,6,6,null,8,6,null,null,null,null,null,null,null,6,8,7,7,7,7,null,null,9,null,8,7,8,null,8,null,6,7,6,9,6,7,null,7,null,8,9,7,6,null,6,7,null,6,7,5,6,6,8,7,8,null,null,null,7,7,9,8,10,5,null,9,7,null,null,null,null,8,8,9,null,7,null,8,null,6,null,5,7,null,7,null,null,7,null,8,null,9,7,8,7,null,10,null,8,10,5,8,5,null,8,7,9,null,null,null,8,null,8,7,8,9,6,10,null,6,10,9,7,null,null,null,6,8,8,null,8,6,8,7,null,7,null,9,7,null,null,8,8,6,null,null,null,4,6,8,null,8,null,7,null,6,6,8,null,8,8,8,7,null,8,6,7,9,null,6,null,7,null,8,7,null,7,8,6,9,5,null,7,7,6,6,null,9,5,8,6,null,8,7,5,null,8,6,null,8,6,7,7,9,null,null,null,7,9,null,8,null,null,6,6,5,7,null,9,null,6,8,6,null,null,null,10,null,5,7,6,8,8,8,null,9,null,7,7,null,null,4,9,null,null,5,7,6,null,null,10,null,8,7,null,9,null,6,null,8,8,7,4,null,null,7,7]
[null,"Chvalkov",13,12,12,null,10,12,12,null,11,14,null,12,13,9,12,9,7,null,7,null,13,12,null,14,11,9,null,10,null,13,null,10,10,10,8,11,10,11,null,null,10,10,12,11,14,12,9,11,10,13,10,14,12,11,12,null,12,8,13,9,null,13,9,null,14,12,9,null,null,null,9,11,14,15,null,11,null,10,13,13,12,10,9,10,14,null,null,8,12,14,12,15,null,13,12,12,12,null,null,10,11,13,12,null,11,null,9,9,null,9,10,12,11,null,11,11,14,null,15,10,14,12,null,10,11,10,12,10,12,11,12,null,13,14,10,null,13,14,null,null,12,null,11,10,13,10,9,null,10,8,null,null,null,11,null,14,10,null,null,11,null,11,14,9,12,9,12,12,null,11,11,null,9,13,null,null,null,11,null,11,10,null,null,10,null,null,11,10,12,12,null,13,null,11,null,12,11,9,null,null,13,null,12,13,8,12,11,11,null,null,11,null,null,12,13,null,null,null,9,null,null,10,null,null,11,11,13,10,10,null,null,null,11,12,9,9,null,11,null,11,12,9,12,10,9,12,null,null,null,11,12,null,11,null,null,10,null,10,null,11,14,11,8,null,13,12,null,12,9,10,null,12,null,11,16,null,10,10,12,13,12,14,10,null,9,null,11,null,8,null,12,null,12,14,11,10,null,null,12,null,12,12,null,11,null,null,null,null,15,11,null,11,11,null,null,13,null,null,13,11,11,10,null,10,11,11,11,13,11,8,null,11,null,11,8,null,null,11,null,13,null,10,11,null,null,null,12,11,null,12,9,9,9,9,11,null,12,8,11,12,10,null,null,11,13,11,null,10,13,null,null,13,null,11,null,null,14,10,null,null,null,12,11,14,11,null,11,11,9,11,11,13,7,null,10,11,10,null,null,14,12,12,14,11,11,null,11,10,13,null,12,7,null,null,11,10,9,10,null,null,11,9,13,8,null,12,13,11,null,11,10,9,null,12,10,null,14,11,7,12,14,14,9,13,null,null,13,13,12,12,13,13,7,8,null,13,9,9,11,10,12,null,9,11,13,10,null,10,14,15,12,11,10,12,13,10,10,16,11,null,null,11,null,null,null,8,null,null,13,13,null,8,10,11,13,null,null,null,10,null,11,11,13,12,null,null,null,12,10,null,null,null,13,16,9,null,8,12,null,null,11,9,9,9,12,13,null,10,null,null,null,8,9,14,12,10,8,null,11,11,null,13,12,12,null,null,12,null,null,null,null,null,12,10,null,12,12,11,10,null,null,13,12,9,9,11,12,null,15,null,null,14,null,9,null,12,12,12,null,9,null,null,12,11,null,12,14,9,12,13,12,11,12,null,null,7,null,null,12,9,9,null,12,9,13,11,12,11,null,null,13,10,11,12,10,12,8,12,null,6,14,11,15,null,null,null,null,null,null,5,11,11,10,12,11,15,null,11,12,10,12,10,9,12,13,null,9,11,9,6,null,null,11,12,null,9,12,10,12,11,10,null,9,null,null,8,null,12,8,8,10,11,9,14,12,11,null,null,12,13,9,11,8,13,12,13,7,13,null,12,null,13,null,null,null,null,null,12,null,12,null,12,8,9,9,null,8,6,9,12,9,7,null,10,13,14,11,12,null,null,7,null,null,null,11,null,12,10,12,11,null,8,12,14,11,10,10,11,12,10,13,11,null,8,null,9,11,11,12,null,12,10,null,7,null,null,null,13,11,null,12,11,11,10,12,null,null,9,13,null,11,9,12,null,null,9,13,9,null,null,9,null,null,null,null,null,null,null,null,10,8,12,11,14,13,15,10,13,15,12,9,null,null,null,null,13,15,10,11,null,null,null,null,10,8,null,null,11,null,null,11,null,12,11,null,11,null,12,null,null,null,11,14,null,14,9,null,11,12,12,null,null,null,14,11,null,11,null,13,null,null,null,12,14,13,11,11,null,13,8,null,11,8,null,12,null,13,11,null,null,13,null,null,null,13,12,null,7,11,null,7,10,null,10,null,null,11,9,null,null,12,null,null,11,13,12,9,12,11,null,null,8,8,null,10,null,null,11,null,null,13,11,null,10,null,null,12,null,null,8,12,9,11,null,null,null,11,9,null,null,8,null,null,11,10,null,15,null,9,10,12,12,12,13,10,10,9,10,10,null,13,13,12,12,13,10,null,8,null,null,12,null,11,10,13,12,12,null,13,null,11,null,null,9,9,12,null,12,8,11,null,11,null,14,10,12,11,null,14,11,null,null,13,12,12,10,9,null,null,13]
[null,"Čížkrajice",14,null,null,8,11,13,13,11,12,15,13,13,null,10,null,10,null,null,8,11,14,13,null,null,null,10,null,null,14,14,12,11,11,null,null,12,null,null,12,null,11,11,13,12,null,13,10,12,11,14,11,15,null,12,13,null,null,null,null,10,14,14,10,null,null,13,10,8,15,null,null,null,15,null,12,null,null,null,14,null,13,11,null,11,15,11,10,9,13,15,13,16,12,14,13,13,13,null,null,null,12,14,13,13,12,12,10,10,10,10,11,13,12,null,12,null,15,12,16,11,15,null,null,11,12,null,null,null,13,12,null,null,14,15,11,12,14,null,11,9,13,12,12,null,14,null,null,null,11,9,13,11,10,12,null,15,11,null,13,12,null,null,null,10,13,null,13,13,11,12,12,8,10,14,15,10,10,null,10,12,11,11,null,11,10,13,12,11,13,null,null,14,null,12,null,13,12,10,null,null,null,11,13,null,9,13,12,12,10,null,12,11,10,13,14,13,12,10,10,14,null,null,11,8,12,null,14,11,11,null,null,null,12,13,10,10,null,null,12,12,13,10,13,null,10,13,null,null,8,12,13,null,12,13,9,null,10,11,13,12,null,12,9,9,null,13,14,null,10,11,9,13,null,null,17,9,11,null,13,null,null,null,null,10,null,12,12,14,9,null,13,11,13,15,12,11,11,null,null,10,13,13,12,12,null,10,13,13,16,12,14,12,null,null,11,14,11,14,null,12,12,11,null,11,12,12,null,14,12,9,9,12,13,12,9,9,null,12,13,14,11,null,12,null,9,14,13,null,13,null,10,null,10,10,null,null,13,9,null,13,11,null,null,12,14,null,null,11,14,12,null,14,13,12,10,12,null,null,13,null,12,13,12,15,null,10,null,12,10,null,12,14,8,13,null,12,null,null,11,15,null,13,15,null,null,10,null,11,14,7,null,8,10,12,null,11,null,11,null,14,null,null,14,9,12,13,null,12,9,null,11,10,null,13,null,null,15,12,8,13,null,15,null,14,11,15,null,null,13,null,null,14,null,9,11,14,null,10,12,11,13,12,10,null,null,11,null,null,15,null,null,null,null,null,14,null,11,17,null,null,10,12,10,12,null,null,null,null,14,14,11,9,null,12,14,11,null,13,11,9,12,12,14,null,null,13,null,13,null,11,11,12,null,null,null,null,null,13,null,null,12,10,null,10,null,14,null,11,11,null,null,9,10,null,13,11,9,null,null,12,11,14,null,13,12,11,null,10,null,12,13,12,13,11,11,13,null,12,null,12,12,14,null,null,10,null,null,10,16,null,null,15,null,10,null,null,null,13,9,10,13,12,null,12,11,13,15,10,13,null,13,null,13,10,7,8,13,14,13,10,10,13,13,10,14,null,13,12,14,null,14,11,12,13,11,13,9,13,null,7,null,12,16,13,13,11,12,9,null,null,12,12,null,13,null,16,10,12,13,11,null,11,10,13,14,null,null,12,10,7,11,12,12,13,null,null,13,11,13,12,11,10,10,12,12,9,null,null,9,9,11,12,null,null,13,12,9,13,null,14,null,12,9,null,13,14,null,14,12,null,12,null,10,13,null,12,null,null,10,null,10,null,null,10,null,9,9,null,10,13,null,8,11,null,14,15,12,13,null,null,8,7,8,null,null,12,null,null,13,null,8,9,13,15,12,11,11,12,null,11,14,12,9,null,11,10,12,12,13,12,null,11,null,8,10,null,9,null,12,14,13,12,12,null,13,10,null,10,null,null,12,10,13,null,12,10,null,null,null,null,10,null,10,null,null,null,null,null,13,11,null,13,null,15,null,16,null,14,16,null,null,null,null,10,null,14,16,null,null,null,null,null,10,11,9,null,null,null,8,12,12,null,null,null,12,12,11,13,10,null,12,null,null,null,null,10,null,12,13,13,9,8,8,null,12,13,12,14,null,null,null,null,13,15,null,12,12,9,null,9,13,null,9,13,13,12,14,null,11,9,14,9,null,9,14,null,null,8,12,12,null,11,13,11,null,8,null,10,11,9,13,9,null,12,14,null,null,13,12,11,null,9,9,11,11,null,13,12,11,11,null,12,13,null,10,10,13,10,10,9,13,10,12,10,10,10,12,10,null,11,9,10,12,null,null,12,16,11,null,11,13,13,13,14,11,11,10,null,11,13,null,14,13,13,14,11,9,9,null,15,13,10,12,11,null,null,null,11,14,11,null,9,13,null,null,null,null,13,null,null,10,12,9,null,null,13,12,10,15,12,10,11,14,13,13,11,10]
[null,"Boršíkov",null,13,13,null,null,14,14,12,13,null,14,null,null,null,null,11,8,10,9,null,15,14,11,null,12,11,null,null,null,15,13,null,null,null,9,13,null,12,13,13,12,null,14,null,null,14,11,13,null,null,12,null,13,null,14,11,13,null,14,11,null,null,null,null,null,null,11,null,null,12,10,12,16,null,13,12,7,11,15,14,14,null,null,12,null,12,11,null,null,null,14,null,13,15,14,14,14,13,null,null,13,15,14,14,13,13,11,11,11,11,null,null,null,12,null,12,16,13,null,12,16,13,9,12,null,11,null,11,null,null,null,null,null,16,12,13,15,15,12,10,14,null,null,11,null,null,10,null,12,10,14,12,11,13,null,null,12,12,14,13,12,12,15,null,null,null,14,14,12,13,13,9,null,15,null,11,null,12,11,null,null,null,13,12,11,14,13,null,null,13,null,null,11,13,11,14,13,11,null,null,null,12,null,14,10,14,13,null,11,null,null,null,11,14,15,null,null,11,null,null,14,11,12,9,null,12,null,null,12,12,9,9,null,null,null,11,13,12,13,null,14,11,14,null,null,14,14,11,null,null,null,null,13,14,10,11,null,null,14,13,null,null,10,10,null,null,null,null,null,12,10,14,13,null,null,10,12,null,14,14,null,15,11,11,10,13,13,null,10,9,14,12,null,null,13,null,12,null,13,null,14,14,13,13,12,11,14,null,17,null,15,13,12,null,12,15,12,null,null,null,13,12,10,12,13,13,12,15,13,null,null,null,null,13,null,10,11,13,14,null,null,11,null,10,10,15,14,null,14,null,null,null,11,11,12,null,null,null,null,null,12,11,null,13,15,12,12,12,15,13,null,null,14,13,null,13,null,null,14,11,null,14,13,16,12,11,12,null,11,12,13,null,9,null,11,13,11,null,null,16,13,14,16,12,12,11,12,12,null,8,null,9,null,13,12,12,10,12,13,15,null,10,15,10,13,14,14,13,null,12,null,null,14,14,11,11,16,13,9,14,15,16,null,15,12,null,14,14,null,null,14,null,null,null,12,null,10,null,13,12,null,null,11,null,null,null,11,11,null,null,13,12,11,13,15,11,null,null,null,15,11,13,null,null,null,null,11,null,15,15,12,null,null,13,15,null,8,14,12,10,null,13,15,null,12,14,13,null,null,12,12,13,14,17,10,null,9,null,12,null,13,11,10,null,null,15,11,null,12,13,13,null,11,null,14,null,10,8,null,13,12,15,13,14,13,12,13,11,8,null,null,13,null,null,null,14,13,13,11,13,null,null,null,null,11,null,null,null,17,12,9,16,10,11,12,null,null,null,null,11,14,13,null,null,12,14,16,11,null,14,null,12,null,null,8,9,14,null,14,11,11,14,14,11,null,12,null,null,15,14,15,12,null,14,12,null,10,null,null,8,15,13,17,14,14,12,13,null,null,6,13,13,11,14,12,17,11,13,null,12,13,null,11,14,null,null,10,null,null,8,12,null,null,14,11,10,null,12,14,null,12,null,11,13,13,10,13,null,10,10,12,null,10,15,14,13,10,14,13,15,10,13,10,14,14,null,8,null,13,null,13,null,null,null,null,13,13,13,11,null,11,null,9,null,10,null,10,7,null,null,null,null,12,11,15,16,13,14,null,null,null,8,9,8,null,13,13,11,14,12,9,10,null,16,13,null,12,13,13,null,15,13,10,9,12,11,13,null,null,13,null,12,null,null,11,null,10,null,null,15,14,13,13,11,14,null,null,null,null,10,null,11,null,12,13,11,14,null,12,8,11,11,null,null,null,null,null,11,null,null,9,14,12,null,14,17,11,null,17,null,null,12,8,11,null,15,null,11,12,10,14,11,11,null,10,12,null,12,null,13,13,13,null,null,13,13,null,14,null,null,null,12,15,9,15,null,14,null,null,null,10,null,9,15,null,null,13,15,14,10,14,null,14,16,null,13,13,10,null,10,14,12,null,null,14,null,null,12,null,10,15,10,13,10,15,13,null,9,null,null,8,12,14,null,13,9,12,11,null,10,14,10,null,13,null,13,10,14,null,12,14,10,null,12,12,11,null,null,null,12,null,null,14,null,11,11,14,null,11,10,14,null,null,11,11,11,13,11,null,null,10,null,13,12,null,13,null,12,null,12,null,14,14,15,null,12,null,null,null,14,14,null,14,14,15,12,null,10,8,16,14,11,null,12,14,13,13,null,null,12,null,10,14,10,10,13,11,14,null,12,null,13,10,15,null,14,null,11,null,null,11,12,15,14,14,null,null,8,12]
[]
[null,"Vzdálenost [km]",35,38,37,23,34,34,40,40,35,39,37,38,34,32,36,33,33,32,31,36,41,37,38,32,33,33,31,33,39,38,33,33,35,34,33,40,34,33,37,40,35,34,37,33,35,38,36,36,34,38,32,40,39,34,40,35,37,30,38,33,36,38,33,32,37,36,35,23,36,38,31,37,39,36,37,38,31,38,36,39,34,30,31,34,38,33,37,31,36,34,33,38,34,36,40,36,36,37,32,33,32,37,34,38,37,40,30,32,38,29,36,37,34,36,30,34,39,32,38,27,36,35,26,37,38,39,32,37,34,31,36,25,36,37,33,36,38,38,38,33,36,37,36,36,33,34,31,31,32,29,34,32,35,38,32,36,29,35,35,30,39,35,42,29,35,32,35,35,39,34,38,36,33,34,35,35,33,32,33,34,34,38,35,24,37,33,33,30,34,37,28,34,34,37,35,36,31,29,29,32,35,35,33,36,28,35,25,32,36,30,34,32,35,37,38,34,36,33,30,37,36,33,32,31,34,32,37,34,35,36,32,34,34,37,34,32,39,34,36,34,34,32,34,31,32,28,38,30,28,28,39,29,34,41,34,33,36,32,36,30,35,35,28,32,36,33,36,36,29,33,35,36,34,35,40,35,35,32,38,34,33,35,34,36,34,33,32,39,30,36,38,35,36,35,33,35,38,33,35,36,37,40,38,34,35,28,39,35,40,32,39,38,34,33,37,37,35,36,42,34,29,37,38,32,40,34,32,37,32,33,36,36,37,39,32,32,33,34,39,34,33,32,33,36,34,36,41,32,38,33,33,31,31,31,28,31,36,34,33,35,36,36,33,38,32,35,37,33,37,41,29,38,36,35,35,40,37,35,39,33,37,34,35,39,37,30,38,37,34,36,33,39,30,33,36,29,36,32,38,39,33,36,36,34,36,34,37,33,35,28,36,23,35,38,31,34,32,29,35,35,30,34,36,25,37,36,36,35,33,34,33,33,39,38,36,37,40,36,30,36,37,34,34,37,37,39,35,39,40,34,36,33,32,28,39,34,35,35,35,35,38,37,35,35,39,36,34,33,39,36,35,37,32,35,36,34,38,38,35,39,33,37,34,35,28,33,37,28,34,37,34,32,33,34,37,33,32,39,34,36,34,36,35,33,38,34,38,26,30,33,39,34,39,40,32,29,31,36,37,32,35,33,36,29,39,36,34,30,36,37,35,31,34,36,38,29,32,34,35,38,33,35,37,35,34,35,31,36,32,36,38,35,37,34,35,40,35,37,35,35,34,36,36,34,34,33,36,32,39,34,34,40,35,32,35,34,37,37,33,32,37,34,37,33,38,36,35,33,38,36,37,35,36,34,27,30,36,40,35,37,36,35,36,29,34,36,37,30,39,41,40,33,32,36,34,35,33,36,33,26,38,35,41,39,37,37,29,32,31,27,34,35,36,35,31,40,34,35,37,33,39,36,30,40,34,28,33,35,30,28,30,34,38,36,32,28,36,37,34,35,33,33,35,35,38,35,37,35,33,29,36,34,35,41,40,36,34,38,34,41,22,33,30,36,37,39,31,35,30,32,36,35,28,40,32,34,38,35,37,34,33,34,34,35,36,31,33,28,24,36,36,33,38,33,39,41,36,34,28,27,27,27,28,33,34,34,40,32,37,32,28,30,32,36,40,32,32,33,37,32,34,33,32,29,34,30,34,33,40,41,35,35,31,32,35,30,32,37,36,40,36,36,37,34,37,29,35,32,36,36,35,32,31,37,39,33,37,34,32,36,34,29,35,29,31,32,30,37,36,33,31,40,37,39,40,37,34,37,41,32,32,34,30,32,34,38,39,36,33,30,38,35,32,34,33,39,32,37,33,37,36,37,35,34,35,36,37,41,34,30,34,35,40,26,40,25,37,36,32,34,33,27,32,40,33,39,39,41,40,36,38,29,35,38,32,36,35,32,35,35,39,33,31,37,38,39,39,35,37,34,39,33,36,34,38,34,32,33,34,34,32,34,36,29,39,32,37,34,33,34,38,37,29,34,34,35,31,35,36,34,38,31,32,30,34,35,36,36,35,37,37,34,38,33,28,30,41,33,38,35,34,35,31,36,35,31,40,30,32,39,35,30,36,35,32,39,41,34,34,35,33,37,34,33,32,30,32,32,34,35,37,35,35,34,39,32,33,32,32,37,32,31,33,40,37,38,38,35,40,33,32,36,35,32,32,38,33,35,31,32,35,36,32,35,33,33,38,35,33,34,36,32,37,41,37,35,33,30,40,36]
[null,"Počet zastávek",{"$f":"SUM(IF(C4>=1,1,0),IF(C5>=1,1,0),IF(C6>=1,1,0),IF(C7>=1,1,0),IF(C8>=1,1,0),IF(C9>=1,1,0),IF(C10>=1,1,0),IF(C11>=1,1,0),IF(C12>=1,1,0),IF(C13>=1,1,0),IF(C14>=1,1,0),IF(C15>=1,1,0),IF(C16>=1,1,0),IF(C17>=1,1,0),IF(C18>=1,1,0),IF(C19>=1,1,0),IF(C20>=1,1,0),IF(C21>=1,1,0))","v":14},{"$f":"SUM(IF(D4>=1,1,0),IF(D5>=1,1,0),IF(D6>=1,1,0),IF(D7>=1,1,0),IF(D8>=1,1,0),IF(D9>=1,1,0),IF(D10>=1,1,0),IF(D11>=1,1,0),IF(D12>=1,1,0),IF(D13>=1,1,0),IF(D14>=1,1,0),IF(D15>=1,1,0),IF(D16>=1,1,0),IF(D17>=1,1,0),IF(D18>=1,1,0),IF(D19>=1,1,0),IF(D20>=1,1,0),IF(D21>=1,1,0))","v":13},{"$f":"SUM(IF(E4>=1,1,0),IF(E5>=1,1,0),IF(E6>=1,1,0),IF(E7>=1,1,0),IF(E8>=1,1,0),IF(E9>=1,1,0),IF(E10>=1,1,0),IF(E11>=1,1,0),IF(E12>=1,1,0),IF(E13>=1,1,0),IF(E14>=1,1,0),IF(E15>=1,1,0),IF(E16>=1,1,0),IF(E17>=1,1,0),IF(E18>=1,1,0),IF(E19>=1,1,0),IF(E20>=1,1,0),IF(E21>=1,1,0))","v":13},8,11,14,14,12,13,15,14,13,13,10,12,11,8,10,9,11,15,14,11,14,12,11,12,10,14,15,13,11,11,10,9,13,10,12,13,13,12,11,14,12,14,14,11,13,11,14,12,15,13,12,14,11,13,8,14,11,14,14,10,10,14,13,{"$f":"SUM(IF(BQ4>=1,1,0),IF(BQ5>=1,1,0),IF(BQ6>=1,1,0),IF(BQ7>=1,1,0),IF(BQ8>=1,1,0),IF(BQ9>=1,1,0),IF(BQ10>=1,1,0),IF(BQ11>=1,1,0),IF(BQ12>=1,1,0),IF(BQ13>=1,1,0),IF(BQ14>=1,1,0),IF(BQ15>=1,1,0),IF(BQ16>=1,1,0),IF(BQ17>=1,1,0),IF(BQ18>=1,1,0),IF(BQ19>=1,1,0),IF(BQ20>=1,1,0),IF(BQ21>=1,1,0))","v":11},8,15,12,10,12,16,15,13,12,7,11,15,14,14,11,9,12,15,12,11,9,13,15,14,16,13,15,14,14,14,13,14,10,13,15,14,14,13,13,11,11,11,11,11,13,12,12,12,12,16,13,16,12,16,13,9,12,12,11,12,11,13,12,{"$f":"SUM(IF(EC4>=1,1,0),IF(EC5>=1,1,0),IF(EC6>=1,1,0),IF(EC7>=1,1,0),IF(EC8>=1,1,0),IF(EC9>=1,1,0),IF(EC10>=1,1,0),IF(EC11>=1,1,0),IF(EC12>=1,1,0),IF(EC13>=1,1,0),IF(EC14>=1,1,0),IF(EC15>=1,1,0),IF(EC16>=1,1,0),IF(EC17>=1,1,0),IF(EC18>=1,1,0),IF(EC19>=1,1,0),IF(EC20>=1,1,0),IF(EC21>=1,1,0))","v":12},7,14,16,12,13,15,15,12,10,14,12,12,11,14,10,10,12,12,10,14,12,11,13,11,15,12,12,14,13,12,12,15,10,13,9,14,14,12,13,13,9,10,15,15,11,10,12,11,12,11,11,13,12,11,14,13,11,13,13,9,14,11,13,{"$f":"SUM(IF(GO4>=1,1,0),IF(GO5>=1,1,0),IF(GO6>=1,1,0),IF(GO7>=1,1,0),IF(GO8>=1,1,0),IF(GO9>=1,1,0),IF(GO10>=1,1,0),IF(GO11>=1,1,0),IF(GO12>=1,1,0),IF(GO13>=1,1,0),IF(GO14>=1,1,0),IF(GO15>=1,1,0),IF(GO16>=1,1,0),IF(GO17>=1,1,0),IF(GO18>=1,1,0),IF(GO19>=1,1,0),IF(GO20>=1,1,0),IF(GO21>=1,1,0))","v":11},14,13,11,10,10,13,12,13,14,10,14,13,12,11,9,12,11,11,14,15,13,12,11,10,14,14,11,12,9,12,12,14,11,12,12,9,9,12,13,10,11,13,12,13,12,14,11,14,10,10,14,14,11,8,12,13,9,13,14,10,11,10,11,{"$f":"SUM(IF(JA4>=1,1,0),IF(JA5>=1,1,0),IF(JA6>=1,1,0),IF(JA7>=1,1,0),IF(JA8>=1,1,0),IF(JA9>=1,1,0),IF(JA10>=1,1,0),IF(JA11>=1,1,0),IF(JA12>=1,1,0),IF(JA13>=1,1,0),IF(JA14>=1,1,0),IF(JA15>=1,1,0),IF(JA16>=1,1,0),IF(JA17>=1,1,0),IF(JA18>=1,1,0),IF(JA19>=1,1,0),IF(JA20>=1,1,0),IF(JA21>=1,1,0))","v":14},13,14,12,10,10,13,13,14,12,10,12,10,14,13,11,17,10,12,10,14,14,12,15,11,11,10,13,13,14,10,9,14,12,13,15,13,11,12,9,13,10,14,14,13,13,12,11,14,13,17,12,15,13,12,12,12,15,12,14,13,12,13,12,{"$f":"SUM(IF(LM4>=1,1,0),IF(LM5>=1,1,0),IF(LM6>=1,1,0),IF(LM7>=1,1,0),IF(LM8>=1,1,0),IF(LM9>=1,1,0),IF(LM10>=1,1,0),IF(LM11>=1,1,0),IF(LM12>=1,1,0),IF(LM13>=1,1,0),IF(LM14>=1,1,0),IF(LM15>=1,1,0),IF(LM16>=1,1,0),IF(LM17>=1,1,0),IF(LM18>=1,1,0),IF(LM19>=1,1,0),IF(LM20>=1,1,0),IF(LM21>=1,1,0))","v":10},12,13,13,12,15,13,9,9,12,13,13,9,10,11,13,14,14,11,11,12,10,10,15,14,11,14,12,10,9,11,11,12,9,13,9,11,13,12,11,11,13,15,12,12,12,15,13,13,14,14,13,10,13,14,10,14,11,12,14,13,16,12,11,{"$f":"SUM(IF(NY4>=1,1,0),IF(NY5>=1,1,0),IF(NY6>=1,1,0),IF(NY7>=1,1,0),IF(NY8>=1,1,0),IF(NY9>=1,1,0),IF(NY10>=1,1,0),IF(NY11>=1,1,0),IF(NY12>=1,1,0),IF(NY13>=1,1,0),IF(NY14>=1,1,0),IF(NY15>=1,1,0),IF(NY16>=1,1,0),IF(NY17>=1,1,0),IF(NY18>=1,1,0),IF(NY19>=1,1,0),IF(NY20>=1,1,0),IF(NY21>=1,1,0))","v":12},12,11,12,13,14,9,13,11,13,11,11,11,16,13,14,16,12,12,11,12,12,14,8,12,9,10,13,12,12,10,12,13,15,11,10,15,10,13,14,14,13,9,12,11,10,14,14,11,11,16,13,9,14,15,16,9,15,12,15,14,14,13,12,{"$f":"SUM(IF(QK4>=1,1,0),IF(QK5>=1,1,0),IF(QK6>=1,1,0),IF(QK7>=1,1,0),IF(QK8>=1,1,0),IF(QK9>=1,1,0),IF(QK10>=1,1,0),IF(QK11>=1,1,0),IF(QK12>=1,1,0),IF(QK13>=1,1,0),IF(QK14>=1,1,0),IF(QK15>=1,1,0),IF(QK16>=1,1,0),IF(QK17>=1,1,0),IF(QK18>=1,1,0),IF(QK19>=1,1,0),IF(QK20>=1,1,0),IF(QK21>=1,1,0))","v":14},14,7,9,12,14,10,10,13,12,13,12,11,11,13,11,11,11,15,15,13,12,11,13,15,11,11,17,11,15,11,13,10,12,11,8,11,9,15,15,12,9,10,13,15,11,8,14,12,10,12,13,15,12,12,14,13,13,10,12,12,13,14,17,{"$f":"SUM(IF(SW4>=1,1,0),IF(SW5>=1,1,0),IF(SW6>=1,1,0),IF(SW7>=1,1,0),IF(SW8>=1,1,0),IF(SW9>=1,1,0),IF(SW10>=1,1,0),IF(SW11>=1,1,0),IF(SW12>=1,1,0),IF(SW13>=1,1,0),IF(SW14>=1,1,0),IF(SW15>=1,1,0),IF(SW16>=1,1,0),IF(SW17>=1,1,0),IF(SW18>=1,1,0),IF(SW19>=1,1,0),IF(SW20>=1,1,0),IF(SW21>=1,1,0))","v":10},10,9,13,12,10,13,11,10,10,12,15,11,11,12,13,13,9,11,14,14,11,10,8,11,13,12,15,13,14,13,12,13,11,8,12,13,13,13,11,11,14,13,13,11,13,12,14,12,9,11,11,12,10,17,12,9,16,10,11,12,12,12,13,{"$f":"SUM(IF(VI4>=1,1,0),IF(VI5>=1,1,0),IF(VI6>=1,1,0),IF(VI7>=1,1,0),IF(VI8>=1,1,0),IF(VI9>=1,1,0),IF(VI10>=1,1,0),IF(VI11>=1,1,0),IF(VI12>=1,1,0),IF(VI13>=1,1,0),IF(VI14>=1,1,0),IF(VI15>=1,1,0),IF(VI16>=1,1,0),IF(VI17>=1,1,0),IF(VI18>=1,1,0),IF(VI19>=1,1,0),IF(VI20>=1,1,0),IF(VI21>=1,1,0))","v":9},11,14,13,12,12,12,14,16,11,13,14,13,12,13,10,8,9,14,14,14,11,11,14,14,11,14,12,13,12,15,14,15,12,12,14,12,13,10,13,12,8,15,13,17,14,14,12,13,9,9,6,13,13,11,14,12,17,11,13,13,12,13,11,{"$f":"SUM(IF(XU4>=1,1,0),IF(XU5>=1,1,0),IF(XU6>=1,1,0),IF(XU7>=1,1,0),IF(XU8>=1,1,0),IF(XU9>=1,1,0),IF(XU10>=1,1,0),IF(XU11>=1,1,0),IF(XU12>=1,1,0),IF(XU13>=1,1,0),IF(XU14>=1,1,0),IF(XU15>=1,1,0),IF(XU16>=1,1,0),IF(XU17>=1,1,0),IF(XU18>=1,1,0),IF(XU19>=1,1,0),IF(XU20>=1,1,0),IF(XU21>=1,1,0))","v":11},14,14,8,10,12,10,8,12,12,12,14,11,10,13,12,14,12,12,10,11,13,13,10,13,12,10,10,12,12,10,15,14,13,10,14,13,15,10,13,10,14,14,14,8,14,13,12,13,13,10,13,9,13,13,13,11,12,11,12,9,10,10,9,{"$f":"SUM(IF(AAG4>=1,1,0),IF(AAG5>=1,1,0),IF(AAG6>=1,1,0),IF(AAG7>=1,1,0),IF(AAG8>=1,1,0),IF(AAG9>=1,1,0),IF(AAG10>=1,1,0),IF(AAG11>=1,1,0),IF(AAG12>=1,1,0),IF(AAG13>=1,1,0),IF(AAG14>=1,1,0),IF(AAG15>=1,1,0),IF(AAG16>=1,1,0),IF(AAG17>=1,1,0),IF(AAG18>=1,1,0),IF(AAG19>=1,1,0),IF(AAG20>=1,1,0),IF(AAG21>=1,1,0))","v":10},7,10,13,9,8,12,11,15,16,13,14,5,9,8,8,9,8,11,13,13,11,14,12,9,10,13,16,13,11,12,13,13,11,15,13,10,9,12,11,13,12,13,13,12,12,11,8,11,12,10,13,12,15,14,13,13,11,14,10,14,10,13,10,{"$f":"SUM(IF(ACS4>=1,1,0),IF(ACS5>=1,1,0),IF(ACS6>=1,1,0),IF(ACS7>=1,1,0),IF(ACS8>=1,1,0),IF(ACS9>=1,1,0),IF(ACS10>=1,1,0),IF(ACS11>=1,1,0),IF(ACS12>=1,1,0),IF(ACS13>=1,1,0),IF(ACS14>=1,1,0),IF(ACS15>=1,1,0),IF(ACS16>=1,1,0),IF(ACS17>=1,1,0),IF(ACS18>=1,1,0),IF(ACS19>=1,1,0),IF(ACS20>=1,1,0),IF(ACS21>=1,1,0))","v":12},11,13,12,13,11,14,9,12,8,11,11,10,8,8,12,10,11,13,11,9,14,12,15,14,17,11,14,17,12,9,12,8,11,11,15,16,11,12,10,14,11,11,11,10,12,11,12,8,13,13,13,12,11,13,13,11,14,10,13,12,12,15,9,{"$f":"SUM(IF(AFE4>=1,1,0),IF(AFE5>=1,1,0),IF(AFE6>=1,1,0),IF(AFE7>=1,1,0),IF(AFE8>=1,1,0),IF(AFE9>=1,1,0),IF(AFE10>=1,1,0),IF(AFE11>=1,1,0),IF(AFE12>=1,1,0),IF(AFE13>=1,1,0),IF(AFE14>=1,1,0),IF(AFE15>=1,1,0),IF(AFE16>=1,1,0),IF(AFE17>=1,1,0),IF(AFE18>=1,1,0),IF(AFE19>=1,1,0),IF(AFE20>=1,1,0),IF(AFE21>=1,1,0))","v":15},10,14,12,13,13,10,8,9,15,12,13,13,15,14,10,14,8,14,16,13,13,13,10,13,10,14,12,9,13,14,12,14,12,11,10,15,10,13,10,15,13,10,9,12,12,8,12,14,11,13,9,12,11,11,10,14,10,12,13,14,13,10,14,{"$f":"SUM(IF(AHQ4>=1,1,0),IF(AHQ5>=1,1,0),IF(AHQ6>=1,1,0),IF(AHQ7>=1,1,0),IF(AHQ8>=1,1,0),IF(AHQ9>=1,1,0),IF(AHQ10>=1,1,0),IF(AHQ11>=1,1,0),IF(AHQ12>=1,1,0),IF(AHQ13>=1,1,0),IF(AHQ14>=1,1,0),IF(AHQ15>=1,1,0),IF(AHQ16>=1,1,0),IF(AHQ17>=1,1,0),IF(AHQ18>=1,1,0),IF(AHQ19>=1,1,0),IF(AHQ20>=1,1,0),IF(AHQ21>=1,1,0))","v":12},12,14,10,9,12,12,11,13,12,11,12,13,12,14,10,11,11,14,10,11,10,14,10,12,11,11,11,13,11,10,11,10,10,13,12,10,13,16,12,9,12,13,14,14,15,11,12,10,10,11,14,14,14,14,14,15,12,9,10,8,16,14,11,{"$f":"SUM(IF(AKC4>=1,1,0),IF(AKC5>=1,1,0),IF(AKC6>=1,1,0),IF(AKC7>=1,1,0),IF(AKC8>=1,1,0),IF(AKC9>=1,1,0),IF(AKC10>=1,1,0),IF(AKC11>=1,1,0),IF(AKC12>=1,1,0),IF(AKC13>=1,1,0),IF(AKC14>=1,1,0),IF(AKC15>=1,1,0),IF(AKC16>=1,1,0),IF(AKC17>=1,1,0),IF(AKC18>=1,1,0),IF(AKC19>=1,1,0),IF(AKC20>=1,1,0),IF(AKC21>=1,1,0))","v":12},12,14,13,13,11,14,12,11,10,14,10,10,13,11,14,8,12,10,13,10,15,10,14,12,11,15,12,11,12,15,14,14,11,10,8,12,13]
[]
[null,"Průměr vzdálenosti [km]",{"$f":"AVERAGEA(C23:ALN23)","v":34.567},null,"Maximum",{"$f":"MAX(C23:ALN23)","v":42}]
[null,"Průměrný počet zastávek",{"$f":"AVERAGEA(C24:ALN24)","v":12.077},null,"Minimum",{"$f":"MIN(C23:ALN23)","v":22}]
[null,"Medián vzdáleností [km]",{"$f":"MEDIAN(C23:ALN23)","v":35}]
[null,"Medián počtu zastávek",{"$f":"MEDIAN(C24:ALN24)","v":12}]

{"sheet":"Podklady pro výpočet nákladů","index":9,"n_rows":27,"n_cols":5,"rows_kept":27,"cut":false,"hidden":false,"merged":[[5,0,5,1],[6,0,6,1],[7,0,7,1],[24,0,24,1]]}
["Profese","Hrubá mzda","Superhrubá mzda","Hrubá mzda roční","Super hrubá mzda roční"]
["řidič",30000,{"$f":"1.34*B2","v":40200},{"$f":"12*B2","v":360000},{"$f":"12*C2","v":482400}]
["popelář",25000,{"$f":"1.34*B3","v":33500},{"$f":"12*B3","v":300000},{"$f":"12*C3","v":402000}]
["CELKEM",{"$f":"SUM(B2:B3)","v":55000},{"$f":"SUM(C2:C3)","v":73700},{"$f":"SUM(D2:D3)","v":660000},{"$f":"SUM(E2:E3)","v":884400}]
[]
["Vozidlo",null,"Cena bez DPH","kurz (dne 7.4.2020) 1€ =","Cena v Kč bez DPH"]
["Mercedes Benz Antos 2530 L",null,173500,27.215,{"$f":"C7*D7","v":4721802.5}]
["Technické údaje "]
["Rok výroby",2019]
["Palivová nádrž [l]",290]
["Typ nádrže","naftová"]
["Průměrná spotřeba na 100 km = 30l"]
[]
["Nafta","cena za 1l","cena za plnou nádrž"]
["(kurz dne 7.4.2020)",27.59,{"$f":"B10*B15","v":8001.1}]
[]
["Průměrná spotřeba"]
["vzdálenost","litry","cena"]
[100,30,{"$f":"B19*$B$15","v":827.7}]
[1,{"$f":"B19/A19","v":0.3},{"$f":"B20*$B$15","v":8.2769999999999992}]
[]
["Odpisy"]
["Odpisová skupina ",2]
["Doba odepisování ",5,"let"]
["Rovnoměrné odpisy - Odpisované sazby"]
["1.rok odpisování",0.11]
["další roky odpisování",0.2225]

{"sheet":"Vypočtení nákladů","index":10,"n_rows":60,"n_cols":13,"rows_kept":60,"cut":false,"hidden":false,"merged":[[1,11,2,11]]}
["rok",1,2,3,4,5,null,null,null,null,null,"počet týdnů v roce",52]
["Mzdy",{"$f":"'Podklady pro výpočet nákladů'!$E$4","v":884400},{"$f":"'Podklady pro výpočet nákladů'!$E$4","v":884400},{"$f":"'Podklady pro výpočet nákladů'!$E$4","v":884400},{"$f":"'Podklady pro výpočet nákladů'!$E$4","v":884400},{"$f":"'Podklady pro výpočet nákladů'!$E$4","v":884400},null,null,null,null,null,"spotřeba na 1km",{"$f":"'Podklady pro výpočet nákladů'!B20","v":0.3}]
["Odpisy na nákladní automobil",{"$f":"'Podklady pro výpočet nákladů'!$E$7*'Podklady pro výpočet nákladů'!$B$26","v":519398.27500000002},{"$f":"'Podklady pro výpočet nákladů'!$E$7*'Podklady pro výpočet nákladů'!$B$27","v":1050601.0562499999},{"$f":"'Podklady pro výpočet nákladů'!$E$7*'Podklady pro výpočet nákladů'!$B$27","v":1050601.0562499999},{"$f":"'Podklady pro výpočet nákladů'!$E$7*'Podklady pro výpočet nákladů'!$B$27","v":1050601.0562499999},{"$f":"'Podklady pro výpočet nákladů'!$E$7*'Podklady pro výpočet nákladů'!$B$27","v":1050601.0562499999},null,null,null,null,null,null,{"$f":"'Podklady pro výpočet nákladů'!C20","v":8.2769999999999992}]
["Počet najetých km (původní situace)",{"$f":"$M$1/2*'Výchozí stav'!$M$22","v":1664},{"$f":"$M$1/2*'Výchozí stav'!$M$22","v":1664},{"$f":"$M$1/2*'Výchozí stav'!$M$22","v":1664},{"$f":"$M$1/2*'Výchozí stav'!$M$22","v":1664},{"$f":"$M$1/2*'Výchozí stav'!$M$22","v":1664}]
["Náklady na palivo",{"$f":"$M$3*B4","v":13772.927999999998},{"$f":"$M$3*C4","v":13772.927999999998},{"$f":"$M$3*D4","v":13772.927999999998},{"$f":"$M$3*E4","v":13772.927999999998},{"$f":"$M$3*F4","v":13772.927999999998}]
["CELKEM",{"$f":"SUM(B2+B3+B5)","v":1417571.203},{"$f":"SUM(C2+C3+C5)","v":1948773.98425},{"$f":"SUM(D2+D3+D5)","v":1948773.98425},{"$f":"SUM(E2+E3+E5)","v":1948773.98425},{"$f":"SUM(F2+F3+F5)","v":1948773.98425}]
["Kumulované náklady",{"$f":"B6","v":1417571.203},{"$f":"B7+C6","v":3366345.18725},{"$f":"C7+D6","v":5315119.1715000002},7263893.1557499999,9212667.1400000006]
["CELKEM 5 let",{"$f":"SUM(B6:F6)","v":9212667.1400000006}]
[]
[]
[]
[]
[]
["rok",1,2,3,4,5]
["Mzdy",{"$f":"'Podklady pro výpočet nákladů'!$E$4","v":884400},{"$f":"'Podklady pro výpočet nákladů'!$E$4","v":884400},{"$f":"'Podklady pro výpočet nákladů'!$E$4","v":884400},{"$f":"'Podklady pro výpočet nákladů'!$E$4","v":884400},{"$f":"'Podklady pro výpočet nákladů'!$E$4","v":884400}]
["Odpisy na nákladní automobil",{"$f":"'Podklady pro výpočet nákladů'!$E$7*'Podklady pro výpočet nákladů'!$B$26","v":519398.27500000002},{"$f":"'Podklady pro výpočet nákladů'!$E$7*'Podklady pro výpočet nákladů'!$B$27","v":1050601.0562499999},{"$f":"'Podklady pro výpočet nákladů'!$E$7*'Podklady pro výpočet nákladů'!$B$27","v":1050601.0562499999},{"$f":"'Podklady pro výpočet nákladů'!$E$7*'Podklady pro výpočet nákladů'!$B$27","v":1050601.0562499999},{"$f":"'Podklady pro výpočet nákladů'!$E$7*'Podklady pro výpočet nákladů'!$B$27","v":1050601.0562499999}]
["Počet najetých km (simulace bez podmínek)",{"$f":"$M$1/2*'Simulace bez podmínek'!$D$24","v":1040},{"$f":"$M$1/2*'Simulace bez podmínek'!$D$24","v":1040},{"$f":"$M$1/2*'Simulace bez podmínek'!$D$24","v":1040},{"$f":"$M$1/2*'Simulace bez podmínek'!$D$24","v":1040},{"$f":"$M$1/2*'Simulace bez podmínek'!$D$24","v":1040}]
["Náklady na palivo",{"$f":"$M$3*B17","v":8608.08},{"$f":"$M$3*C17","v":8608.08},{"$f":"$M$3*D17","v":8608.08},{"$f":"$M$3*E17","v":8608.08},{"$f":"$M$3*F17","v":8608.08}]
["CELKEM",{"$f":"SUM(B15+B16+B18)","v":1412406.355},{"$f":"SUM(C15+C16+C18)","v":1943609.13625},{"$f":"SUM(D15+D16+D18)","v":1943609.13625},{"$f":"SUM(E15+E16+E18)","v":1943609.13625},{"$f":"SUM(F15+F16+F18)","v":1943609.13625}]
["Kumulované náklady",{"$f":"B19","v":1412406.355},{"$f":"B20+C19","v":3356015.49125},{"$f":"C20+D19","v":5299624.6274999995},{"$f":"D20+E19","v":7243233.7637499999},{"$f":"E20+F19","v":9186842.9000000004}]
["CELKEM 5 let",{"$f":"SUM(B19:F19)","v":9186842.9000000004}]
[]
[]
[]
[]
[]
["rok",1,2,3,4,5]
["Mzdy",{"$f":"'Podklady pro výpočet nákladů'!$E$4","v":884400},{"$f":"'Podklady pro výpočet nákladů'!$E$4","v":884400},{"$f":"'Podklady pro výpočet nákladů'!$E$4","v":884400},{"$f":"'Podklady pro výpočet nákladů'!$E$4","v":884400},{"$f":"'Podklady pro výpočet nákladů'!$E$4","v":884400}]
["Odpisy na nákladní automobil",{"$f":"'Podklady pro výpočet nákladů'!$E$7*'Podklady pro výpočet nákladů'!$B$26","v":519398.27500000002},{"$f":"'Podklady pro výpočet nákladů'!$E$7*'Podklady pro výpočet nákladů'!$B$27","v":1050601.0562499999},{"$f":"'Podklady pro výpočet nákladů'!$E$7*'Podklady pro výpočet nákladů'!$B$27","v":1050601.0562499999},{"$f":"'Podklady pro výpočet nákladů'!$E$7*'Podklady pro výpočet nákladů'!$B$27","v":1050601.0562499999},{"$f":"'Podklady pro výpočet nákladů'!$E$7*'Podklady pro výpočet nákladů'!$B$27","v":1050601.0562499999}]
["Počet najetých km (simulace s podmínkami) hladina 40 %",{"$f":"$M$1/2*'Hladina 40 %'!$C$26","v":898.74199999999996},{"$f":"$M$1/2*'Hladina 40 %'!$C$26","v":898.74199999999996},{"$f":"$M$1/2*'Hladina 40 %'!$C$26","v":898.74199999999996},{"$f":"$M$1/2*'Hladina 40 %'!$C$26","v":898.74199999999996},{"$f":"$M$1/2*'Hladina 40 %'!$C$26","v":898.74199999999996}]
["Náklady na palivo",{"$f":"$M$3*B30","v":7438.8875339999986},{"$f":"$M$3*C30","v":7438.8875339999986},7438.8875339999986,7438.8875339999986,7438.8875339999986]
["CELKEM",{"$f":"SUM(B28+B29+B31)","v":1411237.1625339999},{"$f":"SUM(C28+C29+C31)","v":1942439.9437839999},1942439.9437839999,1942439.9437839999,1942439.9437839999]
["Kumulované náklady",{"$f":"B32","v":1411237.1625339999},{"$f":"B33+C32","v":3353677.1063179998},{"$f":"C33+D32","v":5296117.0501019992},{"$f":"D33+E32","v":7238556.9938859995},{"$f":"E33+F32","v":9180996.9376699999}]
["CELKEM 5 let",{"$f":"SUM(B32:F32)","v":9180996.9376699999}]
[]
[]
[]
[]
[]
["rok",1,2,3,4,5]
["Mzdy",{"$f":"'Podklady pro výpočet nákladů'!$E$4","v":884400},{"$f":"'Podklady pro výpočet nákladů'!$E$4","v":884400},{"$f":"'Podklady pro výpočet nákladů'!$E$4","v":884400},{"$f":"'Podklady pro výpočet nákladů'!$E$4","v":884400},{"$f":"'Podklady pro výpočet nákladů'!$E$4","v":884400}]
["Odpisy na nákladní automobil",{"$f":"'Podklady pro výpočet nákladů'!$E$7*'Podklady pro výpočet nákladů'!$B$26","v":519398.27500000002},{"$f":"'Podklady pro výpočet nákladů'!$E$7*'Podklady pro výpočet nákladů'!$B$27","v":1050601.0562499999},{"$f":"'Podklady pro výpočet nákladů'!$E$7*'Podklady pro výpočet nákladů'!$B$27","v":1050601.0562499999},{"$f":"'Podklady pro výpočet nákladů'!$E$7*'Podklady pro výpočet nákladů'!$B$27","v":1050601.0562499999},{"$f":"'Podklady pro výpočet nákladů'!$E$7*'Podklady pro výpočet nákladů'!$B$27","v":1050601.0562499999}]
["Počet najetých km (simulace s podmínkami) hladina 60 %",{"$f":"$M$1/2*'Hladina 60 %'!$C$26","v":797.86200000000008},{"$f":"$M$1/2*'Hladina 60 %'!$C$26","v":797.86200000000008},{"$f":"$M$1/2*'Hladina 60 %'!$C$26","v":797.86200000000008},{"$f":"$M$1/2*'Hladina 60 %'!$C$26","v":797.86200000000008},{"$f":"$M$1/2*'Hladina 60 %'!$C$26","v":797.86200000000008}]
["Náklady na palivo",{"$f":"$M$3*B43","v":6603.9037740000003},{"$f":"$M$3*C43","v":6603.9037740000003},6603.9037740000003,6603.9037740000003,6603.9037740000003]
["CELKEM",{"$f":"SUM(B41+B42+B44)","v":1410402.1787739999},{"$f":"SUM(C41+C42+C44)","v":1941604.9600239999},1941604.9600239999,1941604.9600239999,1941604.9600239999]
["Kumulované náklady",{"$f":"B45","v":1410402.1787739999},{"$f":"B46+C45","v":3352007.1387979998},{"$f":"C46+D45","v":5293612.0988219995},{"$f":"D46+E45","v":7235217.0588459997},{"$f":"E46+F45","v":9176822.0188699998}]
["CELKEM 5 let",{"$f":"SUM(B45:F45)","v":9176822.0188699998}]
[]
[]
[]
[]
[]
["rok",1,2,3,4,5]
["Mzdy",{"$f":"'Podklady pro výpočet nákladů'!$E$4","v":884400},{"$f":"'Podklady pro výpočet nákladů'!$E$4","v":884400},{"$f":"'Podklady pro výpočet nákladů'!$E$4","v":884400},{"$f":"'Podklady pro výpočet nákladů'!$E$4","v":884400},{"$f":"'Podklady pro výpočet nákladů'!$E$4","v":884400}]
["Odpisy na nákladní automobil",{"$f":"'Podklady pro výpočet nákladů'!$E$7*'Podklady pro výpočet nákladů'!$B$26","v":519398.27500000002},{"$f":"'Podklady pro výpočet nákladů'!$E$7*'Podklady pro výpočet nákladů'!$B$27","v":1050601.0562499999},{"$f":"'Podklady pro výpočet nákladů'!$E$7*'Podklady pro výpočet nákladů'!$B$27","v":1050601.0562499999},{"$f":"'Podklady pro výpočet nákladů'!$E$7*'Podklady pro výpočet nákladů'!$B$27","v":1050601.0562499999},{"$f":"'Podklady pro výpočet nákladů'!$E$7*'Podklady pro výpočet nákladů'!$B$27","v":1050601.0562499999}]
["Počet najetých km (simulace s podmínkami) hladina 80 %",{"$f":"$M$1/2*'Hladina 80 %'!$C$26","v":694.12199999999996},{"$f":"$M$1/2*'Hladina 80 %'!$C$26","v":694.12199999999996},{"$f":"$M$1/2*'Hladina 80 %'!$C$26","v":694.12199999999996},{"$f":"$M$1/2*'Hladina 80 %'!$C$26","v":694.12199999999996},{"$f":"$M$1/2*'Hladina 80 %'!$C$26","v":694.12199999999996}]
["Náklady na palivo",{"$f":"$M$3*B56","v":5745.247793999999},{"$f":"$M$3*C56","v":5745.247793999999},5745.247793999999,5745.247793999999,5745.247793999999]
["CELKEM",{"$f":"SUM(B54+B55+B57)","v":1409543.5227939999},{"$f":"SUM(C54+C55+C57)","v":1940746.3040439999},1940746.3040439999,1940746.3040439999,1940746.3040439999]
["Kumulované náklady",{"$f":"B58","v":1409543.5227939999},{"$f":"B59+C58","v":3350289.8268379997},{"$f":"C59+D58","v":5291036.1308819996},{"$f":"D59+E58","v":7231782.4349259995},{"$f":"E59+F58","v":9172528.7389700003}]
["CELKEM 5 let",{"$f":"SUM(B58:F58)","v":9172528.7389700003}]