{"text_format":"1","workbook":"xlsx","n_sheets":8,"sheets":["Společná data","Uhlí","Biomasa","Plyn","Zdroj","Citlivostní analýza","Výsledky","Přehledy"],"not_rendered":{"charts":13,"images":0,"macros":1,"external_links":0,"defined_names":0,"comments":1,"pivot_tables":0},"unopened":[],"bounds":{"document_bytes":16777216,"sheet_cells":100000,"rows_first":2000,"rows_last":500,"rows_between":2000,"halvings":0,"cell_chars":16384,"cell_head_chars":4096},"cells_cut":0,"cells_raw":0,"read":"whole","date_system":"1900"}

{"sheet":"Společná data","index":0,"n_rows":65,"n_cols":24,"rows_kept":65,"cut":false,"hidden":false,"merged":[]}
["Výhřevnost uhlí [GJ/t]",13.929]
["Účinnost kotlů při spalování uhlí",{"$f":"0.8685","v":0.86850000000000005}]
["Vyrobené teplo K1 a K4 [GJ]",{"$f":"0.1923*3937052","v":757095.09959999996}]
["Cena uhlí [Kč]",450]
["Emisní faktor uhlí [t/GJ]",0.100586099562679]
["Potřebné vápno na tunu uhlí [t]",2.5999999999999999E-2]
["Cena vápna [Kč/t]",3000]
["Produkce škváry [t]",2.5999999999999999E-2]
["Cena škváry [Kč/t]",300]
["Účinnost kotlů při spoluspalování",0.879]
["Poměr spalování uhlí ku biomase",0.7]
["Výhřevnost biomasy [GJ/t]",13.24]
["Cena biomasy [Kč/t]",1450]
["Emisní faktor biomasy [t/GJ]",0]
["Účinnost plynového kotle",0.97]
["Výhřevnost plynu [GJ/m3]",3.3480000000000003E-2]
["Cena plynu [Kč]",7.6]
["Emisní faktor plynu [t/GJ]",0.06]
["Počet let odpisování [roky]",10]
["Úroková sazba",{"$f":"C36","v":2.3E-2}]
["Doba splácení dluhu [roky]",10]
["Daňová sazba",0.19]
["Diskontní míra",{"$f":"C37","v":0.08}]
["Vyrobená eletřiny K1 a K4 [MWh]",{"$f":"(152014*100/520)","v":29233.461538461539}]
["Podpora na jednotku",0]
["WACC"]
[null,"ČEZ","ČEZ Teplárenská","Poznámky"]
["Betaunlevered",0.38,0.38,"Power"]
["Equity",{"$f":"424432000000","v":424432000000},2262501756]
["Debt",173671000000,843784000]
["Tax rate",0.19,0.19]
["Betalevered",{"$f":"B28*(1+(B29/B30)*(1-B31))","v":1.1322278883636301},{"$f":"C28*(1+(C29/C30)*(1-C31))","v":1.2053273829520352}]
["rf",1.43E-2,1.43E-2,"https://tradingeconomics.com/czech-republic/government-bond-yield","2020-05-01"]
["rm",5.8000000000000003E-2,6.9400000000000003E-2,"http://people.stern.nyu.edu/adamodar/New_Home_Page/datafile/ctryprem.html"]
["re",{"$f":"B33+B32*(B34-B33)","v":6.3778358721490638E-2},{"$f":"C33+C32*(C34-C33)","v":8.0713538800657153E-2}]
["rd",3.0599999999999999E-2,2.3E-2,"Tepl.-PRIBOR+0,3%"]
["WACC",{"$f":"B35*(B29/SUM(B29:B30))+B36*(B30/SUM(B29:B30))*(1-B31)","v":5.2456158479191231E-2},0.08,"Úvaha"]
["PRIBOR",0.02,{"$f":"C35*(C29/SUM(C29:C30))+C36*(C30/SUM(C29:C30))*(1-C31)","v":6.3849315474716076E-2},"Výpočet",null,null,null,null,6.3849315474716173E-2]
[null,null,0]
[null,null,167522655,12,{"$f":"C40*D40","v":2010271860}]
[null,null,28025544,9,{"$f":"C41*D41","v":252229896}]
[null,null,null,null,{"$f":"E40+E41","v":2262501756}]
[]
[null,0,1,2,3,4,5,6,7,8,9,10,11,12,13,14,15,16,17,18,19,20]
["rok",2020,2021,2022,2023,2024,2025,2026,2027,2028,2029,2030,2031,2032,2033,2034,2035,2036,2037,2038,2039,2040,null,"Covid pokles"]
["cena [Kč]",{"$f":"B49*B48","v":640.75},589.49,{"$f":"C48*C49*(1+D51)","v":606.58520999999996},{"$f":"D48*D49*(1+E51)","v":624.17618108999989},642.27729034160984,660.90333176151648,680.06952838260042,699.79154470569574,720.08549950216081,740.96797898772343,762.45605037836731,784.56727583933991,807.31972683868071,830.73199891700233,{"$f":"O48*O49*(1+P51)","v":854.8232268855952},879.6131004652774,905.12188037877024,931.37041490975446,958.38015694213721,986.1731814934592,1014.7722037567693,null,"https://s3-eu-west-1.amazonaws.com/cjp-rbi-icis/wp-content/uploads/sites/7/2020/04/14165046/WP_300320_Power-Carbon-COVID-19.pdf"]
["% nárůst",null,2.9000000000000001E-2,{"$f":"C47","v":2.9000000000000001E-2},{"$f":"D47","v":2.9000000000000001E-2},2.9000000000000001E-2,2.9000000000000001E-2,2.9000000000000001E-2,2.9000000000000001E-2,2.9000000000000001E-2,2.9000000000000001E-2,2.9000000000000001E-2,2.9000000000000001E-2,2.9000000000000001E-2,2.9000000000000001E-2,2.9000000000000001E-2,2.9000000000000001E-2,2.9000000000000001E-2,2.9000000000000001E-2,2.9000000000000001E-2,2.9000000000000001E-2,2.9000000000000001E-2]
["EUR [CZK]",25.63,{"$f":"B48","v":25.63},{"$f":"C48","v":25.63},25.63,25.63,25.63,25.63,25.63,25.63,25.63,25.63,25.63,25.63,25.63,25.63,25.63,25.63,25.63,25.63,25.63,25.63]
["cena [EUR]",25,23,{"$f":"D46/D48","v":23.666999999999998},{"$f":"E46/E48","v":24.353342999999995},25.059589946999996,25.786318055462992,26.534121279071417,27.303610796164484,28.09541550925325,28.910182559021592,29.748577853233215,30.611286610976979,31.499013922695308,32.412485326453464,33.35244740092061,34.319668375547302,35.314938758438167,36.33907198243287,37.392905069923422,38.477299316951196,39.593140997142775]
[null,null,0,{"$f":"C50","v":0},{"$f":"D50","v":0},0,0,0,0,0,0,0,0,0,0,0,0,0,0,0,0,0]
[null,"nárůst povolenek",2.9000000000000001E-2,{"$f":"C51","v":2.9000000000000001E-2},2.9000000000000001E-2,2.9000000000000001E-2,2.9000000000000001E-2,2.9000000000000001E-2,2.9000000000000001E-2,2.9000000000000001E-2,2.9000000000000001E-2,2.9000000000000001E-2,2.9000000000000001E-2,2.9000000000000001E-2,2.9000000000000001E-2,2.9000000000000001E-2,2.9000000000000001E-2,2.9000000000000001E-2,2.9000000000000001E-2,2.9000000000000001E-2,2.9000000000000001E-2,2.9000000000000001E-2]
["Průměrný kurz eura za poslední rok"]
["https://www.kurzy.cz/kurzy-men/historie/EUR-euro/"]
[]
[null,2015,2016,2017,2018,2019,2020,2021]
["Inflace",3.0000000000000001E-3,7.0000000000000001E-3,2.5000000000000001E-2,2.1000000000000001E-2,2.8000000000000001E-2,2.9000000000000001E-2,2.3E-2]
["https://www.kurzy.cz/makroekonomika/inflace/"]
["Prognóza 2021"]
["https://www.cnb.cz/cs/menova-politika/prognoza/"]
[]
["Kurz",2015,2016,2017,2018,2019,2020,2021]
[null,27.283000000000001,27.033000000000001,26.33,25.643000000000001,25.672000000000001,25.63]
["https://www.kurzy.cz/kurzy-men/historie/EUR-euro/2020/"]
[]
[null,null,null,null,null,{"$f":"SUM(B62:G62)/6","v":26.265166666666669}]

{"sheet":"Uhlí","index":1,"n_rows":53,"n_cols":23,"rows_kept":53,"cut":false,"hidden":false,"merged":[[44,1,44,2],[45,1,45,2],[49,1,49,2]]}
[]
[null,null,0,1,2,3,4,5,6,7,8,9,10,11,12,13,14,15,16,17,18,19,20]
[null,"Investice [Kč]",400000000,0,0,0,0,0,0,0,0,0,180000000,0,0,0,0,0,0,0,0,0,0]
[]
[null,"Cena uhlí [Kč/t]",{"$f":"'Společná data'!$B$4","v":450},{"$f":"'Společná data'!$B$4","v":450},{"$f":"'Společná data'!$B$4","v":450},{"$f":"'Společná data'!$B$4","v":450},{"$f":"'Společná data'!$B$4","v":450},{"$f":"'Společná data'!$B$4","v":450},{"$f":"'Společná data'!$B$4","v":450},{"$f":"'Společná data'!$B$4","v":450},{"$f":"'Společná data'!$B$4","v":450},{"$f":"'Společná data'!$B$4","v":450},{"$f":"C5+150","v":600},{"$f":"D5+150","v":600},600,600,600,600,600,600,600,600,{"$f":"M5","v":600}]
[null,"Množství spáleného uhlí [t]",{"$f":"'Společná data'!$B$3/('Společná data'!$B$1*'Společná data'!$B$2)","v":62583.619096649905},{"$f":"'Společná data'!$B$3/('Společná data'!$B$1*'Společná data'!$B$2)","v":62583.619096649905},{"$f":"'Společná data'!$B$3/('Společná data'!$B$1*'Společná data'!$B$2)","v":62583.619096649905},{"$f":"'Společná data'!$B$3/('Společná data'!$B$1*'Společná data'!$B$2)","v":62583.619096649905},{"$f":"'Společná data'!$B$3/('Společná data'!$B$1*'Společná data'!$B$2)","v":62583.619096649905},{"$f":"'Společná data'!$B$3/('Společná data'!$B$1*'Společná data'!$B$2)","v":62583.619096649905},{"$f":"'Společná data'!$B$3/('Společná data'!$B$1*'Společná data'!$B$2)","v":62583.619096649905},{"$f":"'Společná data'!$B$3/('Společná data'!$B$1*'Společná data'!$B$2)","v":62583.619096649905},{"$f":"'Společná data'!$B$3/('Společná data'!$B$1*'Společná data'!$B$2)","v":62583.619096649905},{"$f":"'Společná data'!$B$3/('Společná data'!$B$1*'Společná data'!$B$2)","v":62583.619096649905},{"$f":"'Společná data'!$B$3/('Společná data'!$B$1*'Společná data'!$B$2)","v":62583.619096649905},{"$f":"'Společná data'!$B$3/('Společná data'!$B$1*'Společná data'!$B$2)","v":62583.619096649905},{"$f":"'Společná data'!$B$3/('Společná data'!$B$1*'Společná data'!$B$2)","v":62583.619096649905},{"$f":"'Společná data'!$B$3/('Společná data'!$B$1*'Společná data'!$B$2)","v":62583.619096649905},{"$f":"'Společná data'!$B$3/('Společná data'!$B$1*'Společná data'!$B$2)","v":62583.619096649905},{"$f":"'Společná data'!$B$3/('Společná data'!$B$1*'Společná data'!$B$2)","v":62583.619096649905},{"$f":"'Společná data'!$B$3/('Společná data'!$B$1*'Společná data'!$B$2)","v":62583.619096649905},{"$f":"'Společná data'!$B$3/('Společná data'!$B$1*'Společná data'!$B$2)","v":62583.619096649905},{"$f":"'Společná data'!$B$3/('Společná data'!$B$1*'Společná data'!$B$2)","v":62583.619096649905},{"$f":"'Společná data'!$B$3/('Společná data'!$B$1*'Společná data'!$B$2)","v":62583.619096649905},{"$f":"'Společná data'!$B$3/('Společná data'!$B$1*'Společná data'!$B$2)","v":62583.619096649905}]
[null,"Cena odebraného uhlí [Kč]",{"$f":"C6*C5","v":28162628.593492456},{"$f":"D6*D5","v":28162628.593492456},28162628.593492456,28162628.593492456,28162628.593492456,28162628.593492456,28162628.593492456,28162628.593492456,28162628.593492456,28162628.593492456,37550171.457989946,37550171.457989946,37550171.457989946,37550171.457989946,37550171.457989946,37550171.457989946,37550171.457989946,37550171.457989946,37550171.457989946,37550171.457989946,37550171.457989946]
[]
[null,"Cena použitých emisních povolenek [Kč]",{"$f":"'Společná data'!$B$3*'Společná data'!$B$5*HLOOKUP(Uhlí!C2,'Společná data'!$B$44:$V$46,3,0)","v":48795190.495040551},{"$f":"'Společná data'!$B$3*'Společná data'!$B$5*HLOOKUP(Uhlí!D2,'Společná data'!$B$44:$V$46,3,0)","v":44891575.255437307},{"$f":"'Společná data'!$B$3*'Společná data'!$B$5*HLOOKUP(Uhlí!E2,'Společná data'!$B$44:$V$46,3,0)","v":46193430.937844984},{"$f":"'Společná data'!$B$3*'Společná data'!$B$5*HLOOKUP(Uhlí!F2,'Společná data'!$B$44:$V$46,3,0)","v":47533040.435042486},{"$f":"'Společná data'!$B$3*'Společná data'!$B$5*HLOOKUP(Uhlí!G2,'Společná data'!$B$44:$V$46,3,0)","v":48911498.607658714},{"$f":"'Společná data'!$B$3*'Společná data'!$B$5*HLOOKUP(Uhlí!H2,'Společná data'!$B$44:$V$46,3,0)","v":50329932.067280814},{"$f":"'Společná data'!$B$3*'Společná data'!$B$5*HLOOKUP(Uhlí!I2,'Společná data'!$B$44:$V$46,3,0)","v":51789500.097231954},{"$f":"'Společná data'!$B$3*'Společná data'!$B$5*HLOOKUP(Uhlí!J2,'Společná data'!$B$44:$V$46,3,0)","v":53291395.600051671},{"$f":"'Společná data'!$B$3*'Společná data'!$B$5*HLOOKUP(Uhlí!K2,'Společná data'!$B$44:$V$46,3,0)","v":54836846.072453164},{"$f":"'Společná data'!$B$3*'Společná data'!$B$5*HLOOKUP(Uhlí!L2,'Společná data'!$B$44:$V$46,3,0)","v":56427114.608554296},{"$f":"'Společná data'!$B$3*'Společná data'!$B$5*HLOOKUP(Uhlí!M2,'Společná data'!$B$44:$V$46,3,0)","v":58063500.932202369},{"$f":"'Společná data'!$B$3*'Společná data'!$B$5*HLOOKUP(Uhlí!N2,'Společná data'!$B$44:$V$46,3,0)","v":59747342.459236234},{"$f":"'Společná data'!$B$3*'Společná data'!$B$5*HLOOKUP(Uhlí!O2,'Společná data'!$B$44:$V$46,3,0)","v":61480015.390554078},{"$f":"'Společná data'!$B$3*'Společná data'!$B$5*HLOOKUP(Uhlí!P2,'Společná data'!$B$44:$V$46,3,0)","v":63262935.836880133},{"$f":"'Společná data'!$B$3*'Společná data'!$B$5*HLOOKUP(Uhlí!Q2,'Společná data'!$B$44:$V$46,3,0)","v":65097560.976149648},{"$f":"'Společná data'!$B$3*'Společná data'!$B$5*HLOOKUP(Uhlí!R2,'Společná data'!$B$44:$V$46,3,0)","v":66985390.244457982},{"$f":"'Společná data'!$B$3*'Společná data'!$B$5*HLOOKUP(Uhlí!S2,'Společná data'!$B$44:$V$46,3,0)","v":68927966.56154725},{"$f":"'Společná data'!$B$3*'Společná data'!$B$5*HLOOKUP(Uhlí!T2,'Společná data'!$B$44:$V$46,3,0)","v":70926877.591832101},{"$f":"'Společná data'!$B$3*'Společná data'!$B$5*HLOOKUP(Uhlí!U2,'Společná data'!$B$44:$V$46,3,0)","v":72983757.041995227},{"$f":"'Společná data'!$B$3*'Společná data'!$B$5*HLOOKUP(Uhlí!V2,'Společná data'!$B$44:$V$46,3,0)","v":75100285.996213093},{"$f":"'Společná data'!$B$3*'Společná data'!$B$5*HLOOKUP(Uhlí!W2,'Společná data'!$B$44:$V$46,3,0)","v":77278194.290103257}]
[]
[null,"Cena odebráného vápna [Kč]",{"$f":"C6*'Společná data'!$B$6*'Společná data'!$B$7*POWER(1+'Společná data'!$C$47,C2)","v":4881522.2895386927},{"$f":"D6*'Společná data'!$B$6*'Společná data'!$B$7*POWER(1+'Společná data'!$C$47,D2)","v":5023086.4359353147},{"$f":"E6*'Společná data'!$B$6*'Společná data'!$B$7*POWER(1+'Společná data'!$C$47,E2)","v":5168755.9425774384},{"$f":"F6*'Společná data'!$B$6*'Společná data'!$B$7*POWER(1+'Společná data'!$C$47,F2)","v":5318649.864912184},{"$f":"G6*'Společná data'!$B$6*'Společná data'!$B$7*POWER(1+'Společná data'!$C$47,G2)","v":5472890.7109946366},{"$f":"H6*'Společná data'!$B$6*'Společná data'!$B$7*POWER(1+'Společná data'!$C$47,H2)","v":5631604.541613481},{"$f":"I6*'Společná data'!$B$6*'Společná data'!$B$7*POWER(1+'Společná data'!$C$47,I2)","v":5794921.0733202714},{"$f":"J6*'Společná data'!$B$6*'Společná data'!$B$7*POWER(1+'Společná data'!$C$47,J2)","v":5962973.7844465598},{"$f":"K6*'Společná data'!$B$6*'Společná data'!$B$7*POWER(1+'Společná data'!$C$47,K2)","v":6135900.02419551},{"$f":"L6*'Společná data'!$B$6*'Společná data'!$B$7*POWER(1+'Společná data'!$C$47,L2)","v":6313841.1248971783},{"$f":"M6*'Společná data'!$B$6*'Společná data'!$B$7*POWER(1+'Společná data'!$C$47,M2)","v":6496942.5175191974},{"$f":"N6*'Společná data'!$B$6*'Společná data'!$B$7*POWER(1+'Společná data'!$C$47,N2)","v":6685353.850527253},{"$f":"O6*'Společná data'!$B$6*'Společná data'!$B$7*POWER(1+'Společná data'!$C$47,O2)","v":6879229.1121925432},{"$f":"P6*'Společná data'!$B$6*'Společná data'!$B$7*POWER(1+'Společná data'!$C$47,P2)","v":7078726.7564461268},{"$f":"Q6*'Společná data'!$B$6*'Společná data'!$B$7*POWER(1+'Společná data'!$C$47,Q2)","v":7284009.8323830646},{"$f":"R6*'Společná data'!$B$6*'Společná data'!$B$7*POWER(1+'Společná data'!$C$47,R2)","v":7495246.1175221736},{"$f":"S6*'Společná data'!$B$6*'Společná data'!$B$7*POWER(1+'Společná data'!$C$47,S2)","v":7712608.2549303165},{"$f":"T6*'Společná data'!$B$6*'Společná data'!$B$7*POWER(1+'Společná data'!$C$47,T2)","v":7936273.8943232941},{"$f":"U6*'Společná data'!$B$6*'Společná data'!$B$7*POWER(1+'Společná data'!$C$47,U2)","v":8166425.8372586695},{"$f":"V6*'Společná data'!$B$6*'Společná data'!$B$7*POWER(1+'Společná data'!$C$47,V2)","v":8403252.1865391713},{"$f":"W6*'Společná data'!$B$6*'Společná data'!$B$7*POWER(1+'Společná data'!$C$47,W2)","v":8646946.4999488071}]
[]
[null,"Údržba [Kč]",10000000,{"$f":"C13*(1+'Společná data'!$C$47)","v":10290000},{"$f":"D13*(1+'Společná data'!$C$47)","v":10588410},{"$f":"E13*(1+'Společná data'!$C$47)","v":10895473.889999999},{"$f":"F13*(1+'Společná data'!$C$47)","v":11211442.632809998},{"$f":"G13*(1+'Společná data'!$C$47)","v":11536574.469161488},{"$f":"H13*(1+'Společná data'!$C$47)","v":11871135.12876717},{"$f":"I13*(1+'Společná data'!$C$47)","v":12215398.047501417},{"$f":"J13*(1+'Společná data'!$C$47)","v":12569644.590878956},{"$f":"K13*(1+'Společná data'!$C$47)","v":12934164.284014445},{"$f":"L13*(1+'Společná data'!$C$47)","v":13309255.048250863},{"$f":"M13*(1+'Společná data'!$C$47)","v":13695223.444650138},{"$f":"N13*(1+'Společná data'!$C$47)","v":14092384.92454499},{"$f":"O13*(1+'Společná data'!$C$47)","v":14501064.087356793},{"$f":"P13*(1+'Společná data'!$C$47)","v":14921594.945890138},{"$f":"Q13*(1+'Společná data'!$C$47)","v":15354321.199320951},{"$f":"R13*(1+'Společná data'!$C$47)","v":15799596.514101258},{"$f":"S13*(1+'Společná data'!$C$47)","v":16257784.813010193},{"$f":"T13*(1+'Společná data'!$C$47)","v":16729260.572587488},{"$f":"U13*(1+'Společná data'!$C$47)","v":17214409.129192524},{"$f":"V13*(1+'Společná data'!$C$47)","v":17713626.993939105}]
[]
[null,"Výše lineárního odpisu [Kč]",0,{"$f":"IF(D2=1,0.055,0.105)*$C$3","v":22000000},42000000,42000000,42000000,42000000,42000000,42000000,42000000,42000000,42000000,{"$f":"IF(N2=11,0.055,0.105)*$M$3","v":9900000},18900000,18900000,18900000,18900000,18900000,18900000,18900000,18900000,18900000]
[]
[null,"Výše zrychleného odpisu [Kč]",0,{"$f":"IF(D2=1,$C$3/10,(($C$3-(SUM($C$17:C17)))*2)/('Společná data'!$B$19+1-C2))","v":40000000},{"$f":"IF(E2=1,$C$3/10,(($C$3-(SUM($C$17:D17)))*2)/('Společná data'!$B$19+1-D2))","v":72000000},{"$f":"IF(F2=1,$C$3/10,(($C$3-(SUM($C$17:E17)))*2)/('Společná data'!$B$19+1-E2))","v":64000000},{"$f":"IF(G2=1,$C$3/10,(($C$3-(SUM($C$17:F17)))*2)/('Společná data'!$B$19+1-F2))","v":56000000},{"$f":"IF(H2=1,$C$3/10,(($C$3-(SUM($C$17:G17)))*2)/('Společná data'!$B$19+1-G2))","v":48000000},{"$f":"IF(I2=1,$C$3/10,(($C$3-(SUM($C$17:H17)))*2)/('Společná data'!$B$19+1-H2))","v":40000000},{"$f":"IF(J2=1,$C$3/10,(($C$3-(SUM($C$17:I17)))*2)/('Společná data'!$B$19+1-I2))","v":32000000},{"$f":"IF(K2=1,$C$3/10,(($C$3-(SUM($C$17:J17)))*2)/('Společná data'!$B$19+1-J2))","v":24000000},{"$f":"IF(L2=1,$C$3/10,(($C$3-(SUM($C$17:K17)))*2)/('Společná data'!$B$19+1-K2))","v":16000000},{"$f":"IF(M2=1,$C$3/10,(($C$3-(SUM($C$17:L17)))*2)/('Společná data'!$B$19+1-L2))","v":8000000},{"$f":"IF(N2=11,$M$3/10,(($M$3-(SUM($N$17:N17)))*2)/('Společná data'!$B$19+1-C2))","v":18000000},{"$f":"IF(O2=11,$M$3/10,(($M$3-(SUM($N$17:N17)))*2)/('Společná data'!$B$19+1-D2))","v":32400000},{"$f":"IF(P2=11,$M$3/10,(($M$3-(SUM($N$17:O17)))*2)/('Společná data'!$B$19+1-E2))","v":28800000},{"$f":"IF(Q2=11,$M$3/10,(($M$3-(SUM($N$17:P17)))*2)/('Společná data'!$B$19+1-F2))","v":25200000},{"$f":"IF(R2=11,$M$3/10,(($M$3-(SUM($N$17:Q17)))*2)/('Společná data'!$B$19+1-G2))","v":21600000},{"$f":"IF(S2=11,$M$3/10,(($M$3-(SUM($N$17:R17)))*2)/('Společná data'!$B$19+1-H2))","v":18000000},{"$f":"IF(T2=11,$M$3/10,(($M$3-(SUM($N$17:S17)))*2)/('Společná data'!$B$19+1-I2))","v":14400000},{"$f":"IF(U2=11,$M$3/10,(($M$3-(SUM($N$17:T17)))*2)/('Společná data'!$B$19+1-J2))","v":10800000},{"$f":"IF(V2=11,$M$3/10,(($M$3-(SUM($N$17:U17)))*2)/('Společná data'!$B$19+1-K2))","v":7200000},{"$f":"IF(W2=11,$M$3/10,(($M$3-(SUM($N$17:V17)))*2)/('Společná data'!$B$19+1-L2))","v":3600000}]
[]
[null,"Úmor [Kč]",0,{"$f":"$C$3/'Společná data'!$B$21","v":40000000},{"$f":"$C$3/'Společná data'!$B$21","v":40000000},{"$f":"$C$3/'Společná data'!$B$21","v":40000000},{"$f":"$C$3/'Společná data'!$B$21","v":40000000},{"$f":"$C$3/'Společná data'!$B$21","v":40000000},{"$f":"$C$3/'Společná data'!$B$21","v":40000000},{"$f":"$C$3/'Společná data'!$B$21","v":40000000},{"$f":"$C$3/'Společná data'!$B$21","v":40000000},{"$f":"$C$3/'Společná data'!$B$21","v":40000000},{"$f":"$C$3/'Společná data'!$B$21","v":40000000},{"$f":"$M$3/'Společná data'!$B$21","v":18000000},{"$f":"$M$3/'Společná data'!$B$21","v":18000000},{"$f":"$M$3/'Společná data'!$B$21","v":18000000},{"$f":"$M$3/'Společná data'!$B$21","v":18000000},{"$f":"$M$3/'Společná data'!$B$21","v":18000000},{"$f":"$M$3/'Společná data'!$B$21","v":18000000},{"$f":"$M$3/'Společná data'!$B$21","v":18000000},{"$f":"$M$3/'Společná data'!$B$21","v":18000000},{"$f":"$M$3/'Společná data'!$B$21","v":18000000},{"$f":"$M$3/'Společná data'!$B$21","v":18000000}]
[]
[null,"Úrok [Kč]",0,{"$f":"($C$3-SUM($C$19:C19))*'Společná data'!$B$20","v":9200000},{"$f":"($C$3-SUM($C$19:D19))*'Společná data'!$B$20","v":8280000},{"$f":"($C$3-SUM($C$19:E19))*'Společná data'!$B$20","v":7360000},{"$f":"($C$3-SUM($C$19:F19))*'Společná data'!$B$20","v":6440000},{"$f":"($C$3-SUM($C$19:G19))*'Společná data'!$B$20","v":5520000},{"$f":"($C$3-SUM($C$19:H19))*'Společná data'!$B$20","v":4600000},{"$f":"($C$3-SUM($C$19:I19))*'Společná data'!$B$20","v":3680000},{"$f":"($C$3-SUM($C$19:J19))*'Společná data'!$B$20","v":2760000},{"$f":"($C$3-SUM($C$19:K19))*'Společná data'!$B$20","v":1840000},{"$f":"($C$3-SUM($C$19:L19))*'Společná data'!$B$20","v":920000},{"$f":"($M$3)*'Společná data'!$B$20","v":4140000},{"$f":"($M$3-SUM($N$19:N19))*'Společná data'!$B$20","v":3726000},{"$f":"($M$3-SUM($N$19:O19))*'Společná data'!$B$20","v":3312000},{"$f":"($M$3-SUM($N$19:P19))*'Společná data'!$B$20","v":2898000},{"$f":"($M$3-SUM($N$19:Q19))*'Společná data'!$B$20","v":2484000},{"$f":"($M$3-SUM($N$19:R19))*'Společná data'!$B$20","v":2070000},{"$f":"($M$3-SUM($N$19:S19))*'Společná data'!$B$20","v":1656000},{"$f":"($M$3-SUM($N$19:T19))*'Společná data'!$B$20","v":1242000},{"$f":"($M$3-SUM($N$19:U19))*'Společná data'!$B$20","v":828000},{"$f":"($M$3-SUM($N$19:V19))*'Společná data'!$B$20","v":414000}]
[]
[null,"Náklady při lineárních odpisech [Kč]",{"$f":"SUM(C7,C9,C11,C13,C15,C19,C21)","v":91839341.37807171},{"$f":"SUM(D7,D9,D11,D13,D15,D19,D21)","v":159567290.28486508},180393225.47391486,181269792.78344715,182198460.54495579,183180739.67154825,184218184.89281183,185312396.0254921,186465019.28102008,187677748.6109584,198339869.95596236,149718091.2124036,160627800.88528156,162604898.13867301,164651337.2124128,166769129.01929104,168960342.78856876,171227107.75715554,173571614.90983132,175996118.76993474,178502939.24198112]
[]
[null,"Náklady při zrychlených odpisech [Kč]",{"$f":"SUM(C7,C9,C11,C13,C17,C19,C21)","v":91839341.37807171},{"$f":"SUM(D7,D9,D11,D13,D17,D19,D21)","v":177567290.28486508},210393225.47391486,203269792.78344715,196198460.54495579,189180739.67154825,182218184.89281183,175312396.0254921,168465019.28102008,161677748.6109584,164339869.95596236,157818091.2124036,174127800.88528156,172504898.13867301,170951337.2124128,169469129.01929104,168060342.78856876,166727107.75715554,165471614.90983132,164296118.76993474,163202939.24198112]
[]
[null,"Náklady při lineárních odpisech bez půjčky [Kč]",{"$f":"C23-C21-C19","v":91839341.37807171},{"$f":"D23-D21-D19","v":110367290.28486508},132113225.47391486,133909792.78344715,135758460.54495579,137660739.67154825,139618184.89281183,141632396.0254921,143705019.28102008,145837748.6109584,157419869.95596236,127578091.2124036,138901800.88528156,141292898.13867301,143753337.2124128,146285129.01929104,148890342.78856876,151571107.75715554,154329614.90983132,157168118.76993474,160088939.24198112]
[]
[null,"Náklady při zrychlených odpisech bez půjčky [Kč]",{"$f":"C25-C21-C19","v":91839341.37807171},{"$f":"D25-D21-D19","v":128367290.28486508},162113225.47391486,155909792.78344715,149758460.54495579,143660739.67154825,137618184.89281183,131632396.0254921,125705019.28102008,119837748.6109584,123419869.95596236,135678091.2124036,152401800.88528156,151192898.13867301,150053337.2124128,148985129.01929104,147990342.78856876,147071107.75715554,146229614.90983132,145468118.76993474,144788939.24198112]
[]
[null,"Tržby ze škváry [Kč]",{"$f":"C6*'Společná data'!$B$8*'Společná data'!$B$9*POWER(1+'Společná data'!$C$47,C2)","v":488152.22895386926},{"$f":"D6*'Společná data'!$B$8*'Společná data'!$B$9*POWER(1+'Společná data'!$C$47,D2)","v":502308.64359353145},{"$f":"E6*'Společná data'!$B$8*'Společná data'!$B$9*POWER(1+'Společná data'!$C$47,E2)","v":516875.59425774385},{"$f":"F6*'Společná data'!$B$8*'Společná data'!$B$9*POWER(1+'Společná data'!$C$47,F2)","v":531864.98649121833},{"$f":"G6*'Společná data'!$B$8*'Společná data'!$B$9*POWER(1+'Společná data'!$C$47,G2)","v":547289.07109946373},{"$f":"H6*'Společná data'!$B$8*'Společná data'!$B$9*POWER(1+'Společná data'!$C$47,H2)","v":563160.45416134805},{"$f":"I6*'Společná data'!$B$8*'Společná data'!$B$9*POWER(1+'Společná data'!$C$47,I2)","v":579492.10733202717},{"$f":"J6*'Společná data'!$B$8*'Společná data'!$B$9*POWER(1+'Společná data'!$C$47,J2)","v":596297.37844465591},{"$f":"K6*'Společná data'!$B$8*'Společná data'!$B$9*POWER(1+'Společná data'!$C$47,K2)","v":613590.00241955102},{"$f":"L6*'Společná data'!$B$8*'Společná data'!$B$9*POWER(1+'Společná data'!$C$47,L2)","v":631384.1124897179},{"$f":"M6*'Společná data'!$B$8*'Společná data'!$B$9*POWER(1+'Společná data'!$C$47,M2)","v":649694.25175191974},{"$f":"N6*'Společná data'!$B$8*'Společná data'!$B$9*POWER(1+'Společná data'!$C$47,N2)","v":668535.38505272532},{"$f":"O6*'Společná data'!$B$8*'Společná data'!$B$9*POWER(1+'Společná data'!$C$47,O2)","v":687922.91121925437},{"$f":"P6*'Společná data'!$B$8*'Společná data'!$B$9*POWER(1+'Společná data'!$C$47,P2)","v":707872.67564461275},{"$f":"Q6*'Společná data'!$B$8*'Společná data'!$B$9*POWER(1+'Společná data'!$C$47,Q2)","v":728400.98323830636},{"$f":"R6*'Společná data'!$B$8*'Společná data'!$B$9*POWER(1+'Společná data'!$C$47,R2)","v":749524.61175221729},{"$f":"S6*'Společná data'!$B$8*'Společná data'!$B$9*POWER(1+'Společná data'!$C$47,S2)","v":771260.82549303165},{"$f":"T6*'Společná data'!$B$8*'Společná data'!$B$9*POWER(1+'Společná data'!$C$47,T2)","v":793627.38943232945},{"$f":"U6*'Společná data'!$B$8*'Společná data'!$B$9*POWER(1+'Společná data'!$C$47,U2)","v":816642.58372586698},{"$f":"V6*'Společná data'!$B$8*'Společná data'!$B$9*POWER(1+'Společná data'!$C$47,V2)","v":840325.21865391708},{"$f":"W6*'Společná data'!$B$8*'Společná data'!$B$9*POWER(1+'Společná data'!$C$47,W2)","v":864694.64999488066}]
[]
[null,"Daňový štít při lineárních odpisech [Kč]",{"$f":"C15*'Společná data'!$B$22","v":0},{"$f":"D15*'Společná data'!$B$22","v":4180000},{"$f":"E15*'Společná data'!$B$22","v":7980000},{"$f":"F15*'Společná data'!$B$22","v":7980000},{"$f":"G15*'Společná data'!$B$22","v":7980000},{"$f":"H15*'Společná data'!$B$22","v":7980000},{"$f":"I15*'Společná data'!$B$22","v":7980000},{"$f":"J15*'Společná data'!$B$22","v":7980000},{"$f":"K15*'Společná data'!$B$22","v":7980000},{"$f":"L15*'Společná data'!$B$22","v":7980000},{"$f":"M15*'Společná data'!$B$22","v":7980000},{"$f":"N15*'Společná data'!$B$22","v":1881000},{"$f":"O15*'Společná data'!$B$22","v":3591000},{"$f":"P15*'Společná data'!$B$22","v":3591000},{"$f":"Q15*'Společná data'!$B$22","v":3591000},{"$f":"R15*'Společná data'!$B$22","v":3591000},{"$f":"S15*'Společná data'!$B$22","v":3591000},{"$f":"T15*'Společná data'!$B$22","v":3591000},{"$f":"U15*'Společná data'!$B$22","v":3591000},{"$f":"V15*'Společná data'!$B$22","v":3591000},{"$f":"W15*'Společná data'!$B$22","v":3591000}]
[]
[null,"Daňový štít při zrychlených odpisech [Kč]",{"$f":"C17*'Společná data'!$B$22","v":0},{"$f":"D17*'Společná data'!$B$22","v":7600000},{"$f":"E17*'Společná data'!$B$22","v":13680000},{"$f":"F17*'Společná data'!$B$22","v":12160000},{"$f":"G17*'Společná data'!$B$22","v":10640000},{"$f":"H17*'Společná data'!$B$22","v":9120000},{"$f":"I17*'Společná data'!$B$22","v":7600000},{"$f":"J17*'Společná data'!$B$22","v":6080000},{"$f":"K17*'Společná data'!$B$22","v":4560000},{"$f":"L17*'Společná data'!$B$22","v":3040000},{"$f":"M17*'Společná data'!$B$22","v":1520000},{"$f":"N17*'Společná data'!$B$22","v":3420000},{"$f":"O17*'Společná data'!$B$22","v":6156000},{"$f":"P17*'Společná data'!$B$22","v":5472000},{"$f":"Q17*'Společná data'!$B$22","v":4788000},{"$f":"R17*'Společná data'!$B$22","v":4104000},{"$f":"S17*'Společná data'!$B$22","v":3420000},{"$f":"T17*'Společná data'!$B$22","v":2736000},{"$f":"U17*'Společná data'!$B$22","v":2052000},{"$f":"V17*'Společná data'!$B$22","v":1368000},{"$f":"W17*'Společná data'!$B$22","v":684000}]
[]
[null,"Diskontované roční výdaje při lineárních odpisech [Kč]",{"$f":"(C23-C15-C31+C31*'Společná data'!$B$22-C33)/(POWER(1+'Společná data'!$C$37,Uhlí!C2))","v":91443938.072619081},{"$f":"(D23-D15-D31+D31*'Společná data'!$B$22-D33)/(POWER(1+'Společná data'!$C$37,Uhlí!D2))","v":123130018.78106883},{"$f":"(E23-E15-E31+E31*'Společná data'!$B$22-E33)/(POWER(1+'Společná data'!$C$37,Uhlí!E2))","v":111449379.4946554},{"$f":"(F23-F15-F31+F31*'Společná data'!$B$22-F33)/(POWER(1+'Společná data'!$C$37,Uhlí!F2))","v":103880079.05329888},{"$f":"(G23-G15-G31+G31*'Společná data'!$B$22-G33)/(POWER(1+'Společná data'!$C$37,Uhlí!G2))","v":96858673.80898498},{"$f":"(H23-H15-H31+H31*'Společná data'!$B$22-H33)/(POWER(1+'Společná data'!$C$37,Uhlí!H2))","v":90343730.443630725},{"$f":"(I23-I15-I31+I31*'Společná data'!$B$22-I33)/(POWER(1+'Společná data'!$C$37,Uhlí!I2))","v":84297032.444070548},{"$f":"(J23-J15-J31+J31*'Společná data'!$B$22-J33)/(POWER(1+'Společná data'!$C$37,Uhlí!J2))","v":78683326.876321644},{"$f":"(K23-K15-K31+K31*'Společná data'!$B$22-K33)/(POWER(1+'Společná data'!$C$37,Uhlí!K2))","v":73470091.213406861},{"$f":"(L23-L15-L31+L31*'Společná data'!$B$22-L33)/(POWER(1+'Společná data'!$C$37,Uhlí!L2))","v":68627318.626348913},{"$f":"(M23-M15-M31+M31*'Společná data'!$B$22-M33)/(POWER(1+'Společná data'!$C$37,Uhlí!M2))","v":68475568.997899741},{"$f":"(N23-N15-N31+N31*'Společná data'!$B$22-N33)/(POWER(1+'Společná data'!$C$37,Uhlí!N2))","v":58926608.160213783},{"$f":"(O23-O15-O31+O31*'Společná data'!$B$22-O33)/(POWER(1+'Společná data'!$C$37,Uhlí!O2))","v":54634745.448011339},{"$f":"(P23-P15-P31+P31*'Společná data'!$B$22-P33)/(POWER(1+'Společná data'!$C$37,Uhlí!P2))","v":51308760.079173051},{"$f":"(Q23-Q15-Q31+Q31*'Společná data'!$B$22-Q33)/(POWER(1+'Společná data'!$C$37,Uhlí!Q2))","v":48199182.800476775},{"$f":"(R23-R15-R31+R31*'Společná data'!$B$22-R33)/(POWER(1+'Společná data'!$C$37,Uhlí!R2))","v":45291095.433946602},{"$f":"(S23-S15-S31+S31*'Společná data'!$B$22-S33)/(POWER(1+'Společná data'!$C$37,Uhlí!S2))","v":42570654.766707703},{"$f":"(T23-T15-T31+T31*'Společná data'!$B$22-T33)/(POWER(1+'Společná data'!$C$37,Uhlí!T2))","v":40025012.683265336},{"$f":"(U23-U15-U31+U31*'Společná data'!$B$22-U33)/(POWER(1+'Společná data'!$C$37,Uhlí!U2))","v":37642242.348340467},{"$f":"(V23-V15-V31+V31*'Společná data'!$B$22-V33)/(POWER(1+'Společná data'!$C$37,Uhlí!V2))","v":35411269.976608761},{"$f":"(W23-W15-W31+W31*'Společná data'!$B$22-W33)/(POWER(1+'Společná data'!$C$37,Uhlí!W2))","v":33321811.761439923}]
[]
[null,"Diskontované roční výdaje při zrychlených odpisech [Kč]",{"$f":"(C25-C17-C31+C31*'Společná data'!$B$22-C35)/POWER(1+'Společná data'!$C$37,C2)","v":91443938.072619081},{"$f":"(D25-D17-D31+D31*'Společná data'!$B$22-D35)/POWER(1+'Společná data'!$C$37,D2)","v":119963352.11440216},{"$f":"(E25-E17-E31+E31*'Společná data'!$B$22-E35)/POWER(1+'Společná data'!$C$37,E2)","v":106562548.21893524},{"$f":"(F25-F17-F31+F31*'Společná data'!$B$22-F35)/POWER(1+'Společná data'!$C$37,F2)","v":100561860.28583457},{"$f":"(G25-G17-G31+G31*'Společná data'!$B$22-G35)/POWER(1+'Společná data'!$C$37,G2)","v":94903494.400546417},{"$f":"(H25-H17-H31+H31*'Společná data'!$B$22-H35)/POWER(1+'Společná data'!$C$37,H2)","v":89567865.599012241},{"$f":"(I25-I17-I31+I31*'Společná data'!$B$22-I35)/POWER(1+'Společná data'!$C$37,I2)","v":84536496.902286127},{"$f":"(J25-J17-J31+J31*'Společná data'!$B$22-J35)/POWER(1+'Společná data'!$C$37,J2)","v":79791958.627319694},{"$f":"(K25-K17-K31+K31*'Společná data'!$B$22-K35)/POWER(1+'Společná data'!$C$37,K2)","v":75317810.798403621},{"$f":"(L25-L17-L31+L31*'Společná data'!$B$22-L35)/POWER(1+'Společná data'!$C$37,L2)","v":71098548.523978308},{"$f":"(M25-M17-M31+M31*'Společná data'!$B$22-M35)/POWER(1+'Společná data'!$C$37,M2)","v":71467798.9309268},{"$f":"(N25-N17-N31+N31*'Společná data'!$B$22-N35)/POWER(1+'Společná data'!$C$37,N2)","v":58266557.439693108},{"$f":"(O25-O17-O31+O31*'Společná data'!$B$22-O35)/POWER(1+'Společná data'!$C$37,O2)","v":53616148.657084376},{"$f":"(P25-P17-P31+P31*'Společná data'!$B$22-P35)/POWER(1+'Společná data'!$C$37,P2)","v":50617120.282864615},{"$f":"(Q25-Q17-Q31+Q31*'Společná data'!$B$22-Q35)/POWER(1+'Společná data'!$C$37,Q2)","v":47791650.933965072},{"$f":"(R25-R17-R31+R31*'Společná data'!$B$22-R35)/POWER(1+'Společná data'!$C$37,R2)","v":45129376.439299099},{"$f":"(S25-S17-S31+S31*'Společná data'!$B$22-S35)/POWER(1+'Společná data'!$C$37,S2)","v":42620568.036660634},{"$f":"(T25-T17-T31+T31*'Společná data'!$B$22-T35)/POWER(1+'Společná data'!$C$37,T2)","v":40256092.636751138},{"$f":"(U25-U17-U31+U31*'Společná data'!$B$22-U35)/POWER(1+'Společná data'!$C$37,U2)","v":38027375.604150131},{"$f":"(V25-V17-V31+V31*'Společná data'!$B$22-V35)/POWER(1+'Společná data'!$C$37,V2)","v":35926365.894872718},{"$f":"(W25-W17-W31+W31*'Společná data'!$B$22-W35)/POWER(1+'Společná data'!$C$37,W2)","v":33945503.40036352}]
[]
[null,"Diskontované roční výdaje při lineárních odpisech bez půjčky [Kč]",{"$f":"(C27-C15+C3-C31+C31*'Společná data'!$B$22-C33)/POWER(1+'Společná data'!$C$37,Uhlí!C2)","v":491443938.07261908},{"$f":"(D27-D15+D3-D31+D31*'Společná data'!$B$22-D33)/POWER(1+'Společná data'!$C$37,Uhlí!D2)","v":77574463.22551325},{"$f":"(E27-E15+E3-E31+E31*'Společná data'!$B$22-E33)/POWER(1+'Společná data'!$C$37,Uhlí!E2)","v":70057061.250485331},{"$f":"(F27-F15+F3-F31+F31*'Společná data'!$B$22-F33)/POWER(1+'Společná data'!$C$37,Uhlí!F2)","v":66284184.118583649},{"$f":"(G27-G15+G3-G31+G31*'Společná data'!$B$22-G33)/POWER(1+'Společná data'!$C$37,Uhlí!G2)","v":62723887.445117682},{"$f":"(H27-H15+H3-H31+H31*'Společná data'!$B$22-H33)/POWER(1+'Společná data'!$C$37,Uhlí!H2)","v":59363583.314654283},{"$f":"(I27-I15+I3-I31+I31*'Společná data'!$B$22-I33)/POWER(1+'Společná data'!$C$37,Uhlí!I2)","v":56191467.085084081},{"$f":"(J27-J15+J3-J31+J31*'Společná data'!$B$22-J33)/POWER(1+'Společná data'!$C$37,Uhlí!J2)","v":53196466.411271632},{"$f":"(K27-K15+K3-K31+K31*'Společná data'!$B$22-K33)/POWER(1+'Společná data'!$C$37,Uhlí!K2)","v":50368193.712102376},{"$f":"(L27-L15+L3-L31+L31*'Společná data'!$B$22-L33)/POWER(1+'Společná data'!$C$37,Uhlí!L2)","v":47696901.841568671},{"$f":"(M27-M15+M3-M31+M31*'Společná data'!$B$22-M33)/POWER(1+'Společná data'!$C$37,Uhlí!M2)","v":132896519.32071765},{"$f":"(N27-N15+N3-N31+N31*'Společná data'!$B$22-N33)/POWER(1+'Společná data'!$C$37,Uhlí!N2)","v":49431141.654477745},{"$f":"(O27-O15+O3-O31+O31*'Společná data'!$B$22-O33)/POWER(1+'Společná data'!$C$37,Uhlí!O2)","v":46007051.927668542},{"$f":"(P27-P15+P3-P31+P31*'Společná data'!$B$22-P33)/POWER(1+'Společná data'!$C$37,Uhlí!P2)","v":43472381.908558831},{"$f":"(Q27-Q15+Q3-Q31+Q31*'Společná data'!$B$22-Q33)/POWER(1+'Společná data'!$C$37,Uhlí!Q2)","v":41084227.958069429},{"$f":"(R27-R15+R3-R31+R31*'Společná data'!$B$22-R33)/POWER(1+'Společná data'!$C$37,Uhlí!R2)","v":38833684.349425308},{"$f":"(S27-S15+S3-S31+S31*'Společná data'!$B$22-S33)/POWER(1+'Společná data'!$C$37,Uhlí!S2)","v":36712413.082758248},{"$f":"(T27-T15+T3-T31+T31*'Společná data'!$B$22-T33)/POWER(1+'Společná data'!$C$37,Uhlí!T2)","v":34712606.173654981},{"$f":"(U27-U15+U3-U31+U31*'Společná data'!$B$22-U33)/POWER(1+'Společná data'!$C$37,Uhlí!U2)","v":32826950.53008863},{"$f":"(V27-V15+V3-V31+V31*'Společná data'!$B$22-V33)/POWER(1+'Společná data'!$C$37,Uhlí!V2)","v":31048595.235684901},{"$f":"(W27-W15+W3-W31+W31*'Společná data'!$B$22-W33)/POWER(1+'Společná data'!$C$37,Uhlí!W2)","v":29371121.070301626}]
[]
[null,"Diskontované roční výdaje při zrychlených odpisech bez půjčky [Kč]",{"$f":"(C29-C17+C3-C31+C31*'Společná data'!$B$22-C35)/POWER(1+'Společná data'!$C$37,Uhlí!C2)","v":491443938.07261908},{"$f":"(D29-D17+D3-D31+D31*'Společná data'!$B$22-D35)/POWER(1+'Společná data'!$C$37,Uhlí!D2)","v":74407796.558846578},{"$f":"(E29-E17+E3-E31+E31*'Společná data'!$B$22-E35)/POWER(1+'Společná data'!$C$37,Uhlí!E2)","v":65170229.974765167},{"$f":"(F29-F17+F3-F31+F31*'Společná data'!$B$22-F35)/POWER(1+'Společná data'!$C$37,Uhlí!F2)","v":62965965.351119339},{"$f":"(G29-G17+G3-G31+G31*'Společná data'!$B$22-G35)/POWER(1+'Společná data'!$C$37,Uhlí!G2)","v":60768708.036679111},{"$f":"(H29-H17+H3-H31+H31*'Společná data'!$B$22-H35)/POWER(1+'Společná data'!$C$37,Uhlí!H2)","v":58587718.470035806},{"$f":"(I29-I17+I3-I31+I31*'Společná data'!$B$22-I35)/POWER(1+'Společná data'!$C$37,Uhlí!I2)","v":56430931.54329966},{"$f":"(J29-J17+J3-J31+J31*'Společná data'!$B$22-J35)/POWER(1+'Společná data'!$C$37,Uhlí!J2)","v":54305098.162269682},{"$f":"(K29-K17+K3-K31+K31*'Společná data'!$B$22-K35)/POWER(1+'Společná data'!$C$37,Uhlí!K2)","v":52215913.297099136},{"$f":"(L29-L17+L3-L31+L31*'Společná data'!$B$22-L35)/POWER(1+'Společná data'!$C$37,Uhlí!L2)","v":50168131.739198074},{"$f":"(M29-M17+M3-M31+M31*'Společná data'!$B$22-M35)/POWER(1+'Společná data'!$C$37,Uhlí!M2)","v":135888749.25374469},{"$f":"(N29-N17+N3-N31+N31*'Společná data'!$B$22-N35)/POWER(1+'Společná data'!$C$37,Uhlí!N2)","v":48771090.93395707},{"$f":"(O29-O17+O3-O31+O31*'Společná data'!$B$22-O35)/POWER(1+'Společná data'!$C$37,Uhlí!O2)","v":44988455.136741571},{"$f":"(P29-P17+P3-P31+P31*'Společná data'!$B$22-P35)/POWER(1+'Společná data'!$C$37,Uhlí!P2)","v":42780742.112250395},{"$f":"(Q29-Q17+Q3-Q31+Q31*'Společná data'!$B$22-Q35)/POWER(1+'Společná data'!$C$37,Uhlí!Q2)","v":40676696.091557726},{"$f":"(R29-R17+R3-R31+R31*'Společná data'!$B$22-R35)/POWER(1+'Společná data'!$C$37,Uhlí!R2)","v":38671965.354777806},{"$f":"(S29-S17+S3-S31+S31*'Společná data'!$B$22-S35)/POWER(1+'Společná data'!$C$37,Uhlí!S2)","v":36762326.352711186},{"$f":"(T29-T17+T3-T31+T31*'Společná data'!$B$22-T35)/POWER(1+'Společná data'!$C$37,Uhlí!T2)","v":34943686.127140775},{"$f":"(U29-U17+U3-U31+U31*'Společná data'!$B$22-U35)/POWER(1+'Společná data'!$C$37,Uhlí!U2)","v":33212083.785898294},{"$f":"(V29-V17+V3-V31+V31*'Společná data'!$B$22-V35)/POWER(1+'Společná data'!$C$37,Uhlí!V2)","v":31563691.153948858},{"$f":"(W29-W17+W3-W31+W31*'Společná data'!$B$22-W35)/POWER(1+'Společná data'!$C$37,Uhlí!W2)","v":29994812.709225219}]
[]
[null,"Výsledky"]
[null,"S půjčkou"]
[null,"Bilance při lineárních odpisech [Kč]",{"$f":"SUM(C37:W37)","v":1437990541.2704897}]
[]
[null,"Bilance při zrychlených odpisech [Kč]",{"$f":"SUM(C39:W39)","v":1431412431.7999685}]
[null,"Bez půjčky"]
[null,"Bilance při lineárních odpisech bez půjčky [Kč]",{"$f":"SUM(C41:W41)","v":1551296839.6884058}]
[]
[null,"Bilance při zrychlených odpisech bez půjčky [Kč]",{"$f":"SUM(C43:W43)","v":1544718730.2178853}]

{"sheet":"Biomasa","index":2,"n_rows":59,"n_cols":23,"rows_kept":59,"cut":false,"hidden":false,"merged":[[50,1,50,2],[51,1,51,2],[55,1,55,2]]}
[]
[null,null,0,1,2,3,4,5,6,7,8,9,10,11,12,13,14,15,16,17,18,19,20]
[null,"Investice [Kč]",415000000,0,0,0,0,0,0,0,0,0,190000000,0,0,0,0,0,0,0,0,0,0]
[]
[null,"Cena uhlí [Kč/t]",{"$f":"'Společná data'!B4","v":450},{"$f":"C5","v":450},{"$f":"D5","v":450},450,450,450,450,450,450,450,{"$f":"C5+150","v":600},{"$f":"D5+150","v":600},600,600,600,600,600,600,600,600,{"$f":"M5","v":600}]
[null,"Množství spáleného uhlí [t]",{"$f":"'Společná data'!$B$3*'Společná data'!$B$11/('Společná data'!$B$1*'Společná data'!$B$10)","v":43285.223242102737},{"$f":"'Společná data'!$B$3*'Společná data'!$B$11/('Společná data'!$B$1*'Společná data'!$B$10)","v":43285.223242102737},{"$f":"'Společná data'!$B$3*'Společná data'!$B$11/('Společná data'!$B$1*'Společná data'!$B$10)","v":43285.223242102737},{"$f":"'Společná data'!$B$3*'Společná data'!$B$11/('Společná data'!$B$1*'Společná data'!$B$10)","v":43285.223242102737},{"$f":"'Společná data'!$B$3*'Společná data'!$B$11/('Společná data'!$B$1*'Společná data'!$B$10)","v":43285.223242102737},{"$f":"'Společná data'!$B$3*'Společná data'!$B$11/('Společná data'!$B$1*'Společná data'!$B$10)","v":43285.223242102737},{"$f":"'Společná data'!$B$3*'Společná data'!$B$11/('Společná data'!$B$1*'Společná data'!$B$10)","v":43285.223242102737},{"$f":"'Společná data'!$B$3*'Společná data'!$B$11/('Společná data'!$B$1*'Společná data'!$B$10)","v":43285.223242102737},{"$f":"'Společná data'!$B$3*'Společná data'!$B$11/('Společná data'!$B$1*'Společná data'!$B$10)","v":43285.223242102737},{"$f":"'Společná data'!$B$3*'Společná data'!$B$11/('Společná data'!$B$1*'Společná data'!$B$10)","v":43285.223242102737},{"$f":"'Společná data'!$B$3*'Společná data'!$B$11/('Společná data'!$B$1*'Společná data'!$B$10)","v":43285.223242102737},{"$f":"'Společná data'!$B$3*'Společná data'!$B$11/('Společná data'!$B$1*'Společná data'!$B$10)","v":43285.223242102737},{"$f":"'Společná data'!$B$3*'Společná data'!$B$11/('Společná data'!$B$1*'Společná data'!$B$10)","v":43285.223242102737},{"$f":"'Společná data'!$B$3*'Společná data'!$B$11/('Společná data'!$B$1*'Společná data'!$B$10)","v":43285.223242102737},{"$f":"'Společná data'!$B$3*'Společná data'!$B$11/('Společná data'!$B$1*'Společná data'!$B$10)","v":43285.223242102737},{"$f":"'Společná data'!$B$3*'Společná data'!$B$11/('Společná data'!$B$1*'Společná data'!$B$10)","v":43285.223242102737},{"$f":"'Společná data'!$B$3*'Společná data'!$B$11/('Společná data'!$B$1*'Společná data'!$B$10)","v":43285.223242102737},{"$f":"'Společná data'!$B$3*'Společná data'!$B$11/('Společná data'!$B$1*'Společná data'!$B$10)","v":43285.223242102737},{"$f":"'Společná data'!$B$3*'Společná data'!$B$11/('Společná data'!$B$1*'Společná data'!$B$10)","v":43285.223242102737},{"$f":"'Společná data'!$B$3*'Společná data'!$B$11/('Společná data'!$B$1*'Společná data'!$B$10)","v":43285.223242102737},{"$f":"'Společná data'!$B$3*'Společná data'!$B$11/('Společná data'!$B$1*'Společná data'!$B$10)","v":43285.223242102737}]
[null,"Cena odebraného uhlí [Kč]",{"$f":"C6*C5","v":19478350.458946232},{"$f":"D6*D5","v":19478350.458946232},19478350.458946232,19478350.458946232,19478350.458946232,19478350.458946232,19478350.458946232,19478350.458946232,19478350.458946232,19478350.458946232,25971133.945261642,25971133.945261642,25971133.945261642,25971133.945261642,25971133.945261642,25971133.945261642,25971133.945261642,25971133.945261642,25971133.945261642,25971133.945261642,25971133.945261642]
[]
[null,"Cena biomasy [Kč/t]",{"$f":"'Společná data'!$B$13","v":1450},{"$f":"'Společná data'!$B$13","v":1450},{"$f":"'Společná data'!$B$13","v":1450},{"$f":"'Společná data'!$B$13","v":1450},{"$f":"'Společná data'!$B$13","v":1450},{"$f":"'Společná data'!$B$13","v":1450},{"$f":"'Společná data'!$B$13","v":1450},{"$f":"'Společná data'!$B$13","v":1450},{"$f":"'Společná data'!$B$13","v":1450},{"$f":"'Společná data'!$B$13","v":1450},{"$f":"C9+500","v":1950},{"$f":"D9+500","v":1950},1950,1950,1950,1950,1950,1950,1950,1950,{"$f":"M9","v":1950}]
[null,"Množství spálené biomasy [t]",{"$f":"((Uhlí!C6-Biomasa!C6)*'Společná data'!$B$1)/('Společná data'!$B$12*'Společná data'!$B$10)","v":23097.463460777279},{"$f":"((Uhlí!D6-Biomasa!D6)*'Společná data'!$B$1)/('Společná data'!$B$12*'Společná data'!$B$10)","v":23097.463460777279},{"$f":"((Uhlí!E6-Biomasa!E6)*'Společná data'!$B$1)/('Společná data'!$B$12*'Společná data'!$B$10)","v":23097.463460777279},{"$f":"((Uhlí!F6-Biomasa!F6)*'Společná data'!$B$1)/('Společná data'!$B$12*'Společná data'!$B$10)","v":23097.463460777279},{"$f":"((Uhlí!G6-Biomasa!G6)*'Společná data'!$B$1)/('Společná data'!$B$12*'Společná data'!$B$10)","v":23097.463460777279},{"$f":"((Uhlí!H6-Biomasa!H6)*'Společná data'!$B$1)/('Společná data'!$B$12*'Společná data'!$B$10)","v":23097.463460777279},{"$f":"((Uhlí!I6-Biomasa!I6)*'Společná data'!$B$1)/('Společná data'!$B$12*'Společná data'!$B$10)","v":23097.463460777279},{"$f":"((Uhlí!J6-Biomasa!J6)*'Společná data'!$B$1)/('Společná data'!$B$12*'Společná data'!$B$10)","v":23097.463460777279},{"$f":"((Uhlí!K6-Biomasa!K6)*'Společná data'!$B$1)/('Společná data'!$B$12*'Společná data'!$B$10)","v":23097.463460777279},{"$f":"((Uhlí!L6-Biomasa!L6)*'Společná data'!$B$1)/('Společná data'!$B$12*'Společná data'!$B$10)","v":23097.463460777279},{"$f":"((Uhlí!M6-Biomasa!M6)*'Společná data'!$B$1)/('Společná data'!$B$12*'Společná data'!$B$10)","v":23097.463460777279},{"$f":"((Uhlí!N6-Biomasa!N6)*'Společná data'!$B$1)/('Společná data'!$B$12*'Společná data'!$B$10)","v":23097.463460777279},{"$f":"((Uhlí!O6-Biomasa!O6)*'Společná data'!$B$1)/('Společná data'!$B$12*'Společná data'!$B$10)","v":23097.463460777279},{"$f":"((Uhlí!P6-Biomasa!P6)*'Společná data'!$B$1)/('Společná data'!$B$12*'Společná data'!$B$10)","v":23097.463460777279},{"$f":"((Uhlí!Q6-Biomasa!Q6)*'Společná data'!$B$1)/('Společná data'!$B$12*'Společná data'!$B$10)","v":23097.463460777279},{"$f":"((Uhlí!R6-Biomasa!R6)*'Společná data'!$B$1)/('Společná data'!$B$12*'Společná data'!$B$10)","v":23097.463460777279},{"$f":"((Uhlí!S6-Biomasa!S6)*'Společná data'!$B$1)/('Společná data'!$B$12*'Společná data'!$B$10)","v":23097.463460777279},{"$f":"((Uhlí!T6-Biomasa!T6)*'Společná data'!$B$1)/('Společná data'!$B$12*'Společná data'!$B$10)","v":23097.463460777279},{"$f":"((Uhlí!U6-Biomasa!U6)*'Společná data'!$B$1)/('Společná data'!$B$12*'Společná data'!$B$10)","v":23097.463460777279},{"$f":"((Uhlí!V6-Biomasa!V6)*'Společná data'!$B$1)/('Společná data'!$B$12*'Společná data'!$B$10)","v":23097.463460777279},{"$f":"((Uhlí!W6-Biomasa!W6)*'Společná data'!$B$1)/('Společná data'!$B$12*'Společná data'!$B$10)","v":23097.463460777279}]
[null,"Cena odebrané biomasy [Kč]",{"$f":"C10*C9","v":33491322.018127054},{"$f":"D10*D9","v":33491322.018127054},33491322.018127054,33491322.018127054,33491322.018127054,33491322.018127054,33491322.018127054,33491322.018127054,33491322.018127054,33491322.018127054,45040053.748515695,45040053.748515695,45040053.748515695,45040053.748515695,45040053.748515695,45040053.748515695,45040053.748515695,45040053.748515695,45040053.748515695,45040053.748515695,45040053.748515695]
[]
[null,"Cena použitých emisních povolenek [Kč]",{"$f":"(Biomasa!$C$6/(Biomasa!$C$6+Biomasa!$C$10)*'Společná data'!$B$5*'Společná data'!$B$3+Biomasa!$C$10/(Biomasa!$C$6+Biomasa!$C$10)*'Společná data'!$B$14*'Společná data'!$B$3)*HLOOKUP(Biomasa!C2,'Společná data'!$B$44:$V$46,3,0)","v":31817192.382891688},{"$f":"(Biomasa!$C$6/(Biomasa!$C$6+Biomasa!$C$10)*'Společná data'!$B$5*'Společná data'!$B$3+Biomasa!$C$10/(Biomasa!$C$6+Biomasa!$C$10)*'Společná data'!$B$14*'Společná data'!$B$3)*HLOOKUP(Biomasa!D2,'Společná data'!$B$44:$V$46,3,0)","v":29271816.992260356},{"$f":"(Biomasa!$C$6/(Biomasa!$C$6+Biomasa!$C$10)*'Společná data'!$B$5*'Společná data'!$B$3+Biomasa!$C$10/(Biomasa!$C$6+Biomasa!$C$10)*'Společná data'!$B$14*'Společná data'!$B$3)*HLOOKUP(Biomasa!E2,'Společná data'!$B$44:$V$46,3,0)","v":30120699.685035903},{"$f":"(Biomasa!$C$6/(Biomasa!$C$6+Biomasa!$C$10)*'Společná data'!$B$5*'Společná data'!$B$3+Biomasa!$C$10/(Biomasa!$C$6+Biomasa!$C$10)*'Společná data'!$B$14*'Společná data'!$B$3)*HLOOKUP(Biomasa!F2,'Společná data'!$B$44:$V$46,3,0)","v":30994199.975901939},{"$f":"(Biomasa!$C$6/(Biomasa!$C$6+Biomasa!$C$10)*'Společná data'!$B$5*'Společná data'!$B$3+Biomasa!$C$10/(Biomasa!$C$6+Biomasa!$C$10)*'Společná data'!$B$14*'Společná data'!$B$3)*HLOOKUP(Biomasa!G2,'Společná data'!$B$44:$V$46,3,0)","v":31893031.775203094},{"$f":"(Biomasa!$C$6/(Biomasa!$C$6+Biomasa!$C$10)*'Společná data'!$B$5*'Společná data'!$B$3+Biomasa!$C$10/(Biomasa!$C$6+Biomasa!$C$10)*'Společná data'!$B$14*'Společná data'!$B$3)*HLOOKUP(Biomasa!H2,'Společná data'!$B$44:$V$46,3,0)","v":32817929.696683981},{"$f":"(Biomasa!$C$6/(Biomasa!$C$6+Biomasa!$C$10)*'Společná data'!$B$5*'Společná data'!$B$3+Biomasa!$C$10/(Biomasa!$C$6+Biomasa!$C$10)*'Společná data'!$B$14*'Společná data'!$B$3)*HLOOKUP(Biomasa!I2,'Společná data'!$B$44:$V$46,3,0)","v":33769649.657887816},{"$f":"(Biomasa!$C$6/(Biomasa!$C$6+Biomasa!$C$10)*'Společná data'!$B$5*'Společná data'!$B$3+Biomasa!$C$10/(Biomasa!$C$6+Biomasa!$C$10)*'Společná data'!$B$14*'Společná data'!$B$3)*HLOOKUP(Biomasa!J2,'Společná data'!$B$44:$V$46,3,0)","v":34748969.497966558},{"$f":"(Biomasa!$C$6/(Biomasa!$C$6+Biomasa!$C$10)*'Společná data'!$B$5*'Společná data'!$B$3+Biomasa!$C$10/(Biomasa!$C$6+Biomasa!$C$10)*'Společná data'!$B$14*'Společná data'!$B$3)*HLOOKUP(Biomasa!K2,'Společná data'!$B$44:$V$46,3,0)","v":35756689.613407582},{"$f":"(Biomasa!$C$6/(Biomasa!$C$6+Biomasa!$C$10)*'Společná data'!$B$5*'Společná data'!$B$3+Biomasa!$C$10/(Biomasa!$C$6+Biomasa!$C$10)*'Společná data'!$B$14*'Společná data'!$B$3)*HLOOKUP(Biomasa!L2,'Společná data'!$B$44:$V$46,3,0)","v":36793633.612196401},{"$f":"(Biomasa!$C$6/(Biomasa!$C$6+Biomasa!$C$10)*'Společná data'!$B$5*'Společná data'!$B$3+Biomasa!$C$10/(Biomasa!$C$6+Biomasa!$C$10)*'Společná data'!$B$14*'Společná data'!$B$3)*HLOOKUP(Biomasa!M2,'Společná data'!$B$44:$V$46,3,0)","v":37860648.986950092},{"$f":"(Biomasa!$C$6/(Biomasa!$C$6+Biomasa!$C$10)*'Společná data'!$B$5*'Společná data'!$B$3+Biomasa!$C$10/(Biomasa!$C$6+Biomasa!$C$10)*'Společná data'!$B$14*'Společná data'!$B$3)*HLOOKUP(Biomasa!N2,'Společná data'!$B$44:$V$46,3,0)","v":38958607.807571642},{"$f":"(Biomasa!$C$6/(Biomasa!$C$6+Biomasa!$C$10)*'Společná data'!$B$5*'Společná data'!$B$3+Biomasa!$C$10/(Biomasa!$C$6+Biomasa!$C$10)*'Společná data'!$B$14*'Společná data'!$B$3)*HLOOKUP(Biomasa!O2,'Společná data'!$B$44:$V$46,3,0)","v":40088407.433991216},{"$f":"(Biomasa!$C$6/(Biomasa!$C$6+Biomasa!$C$10)*'Společná data'!$B$5*'Společná data'!$B$3+Biomasa!$C$10/(Biomasa!$C$6+Biomasa!$C$10)*'Společná data'!$B$14*'Společná data'!$B$3)*HLOOKUP(Biomasa!P2,'Společná data'!$B$44:$V$46,3,0)","v":41250971.249576956},{"$f":"(Biomasa!$C$6/(Biomasa!$C$6+Biomasa!$C$10)*'Společná data'!$B$5*'Společná data'!$B$3+Biomasa!$C$10/(Biomasa!$C$6+Biomasa!$C$10)*'Společná data'!$B$14*'Společná data'!$B$3)*HLOOKUP(Biomasa!Q2,'Společná data'!$B$44:$V$46,3,0)","v":42447249.415814675},{"$f":"(Biomasa!$C$6/(Biomasa!$C$6+Biomasa!$C$10)*'Společná data'!$B$5*'Společná data'!$B$3+Biomasa!$C$10/(Biomasa!$C$6+Biomasa!$C$10)*'Společná data'!$B$14*'Společná data'!$B$3)*HLOOKUP(Biomasa!R2,'Společná data'!$B$44:$V$46,3,0)","v":43678219.648873299},{"$f":"(Biomasa!$C$6/(Biomasa!$C$6+Biomasa!$C$10)*'Společná data'!$B$5*'Společná data'!$B$3+Biomasa!$C$10/(Biomasa!$C$6+Biomasa!$C$10)*'Společná data'!$B$14*'Společná data'!$B$3)*HLOOKUP(Biomasa!S2,'Společná data'!$B$44:$V$46,3,0)","v":44944888.018690616},{"$f":"(Biomasa!$C$6/(Biomasa!$C$6+Biomasa!$C$10)*'Společná data'!$B$5*'Společná data'!$B$3+Biomasa!$C$10/(Biomasa!$C$6+Biomasa!$C$10)*'Společná data'!$B$14*'Společná data'!$B$3)*HLOOKUP(Biomasa!T2,'Společná data'!$B$44:$V$46,3,0)","v":46248289.771232635},{"$f":"(Biomasa!$C$6/(Biomasa!$C$6+Biomasa!$C$10)*'Společná data'!$B$5*'Společná data'!$B$3+Biomasa!$C$10/(Biomasa!$C$6+Biomasa!$C$10)*'Společná data'!$B$14*'Společná data'!$B$3)*HLOOKUP(Biomasa!U2,'Společná data'!$B$44:$V$46,3,0)","v":47589490.174598373},{"$f":"(Biomasa!$C$6/(Biomasa!$C$6+Biomasa!$C$10)*'Společná data'!$B$5*'Společná data'!$B$3+Biomasa!$C$10/(Biomasa!$C$6+Biomasa!$C$10)*'Společná data'!$B$14*'Společná data'!$B$3)*HLOOKUP(Biomasa!V2,'Společná data'!$B$44:$V$46,3,0)","v":48969585.389661729},{"$f":"(Biomasa!$C$6/(Biomasa!$C$6+Biomasa!$C$10)*'Společná data'!$B$5*'Společná data'!$B$3+Biomasa!$C$10/(Biomasa!$C$6+Biomasa!$C$10)*'Společná data'!$B$14*'Společná data'!$B$3)*HLOOKUP(Biomasa!W2,'Společná data'!$B$44:$V$46,3,0)","v":50389703.365961909}]
[]
[null,"Cena odebráného vápna [Kč]",{"$f":"C6*'Společná data'!$B$6*'Společná data'!$B$7*POWER(1+'Společná data'!$C$47,C2)","v":3376247.4128840133},{"$f":"D6*'Společná data'!$B$6*'Společná data'!$B$7*POWER(1+'Společná data'!$C$47,D2)","v":3474158.5878576492},{"$f":"E6*'Společná data'!$B$6*'Společná data'!$B$7*POWER(1+'Společná data'!$C$47,E2)","v":3574909.1869055214},{"$f":"F6*'Společná data'!$B$6*'Společná data'!$B$7*POWER(1+'Společná data'!$C$47,F2)","v":3678581.5533257811},{"$f":"G6*'Společná data'!$B$6*'Společná data'!$B$7*POWER(1+'Společná data'!$C$47,G2)","v":3785260.4183722287},{"$f":"H6*'Společná data'!$B$6*'Společná data'!$B$7*POWER(1+'Společná data'!$C$47,H2)","v":3895032.9705050229},{"$f":"I6*'Společná data'!$B$6*'Společná data'!$B$7*POWER(1+'Společná data'!$C$47,I2)","v":4007988.9266496683},{"$f":"J6*'Společná data'!$B$6*'Společná data'!$B$7*POWER(1+'Společná data'!$C$47,J2)","v":4124220.6055225087},{"$f":"K6*'Společná data'!$B$6*'Společná data'!$B$7*POWER(1+'Společná data'!$C$47,K2)","v":4243823.0030826619},{"$f":"L6*'Společná data'!$B$6*'Společná data'!$B$7*POWER(1+'Společná data'!$C$47,L2)","v":4366893.8701720582},{"$f":"M6*'Společná data'!$B$6*'Společná data'!$B$7*POWER(1+'Společná data'!$C$47,M2)","v":4493533.7924070489},{"$f":"N6*'Společná data'!$B$6*'Společná data'!$B$7*POWER(1+'Společná data'!$C$47,N2)","v":4623846.2723868517},{"$f":"O6*'Společná data'!$B$6*'Společná data'!$B$7*POWER(1+'Společná data'!$C$47,O2)","v":4757937.8142860709},{"$f":"P6*'Společná data'!$B$6*'Společná data'!$B$7*POWER(1+'Společná data'!$C$47,P2)","v":4895918.0109003671},{"$f":"Q6*'Společná data'!$B$6*'Společná data'!$B$7*POWER(1+'Společná data'!$C$47,Q2)","v":5037899.633216477},{"$f":"R6*'Společná data'!$B$6*'Společná data'!$B$7*POWER(1+'Společná data'!$C$47,R2)","v":5183998.7225797549},{"$f":"S6*'Společná data'!$B$6*'Společná data'!$B$7*POWER(1+'Společná data'!$C$47,S2)","v":5334334.6855345676},{"$f":"T6*'Společná data'!$B$6*'Společná data'!$B$7*POWER(1+'Společná data'!$C$47,T2)","v":5489030.3914150689},{"$f":"U6*'Společná data'!$B$6*'Společná data'!$B$7*POWER(1+'Společná data'!$C$47,U2)","v":5648212.2727661058},{"$f":"V6*'Společná data'!$B$6*'Společná data'!$B$7*POWER(1+'Společná data'!$C$47,V2)","v":5812010.428676323},{"$f":"W6*'Společná data'!$B$6*'Společná data'!$B$7*POWER(1+'Společná data'!$C$47,W2)","v":5980558.7311079372}]
[]
[null,"Údržba [Kč]",11000000,{"$f":"C17*(1+'Společná data'!$C$47)","v":11318999.999999998},{"$f":"D17*(1+'Společná data'!$C$47)","v":11647250.999999996},{"$f":"E17*(1+'Společná data'!$C$47)","v":11985021.278999995},{"$f":"F17*(1+'Společná data'!$C$47)","v":12332586.896090994},{"$f":"G17*(1+'Společná data'!$C$47)","v":12690231.916077631},{"$f":"H17*(1+'Společná data'!$C$47)","v":13058248.64164388},{"$f":"I17*(1+'Společná data'!$C$47)","v":13436937.852251552},{"$f":"J17*(1+'Společná data'!$C$47)","v":13826609.049966846},{"$f":"K17*(1+'Společná data'!$C$47)","v":14227580.712415883},{"$f":"L17*(1+'Společná data'!$C$47)","v":14640180.553075943},{"$f":"M17*(1+'Společná data'!$C$47)","v":15064745.789115144},{"$f":"N17*(1+'Společná data'!$C$47)","v":15501623.416999482},{"$f":"O17*(1+'Společná data'!$C$47)","v":15951170.496092465},{"$f":"P17*(1+'Společná data'!$C$47)","v":16413754.440479144},{"$f":"Q17*(1+'Společná data'!$C$47)","v":16889753.319253039},{"$f":"R17*(1+'Společná data'!$C$47)","v":17379556.165511377},{"$f":"S17*(1+'Společná data'!$C$47)","v":17883563.294311207},{"$f":"T17*(1+'Společná data'!$C$47)","v":18402186.62984623},{"$f":"U17*(1+'Společná data'!$C$47)","v":18935850.042111769},{"$f":"V17*(1+'Společná data'!$C$47)","v":19484989.693333007}]
[]
[null,"Výše lineárního odpisu [Kč]",0,{"$f":"IF(D2=1,0.055,0.105)*$C$3","v":22825000},43575000,43575000,43575000,43575000,43575000,43575000,43575000,43575000,43575000,{"$f":"IF(N2=11,0.055,0.105)*$M$3","v":10450000},19950000,19950000,19950000,19950000,19950000,19950000,19950000,19950000,19950000]
[]
[null,"Výše zrychleného odpisu [Kč]",0,{"$f":"IF(D2=1,$C$3/10,(($C$3-(SUM($C$21:C21)))*2)/('Společná data'!$B$19+1-C2))","v":41500000},{"$f":"IF(E2=1,$C$3/10,(($C$3-(SUM($C$21:D21)))*2)/('Společná data'!$B$19+1-D2))","v":74700000},{"$f":"IF(F2=1,$C$3/10,(($C$3-(SUM($C$21:E21)))*2)/('Společná data'!$B$19+1-E2))","v":66400000},{"$f":"IF(G2=1,$C$3/10,(($C$3-(SUM($C$21:F21)))*2)/('Společná data'!$B$19+1-F2))","v":58100000},{"$f":"IF(H2=1,$C$3/10,(($C$3-(SUM($C$21:G21)))*2)/('Společná data'!$B$19+1-G2))","v":49800000},{"$f":"IF(I2=1,$C$3/10,(($C$3-(SUM($C$21:H21)))*2)/('Společná data'!$B$19+1-H2))","v":41500000},{"$f":"IF(J2=1,$C$3/10,(($C$3-(SUM($C$21:I21)))*2)/('Společná data'!$B$19+1-I2))","v":33200000},{"$f":"IF(K2=1,$C$3/10,(($C$3-(SUM($C$21:J21)))*2)/('Společná data'!$B$19+1-J2))","v":24900000},{"$f":"IF(L2=1,$C$3/10,(($C$3-(SUM($C$21:K21)))*2)/('Společná data'!$B$19+1-K2))","v":16600000},{"$f":"IF(M2=1,$C$3/10,(($C$3-(SUM($C$21:L21)))*2)/('Společná data'!$B$19+1-L2))","v":8300000},{"$f":"IF(N2=11,$M$3/10,(($M$3-(SUM($N$21:N21)))*2)/('Společná data'!$B$19+1-C2))","v":19000000},{"$f":"IF(O2=11,$M$3/10,(($M$3-(SUM($N$21:N21)))*2)/('Společná data'!$B$19+1-D2))","v":34200000},{"$f":"IF(P2=11,$M$3/10,(($M$3-(SUM($N$21:O21)))*2)/('Společná data'!$B$19+1-E2))","v":30400000},{"$f":"IF(Q2=11,$M$3/10,(($M$3-(SUM($N$21:P21)))*2)/('Společná data'!$B$19+1-F2))","v":26600000},{"$f":"IF(R2=11,$M$3/10,(($M$3-(SUM($N$21:Q21)))*2)/('Společná data'!$B$19+1-G2))","v":22800000},{"$f":"IF(S2=11,$M$3/10,(($M$3-(SUM($N$21:R21)))*2)/('Společná data'!$B$19+1-H2))","v":19000000},{"$f":"IF(T2=11,$M$3/10,(($M$3-(SUM($N$21:S21)))*2)/('Společná data'!$B$19+1-I2))","v":15200000},{"$f":"IF(U2=11,$M$3/10,(($M$3-(SUM($N$21:T21)))*2)/('Společná data'!$B$19+1-J2))","v":11400000},{"$f":"IF(V2=11,$M$3/10,(($M$3-(SUM($N$21:U21)))*2)/('Společná data'!$B$19+1-K2))","v":7600000},{"$f":"IF(W2=11,$M$3/10,(($M$3-(SUM($N$21:V21)))*2)/('Společná data'!$B$19+1-L2))","v":3800000}]
[]
[null,"Úmor [Kč]",0,{"$f":"$C$3/'Společná data'!$B$21","v":41500000},{"$f":"$C$3/'Společná data'!$B$21","v":41500000},{"$f":"$C$3/'Společná data'!$B$21","v":41500000},{"$f":"$C$3/'Společná data'!$B$21","v":41500000},{"$f":"$C$3/'Společná data'!$B$21","v":41500000},{"$f":"$C$3/'Společná data'!$B$21","v":41500000},{"$f":"$C$3/'Společná data'!$B$21","v":41500000},{"$f":"$C$3/'Společná data'!$B$21","v":41500000},{"$f":"$C$3/'Společná data'!$B$21","v":41500000},{"$f":"$C$3/'Společná data'!$B$21","v":41500000},{"$f":"$M$3/'Společná data'!$B$21","v":19000000},{"$f":"$M$3/'Společná data'!$B$21","v":19000000},{"$f":"$M$3/'Společná data'!$B$21","v":19000000},{"$f":"$M$3/'Společná data'!$B$21","v":19000000},{"$f":"$M$3/'Společná data'!$B$21","v":19000000},{"$f":"$M$3/'Společná data'!$B$21","v":19000000},{"$f":"$M$3/'Společná data'!$B$21","v":19000000},{"$f":"$M$3/'Společná data'!$B$21","v":19000000},{"$f":"$M$3/'Společná data'!$B$21","v":19000000},{"$f":"$M$3/'Společná data'!$B$21","v":19000000}]
[]
[null,"Úrok [Kč]",0,{"$f":"($C$3-SUM($C$23:C23))*'Společná data'!$B$20","v":9545000},{"$f":"($C$3-SUM($C$23:D23))*'Společná data'!$B$20","v":8590500},{"$f":"($C$3-SUM($C$23:E23))*'Společná data'!$B$20","v":7636000},{"$f":"($C$3-SUM($C$23:F23))*'Společná data'!$B$20","v":6681500},{"$f":"($C$3-SUM($C$23:G23))*'Společná data'!$B$20","v":5727000},{"$f":"($C$3-SUM($C$23:H23))*'Společná data'!$B$20","v":4772500},{"$f":"($C$3-SUM($C$23:I23))*'Společná data'!$B$20","v":3818000},{"$f":"($C$3-SUM($C$23:J23))*'Společná data'!$B$20","v":2863500},{"$f":"($C$3-SUM($C$23:K23))*'Společná data'!$B$20","v":1909000},{"$f":"($C$3-SUM($C$23:L23))*'Společná data'!$B$20","v":954500},{"$f":"($M$3)*'Společná data'!$B$20","v":4370000},{"$f":"($M$3-SUM($N$23:N23))*'Společná data'!$B$20","v":3933000},{"$f":"($M$3-SUM($N$23:O23))*'Společná data'!$B$20","v":3496000},{"$f":"($M$3-SUM($N$23:P23))*'Společná data'!$B$20","v":3059000},{"$f":"($M$3-SUM($N$23:Q23))*'Společná data'!$B$20","v":2622000},{"$f":"($M$3-SUM($N$23:R23))*'Společná data'!$B$20","v":2185000},{"$f":"($M$3-SUM($N$23:S23))*'Společná data'!$B$20","v":1748000},{"$f":"($M$3-SUM($N$23:T23))*'Společná data'!$B$20","v":1311000},{"$f":"($M$3-SUM($N$23:U23))*'Společná data'!$B$20","v":874000},{"$f":"($M$3-SUM($N$23:V23))*'Společná data'!$B$20","v":437000}]
[]
[null,"Náklady při lineárních odpisech [Kč]",{"$f":"SUM(C7,C13,C15,C17,C19,C23,C25,C11)","v":99163112.272848994},{"$f":"SUM(D7,D13,D15,D17,D19,D23,D25,D11)","v":170904648.05719128},191978032.3490147,192338475.285301,192737051.56673959,193174867.06033993,193653059.70325464,194172800.43281391,194735294.14353037,195341780.67185763,214035051.0262104,163478387.56285098,174242156.35905412,175555247.45034713,176919091.18328762,178335159.38448346,179804966.5635139,181330071.15073624,182912076.77098808,184552633.55422714,186253439.48418018]
[]
[null,"Náklady při zrychlených odpisech [Kč]",{"$f":"SUM(C7,C13,C15,C17,C21,C23,C25,C11)","v":99163112.272848994},{"$f":"SUM(D7,D13,D15,D17,D21,D23,D25,D11)","v":189579648.05719128},223103032.3490147,215163475.285301,207262051.56673959,199399867.06033993,191578059.70325464,183797800.43281391,176060294.14353037,168366780.67185763,178760051.02621043,172028387.56285098,188492156.35905412,186005247.45034713,183569091.18328765,181185159.38448343,178854966.5635139,176580071.15073627,174362076.77098805,172202633.55422717,170103439.48418018]
[]
[null,"Náklady při lineárních odpisech bez půjčky [Kč]",{"$f":"C27-C25-C23","v":99163112.272848994},{"$f":"D27-D25-D23","v":119859648.05719128},141887532.3490147,143202475.285301,144555551.56673959,145947867.06033993,147380559.70325464,148854800.43281391,150371794.14353037,151932780.67185763,171580551.0262104,140108387.56285098,151309156.35905412,153059247.45034713,154860091.18328762,156713159.38448346,158619966.5635139,160582071.15073624,162601076.77098808,164678633.55422714,166816439.48418018]
[]
[null,"Náklady při zrychlených odpisech bez půjčky [Kč]",{"$f":"C29-C25-C23","v":99163112.272848994},{"$f":"D29-D25-D23","v":138534648.05719128},173012532.3490147,166027475.285301,159080551.56673959,152172867.06033993,145305559.70325464,138479800.43281391,131696794.14353037,124957780.67185763,136305551.02621043,148658387.56285098,165559156.35905412,163509247.45034713,161510091.18328765,159563159.38448343,157669966.5635139,155832071.15073627,154051076.77098805,152328633.55422717,150666439.48418018]
[]
[null,"Tržby ze škváry [Kč]",{"$f":"C6*'Společná data'!$B$8*'Společná data'!$B$9*POWER(1+'Společná data'!$C$47,C2)","v":337624.7412884013},{"$f":"D6*'Společná data'!$B$8*'Společná data'!$B$9*POWER(1+'Společná data'!$C$47,D2)","v":347415.8587857649},{"$f":"E6*'Společná data'!$B$8*'Společná data'!$B$9*POWER(1+'Společná data'!$C$47,E2)","v":357490.91869055212},{"$f":"F6*'Společná data'!$B$8*'Společná data'!$B$9*POWER(1+'Společná data'!$C$47,F2)","v":367858.15533257806},{"$f":"G6*'Společná data'!$B$8*'Společná data'!$B$9*POWER(1+'Společná data'!$C$47,G2)","v":378526.04183722282},{"$f":"H6*'Společná data'!$B$8*'Společná data'!$B$9*POWER(1+'Společná data'!$C$47,H2)","v":389503.29705050227},{"$f":"I6*'Společná data'!$B$8*'Společná data'!$B$9*POWER(1+'Společná data'!$C$47,I2)","v":400798.89266496681},{"$f":"J6*'Společná data'!$B$8*'Společná data'!$B$9*POWER(1+'Společná data'!$C$47,J2)","v":412422.06055225088},{"$f":"K6*'Společná data'!$B$8*'Společná data'!$B$9*POWER(1+'Společná data'!$C$47,K2)","v":424382.30030826613},{"$f":"L6*'Společná data'!$B$8*'Společná data'!$B$9*POWER(1+'Společná data'!$C$47,L2)","v":436689.38701720577},{"$f":"M6*'Společná data'!$B$8*'Společná data'!$B$9*POWER(1+'Společná data'!$C$47,M2)","v":449353.37924070482},{"$f":"N6*'Společná data'!$B$8*'Společná data'!$B$9*POWER(1+'Společná data'!$C$47,N2)","v":462384.62723868515},{"$f":"O6*'Společná data'!$B$8*'Společná data'!$B$9*POWER(1+'Společná data'!$C$47,O2)","v":475793.78142860701},{"$f":"P6*'Společná data'!$B$8*'Společná data'!$B$9*POWER(1+'Společná data'!$C$47,P2)","v":489591.80109003664},{"$f":"Q6*'Společná data'!$B$8*'Společná data'!$B$9*POWER(1+'Společná data'!$C$47,Q2)","v":503789.96332164766},{"$f":"R6*'Společná data'!$B$8*'Společná data'!$B$9*POWER(1+'Společná data'!$C$47,R2)","v":518399.87225797545},{"$f":"S6*'Společná data'!$B$8*'Společná data'!$B$9*POWER(1+'Společná data'!$C$47,S2)","v":533433.46855345671},{"$f":"T6*'Společná data'!$B$8*'Společná data'!$B$9*POWER(1+'Společná data'!$C$47,T2)","v":548903.03914150689},{"$f":"U6*'Společná data'!$B$8*'Společná data'!$B$9*POWER(1+'Společná data'!$C$47,U2)","v":564821.22727661056},{"$f":"V6*'Společná data'!$B$8*'Společná data'!$B$9*POWER(1+'Společná data'!$C$47,V2)","v":581201.04286763223},{"$f":"W6*'Společná data'!$B$8*'Společná data'!$B$9*POWER(1+'Společná data'!$C$47,W2)","v":598055.87311079365}]
[]
[null,"Dotace na elektřinu [Kč]",{"$f":"'Společná data'!$B$24*'Společná data'!$B$25","v":0},{"$f":"'Společná data'!$B$24*'Společná data'!$B$25","v":0},{"$f":"'Společná data'!$B$24*'Společná data'!$B$25","v":0},{"$f":"'Společná data'!$B$24*'Společná data'!$B$25","v":0},{"$f":"'Společná data'!$B$24*'Společná data'!$B$25","v":0},{"$f":"'Společná data'!$B$24*'Společná data'!$B$25","v":0},{"$f":"'Společná data'!$B$24*'Společná data'!$B$25","v":0},{"$f":"'Společná data'!$B$24*'Společná data'!$B$25","v":0},{"$f":"'Společná data'!$B$24*'Společná data'!$B$25","v":0},{"$f":"'Společná data'!$B$24*'Společná data'!$B$25","v":0},{"$f":"'Společná data'!$B$24*'Společná data'!$B$25","v":0},{"$f":"'Společná data'!$B$24*'Společná data'!$B$25","v":0},{"$f":"'Společná data'!$B$24*'Společná data'!$B$25","v":0},{"$f":"'Společná data'!$B$24*'Společná data'!$B$25","v":0},{"$f":"'Společná data'!$B$24*'Společná data'!$B$25","v":0},{"$f":"'Společná data'!$B$24*'Společná data'!$B$25","v":0},{"$f":"'Společná data'!$B$24*'Společná data'!$B$25","v":0},{"$f":"'Společná data'!$B$24*'Společná data'!$B$25","v":0},{"$f":"'Společná data'!$B$24*'Společná data'!$B$25","v":0},{"$f":"'Společná data'!$B$24*'Společná data'!$B$25","v":0},{"$f":"'Společná data'!$B$24*'Společná data'!$B$25","v":0}]
[]
[null,"Daňový štít při lineárních odpisech [Kč]",{"$f":"C19*'Společná data'!$B$22","v":0},{"$f":"D19*'Společná data'!$B$22","v":4336750},{"$f":"E19*'Společná data'!$B$22","v":8279250},{"$f":"F19*'Společná data'!$B$22","v":8279250},{"$f":"G19*'Společná data'!$B$22","v":8279250},{"$f":"H19*'Společná data'!$B$22","v":8279250},{"$f":"I19*'Společná data'!$B$22","v":8279250},{"$f":"J19*'Společná data'!$B$22","v":8279250},{"$f":"K19*'Společná data'!$B$22","v":8279250},{"$f":"L19*'Společná data'!$B$22","v":8279250},{"$f":"M19*'Společná data'!$B$22","v":8279250},{"$f":"N19*'Společná data'!$B$22","v":1985500},{"$f":"O19*'Společná data'!$B$22","v":3790500},{"$f":"P19*'Společná data'!$B$22","v":3790500},{"$f":"Q19*'Společná data'!$B$22","v":3790500},{"$f":"R19*'Společná data'!$B$22","v":3790500},{"$f":"S19*'Společná data'!$B$22","v":3790500},{"$f":"T19*'Společná data'!$B$22","v":3790500},{"$f":"U19*'Společná data'!$B$22","v":3790500},{"$f":"V19*'Společná data'!$B$22","v":3790500},{"$f":"W19*'Společná data'!$B$22","v":3790500}]
[]
[null,"Daňový štít při zrychlených odpisech [Kč]",{"$f":"C21*'Společná data'!$B$22","v":0},{"$f":"D21*'Společná data'!$B$22","v":7885000},{"$f":"E21*'Společná data'!$B$22","v":14193000},{"$f":"F21*'Společná data'!$B$22","v":12616000},{"$f":"G21*'Společná data'!$B$22","v":11039000},{"$f":"H21*'Společná data'!$B$22","v":9462000},{"$f":"I21*'Společná data'!$B$22","v":7885000},{"$f":"J21*'Společná data'!$B$22","v":6308000},{"$f":"K21*'Společná data'!$B$22","v":4731000},{"$f":"L21*'Společná data'!$B$22","v":3154000},{"$f":"M21*'Společná data'!$B$22","v":1577000},{"$f":"N21*'Společná data'!$B$22","v":3610000},{"$f":"O21*'Společná data'!$B$22","v":6498000},{"$f":"P21*'Společná data'!$B$22","v":5776000},{"$f":"Q21*'Společná data'!$B$22","v":5054000},{"$f":"R21*'Společná data'!$B$22","v":4332000},{"$f":"S21*'Společná data'!$B$22","v":3610000},{"$f":"T21*'Společná data'!$B$22","v":2888000},{"$f":"U21*'Společná data'!$B$22","v":2166000},{"$f":"V21*'Společná data'!$B$22","v":1444000},{"$f":"W21*'Společná data'!$B$22","v":722000}]
[]
[null,"Diskontované roční výdaje při lineárních odpisech [Kč]",{"$f":"(C27-C19-C35+C35*'Společná data'!$B$22-C39-C37)/(POWER(1+'Společná data'!$C$37,Uhlí!C2))","v":98889636.232405379},{"$f":"(D27-D19-D35+D35*'Společná data'!$B$22-D39-D37)/(POWER(1+'Společná data'!$C$37,Uhlí!D2))","v":132834714.08479147},{"$f":"(E27-E19-E35+E35*'Společná data'!$B$22-E39-E37)/(POWER(1+'Společná data'!$C$37,Uhlí!E2))","v":119885300.67290409},{"$f":"(F27-F19-F35+F35*'Společná data'!$B$22-F39-F37)/(POWER(1+'Společná data'!$C$37,Uhlí!F2))","v":111284373.07851446},{"$f":"(G27-G19-G35+G35*'Společná data'!$B$22-G39-G37)/(POWER(1+'Společná data'!$C$37,Uhlí!G2))","v":103327700.26509544},{"$f":"(H27-H19-H35+H35*'Společná data'!$B$22-H39-H37)/(POWER(1+'Společná data'!$C$37,Uhlí!H2))","v":95965714.95238781},{"$f":"(I27-I19-I35+I35*'Společná data'!$B$22-I39-I37)/(POWER(1+'Společná data'!$C$37,Uhlí!I2))","v":89152720.259365186},{"$f":"(J27-J19-J35+J35*'Společná data'!$B$22-J39-J37)/(POWER(1+'Společná data'!$C$37,Uhlí!J2))","v":82846585.353164092},{"$f":"(K27-K19-K35+K35*'Společná data'!$B$22-K39-K37)/(POWER(1+'Společná data'!$C$37,Uhlí!K2))","v":77008465.088790864},{"$f":"(L27-L19-L35+L35*'Společná data'!$B$22-L39-L37)/(POWER(1+'Společná data'!$C$37,Uhlí!L2))","v":71602541.74884209},{"$f":"(M27-M19-M35+M35*'Společná data'!$B$22-M39-M37)/(POWER(1+'Společná data'!$C$37,Uhlí!M2))","v":74952499.50481689},{"$f":"(N27-N19-N35+N35*'Společná data'!$B$22-N39-N37)/(POWER(1+'Společná data'!$C$37,Uhlí!N2))","v":64619075.339328244},{"$f":"(O27-O19-O35+O35*'Společná data'!$B$22-O39-O37)/(POWER(1+'Společná data'!$C$37,Uhlí!O2))","v":59613233.591115698},{"$f":"(P27-P19-P35+P35*'Společná data'!$B$22-P39-P37)/(POWER(1+'Společná data'!$C$37,Uhlí!P2))","v":55676149.841879107},{"$f":"(Q27-Q19-Q35+Q35*'Společná data'!$B$22-Q39-Q37)/(POWER(1+'Společná data'!$C$37,Uhlí!Q2))","v":52012410.775815994},{"$f":"(R27-R19-R35+R35*'Společná data'!$B$22-R39-R37)/(POWER(1+'Společná data'!$C$37,Uhlí!R2))","v":48602312.782721974},{"$f":"(S27-S19-S35+S35*'Společná data'!$B$22-S39-S37)/(POWER(1+'Společná data'!$C$37,Uhlí!S2))","v":45427609.757799067},{"$f":"(T27-T19-T35+T35*'Společná data'!$B$22-T39-T37)/(POWER(1+'Společná data'!$C$37,Uhlí!T2))","v":42471403.480080917},{"$f":"(U27-U19-U35+U35*'Společná data'!$B$22-U39-U37)/(POWER(1+'Společná data'!$C$37,Uhlí!U2))","v":39718042.319179587},{"$f":"(V27-V19-V35+V35*'Společná data'!$B$22-V39-V37)/(POWER(1+'Společná data'!$C$37,Uhlí!V2))","v":37153027.633987494},{"$f":"(W27-W19-W35+W35*'Společná data'!$B$22-W39-W37)/(POWER(1+'Společná data'!$C$37,Uhlí!W2))","v":34762927.275737032}]
[]
[null,"Diskontované roční výdaje při zrychlených odpisech [Kč]",{"$f":"(C29-C21-C35+C35*'Společná data'!$B$22-C41-C37)/POWER(1+'Společná data'!$C$37,C2)","v":98889636.232405379},{"$f":"(D29-D21-D35+D35*'Společná data'!$B$22-D41-D37)/POWER(1+'Společná data'!$C$37,D2)","v":129549297.41812479},{"$f":"(E29-E21-E35+E35*'Společná data'!$B$22-E41-E37)/POWER(1+'Společná data'!$C$37,E2)","v":114815213.22434443},{"$f":"(F29-F21-F35+F35*'Společná data'!$B$22-F41-F37)/POWER(1+'Společná data'!$C$37,F2)","v":107841721.10727024},{"$f":"(G29-G21-G35+G35*'Společná data'!$B$22-G41-G37)/POWER(1+'Společná data'!$C$37,G2)","v":101299201.62884043},{"$f":"(H29-H21-H35+H35*'Společná data'!$B$22-H41-H37)/POWER(1+'Společná data'!$C$37,H2)","v":95160755.176096141},{"$f":"(I29-I21-I35+I35*'Společná data'!$B$22-I41-I37)/POWER(1+'Společná data'!$C$37,I2)","v":89401164.634763852},{"$f":"(J29-J21-J35+J35*'Společná data'!$B$22-J41-J37)/POWER(1+'Společná data'!$C$37,J2)","v":83996790.79482457},{"$f":"(K29-K21-K35+K35*'Společná data'!$B$22-K41-K37)/POWER(1+'Společná data'!$C$37,K2)","v":78925474.158225},{"$f":"(L29-L21-L35+L35*'Společná data'!$B$22-L41-L37)/POWER(1+'Společná data'!$C$37,L2)","v":74166442.767632589},{"$f":"(M29-M21-M35+M35*'Společná data'!$B$22-M41-M37)/POWER(1+'Společná data'!$C$37,M2)","v":78056938.060332477},{"$f":"(N29-N21-N35+N35*'Společná data'!$B$22-N41-N37)/POWER(1+'Společná data'!$C$37,N2)","v":63922355.134334199},{"$f":"(O29-O21-O35+O35*'Společná data'!$B$22-O41-O37)/POWER(1+'Společná data'!$C$37,O2)","v":58538048.089581676},{"$f":"(P29-P21-P35+P35*'Společná data'!$B$22-P41-P37)/POWER(1+'Společná data'!$C$37,P2)","v":54946085.612442426},{"$f":"(Q29-Q21-Q35+Q35*'Společná data'!$B$22-Q41-Q37)/POWER(1+'Společná data'!$C$37,Q2)","v":51582238.250053652},{"$f":"(R29-R21-R35+R35*'Společná data'!$B$22-R41-R37)/POWER(1+'Společná data'!$C$37,R2)","v":48431609.399482936},{"$f":"(S29-S21-S35+S35*'Společná data'!$B$22-S41-S37)/POWER(1+'Společná data'!$C$37,S2)","v":45480295.98719383},{"$f":"(T29-T21-T35+T35*'Společná data'!$B$22-T41-T37)/POWER(1+'Společná data'!$C$37,T2)","v":42715321.208760381},{"$f":"(U29-U21-U35+U35*'Společná data'!$B$22-U41-U37)/POWER(1+'Společná data'!$C$37,U2)","v":40124571.866978675},{"$f":"(V29-V21-V35+V35*'Společná data'!$B$22-V41-V37)/POWER(1+'Společná data'!$C$37,V2)","v":37696739.992155008},{"$f":"(W29-W21-W35+W35*'Společná data'!$B$22-W41-W37)/POWER(1+'Společná data'!$C$37,W2)","v":35421268.450156376}]
[]
[null,"Diskontované roční výdaje při lineárních odpisech bez půjčky [Kč]",{"$f":"(C31-C19+C3-C35+C35*'Společná data'!$B$22-C39-C37)/POWER(1+'Společná data'!$C$37,Uhlí!C2)","v":513889636.23240536},{"$f":"(D31-D19+D3-D35+D35*'Společná data'!$B$22-D39-D37)/POWER(1+'Společná data'!$C$37,Uhlí!D2)","v":85570825.195902601},{"$f":"(E31-E19+E3-E35+E35*'Společná data'!$B$22-E39-E37)/POWER(1+'Společná data'!$C$37,Uhlí!E2)","v":76940770.494577631},{"$f":"(F31-F19+F3-F35+F35*'Společná data'!$B$22-F39-F37)/POWER(1+'Společná data'!$C$37,Uhlí!F2)","v":72278632.083747402},{"$f":"(G31-G19+G3-G35+G35*'Společná data'!$B$22-G39-G37)/POWER(1+'Společná data'!$C$37,Uhlí!G2)","v":67912859.412583113},{"$f":"(H31-H19+H3-H35+H35*'Společná data'!$B$22-H39-H37)/POWER(1+'Společná data'!$C$37,Uhlí!H2)","v":63823812.306074761},{"$f":"(I31-I19+I3-I35+I35*'Společná data'!$B$22-I39-I37)/POWER(1+'Společná data'!$C$37,Uhlí!I2)","v":59993196.199416734},{"$f":"(J31-J19+J3-J35+J35*'Společná data'!$B$22-J39-J37)/POWER(1+'Společná data'!$C$37,Uhlí!J2)","v":56403967.620674707},{"$f":"(K31-K19+K3-K35+K35*'Společná data'!$B$22-K39-K37)/POWER(1+'Společná data'!$C$37,Uhlí!K2)","v":53040246.431187466},{"$f":"(L31-L19+L3-L35+L35*'Společná data'!$B$22-L39-L37)/POWER(1+'Společná data'!$C$37,Uhlí!L2)","v":49887234.334632583},{"$f":"(M31-M19+M3-M35+M35*'Společná data'!$B$22-M39-M37)/POWER(1+'Společná data'!$C$37,Uhlí!M2)","v":143294614.3010157},{"$f":"(N31-N19+N3-N35+N35*'Společná data'!$B$22-N39-N37)/POWER(1+'Společná data'!$C$37,Uhlí!N2)","v":54596082.916606888},{"$f":"(O31-O19+O3-O35+O35*'Společná data'!$B$22-O39-O37)/POWER(1+'Společná data'!$C$37,Uhlí!O2)","v":50506223.764087178},{"$f":"(P31-P19+P3-P35+P35*'Společná data'!$B$22-P39-P37)/POWER(1+'Společná data'!$C$37,Uhlí!P2)","v":47404417.328452982},{"$f":"(Q31-Q19+Q3-Q35+Q35*'Společná data'!$B$22-Q39-Q37)/POWER(1+'Společná data'!$C$37,Uhlí!Q2)","v":44502180.664386019},{"$f":"(R31-R19+R3-R35+R35*'Společná data'!$B$22-R39-R37)/POWER(1+'Společná data'!$C$37,Uhlí!R2)","v":41786156.637949504},{"$f":"(S31-S19+S3-S35+S35*'Společná data'!$B$22-S39-S37)/POWER(1+'Společná data'!$C$37,Uhlí!S2)","v":39243910.202519089},{"$f":"(T31-T19+T3-T35+T35*'Společná data'!$B$22-T39-T37)/POWER(1+'Společná data'!$C$37,Uhlí!T2)","v":36863863.275492191},{"$f":"(U31-U19+U3-U35+U35*'Společná data'!$B$22-U39-U37)/POWER(1+'Společná data'!$C$37,Uhlí!U2)","v":34635234.288802654},{"$f":"(V31-V19+V3-V35+V35*'Společná data'!$B$22-V39-V37)/POWER(1+'Společná data'!$C$37,Uhlí!V2)","v":32547982.074123416},{"$f":"(W31-W19+W3-W35+W35*'Společná data'!$B$22-W39-W37)/POWER(1+'Společná data'!$C$37,Uhlí!W2)","v":30592753.768424384}]
[]
[null,"Diskontované roční výdaje při zrychlených odpisech bez půjčky [Kč]",{"$f":"(C33-C21+C3-C35+C35*'Společná data'!$B$22-C41-C37)/POWER(1+'Společná data'!$C$37,Uhlí!C2)","v":513889636.23240536},{"$f":"(D33-D21+D3-D35+D35*'Společná data'!$B$22-D41-D37)/POWER(1+'Společná data'!$C$37,Uhlí!D2)","v":82285408.529235929},{"$f":"(E33-E21+E3-E35+E35*'Společná data'!$B$22-E41-E37)/POWER(1+'Společná data'!$C$37,Uhlí!E2)","v":71870683.04601796},{"$f":"(F33-F21+F3-F35+F35*'Společná data'!$B$22-F41-F37)/POWER(1+'Společná data'!$C$37,Uhlí!F2)","v":68835980.112503171},{"$f":"(G33-G21+G3-G35+G35*'Společná data'!$B$22-G41-G37)/POWER(1+'Společná data'!$C$37,Uhlí!G2)","v":65884360.776328109},{"$f":"(H33-H21+H3-H35+H35*'Společná data'!$B$22-H41-H37)/POWER(1+'Společná data'!$C$37,Uhlí!H2)","v":63018852.529783092},{"$f":"(I33-I21+I3-I35+I35*'Společná data'!$B$22-I41-I37)/POWER(1+'Společná data'!$C$37,Uhlí!I2)","v":60241640.5748154},{"$f":"(J33-J21+J3-J35+J35*'Společná data'!$B$22-J41-J37)/POWER(1+'Společná data'!$C$37,Uhlí!J2)","v":57554173.062335186},{"$f":"(K33-K21+K3-K35+K35*'Společná data'!$B$22-K41-K37)/POWER(1+'Společná data'!$C$37,Uhlí!K2)","v":54957255.500621594},{"$f":"(L33-L21+L3-L35+L35*'Společná data'!$B$22-L41-L37)/POWER(1+'Společná data'!$C$37,Uhlí!L2)","v":52451135.353423096},{"$f":"(M33-M21+M3-M35+M35*'Společná data'!$B$22-M41-M37)/POWER(1+'Společná data'!$C$37,Uhlí!M2)","v":146399052.85653126},{"$f":"(N33-N21+N3-N35+N35*'Společná data'!$B$22-N41-N37)/POWER(1+'Společná data'!$C$37,Uhlí!N2)","v":53899362.711612836},{"$f":"(O33-O21+O3-O35+O35*'Společná data'!$B$22-O41-O37)/POWER(1+'Společná data'!$C$37,Uhlí!O2)","v":49431038.262553155},{"$f":"(P33-P21+P3-P35+P35*'Společná data'!$B$22-P41-P37)/POWER(1+'Společná data'!$C$37,Uhlí!P2)","v":46674353.099016301},{"$f":"(Q33-Q21+Q3-Q35+Q35*'Společná data'!$B$22-Q41-Q37)/POWER(1+'Společná data'!$C$37,Uhlí!Q2)","v":44072008.138623677},{"$f":"(R33-R21+R3-R35+R35*'Společná data'!$B$22-R41-R37)/POWER(1+'Společná data'!$C$37,Uhlí!R2)","v":41615453.254710466},{"$f":"(S33-S21+S3-S35+S35*'Společná data'!$B$22-S41-S37)/POWER(1+'Společná data'!$C$37,Uhlí!S2)","v":39296596.431913853},{"$f":"(T33-T21+T3-T35+T35*'Společná data'!$B$22-T41-T37)/POWER(1+'Společná data'!$C$37,Uhlí!T2)","v":37107781.004171655},{"$f":"(U33-U21+U3-U35+U35*'Společná data'!$B$22-U41-U37)/POWER(1+'Společná data'!$C$37,Uhlí!U2)","v":35041763.836601734},{"$f":"(V33-V21+V3-V35+V35*'Společná data'!$B$22-V41-V37)/POWER(1+'Společná data'!$C$37,Uhlí!V2)","v":33091694.43229093},{"$f":"(W33-W21+W3-W35+W35*'Společná data'!$B$22-W41-W37)/POWER(1+'Společná data'!$C$37,Uhlí!W2)","v":31251094.942843731}]
[]
[null,"Výsledky"]
[null,"S půjčkou"]
[null,"Bilance při lineárních odpisech [Kč]",{"$f":"SUM(C43:W43)","v":1537806444.0387228}]
[]
[null,"Bilance při zrychlených odpisech [Kč]",{"$f":"SUM(C45:W45)","v":1530961169.1939991}]
[null,"Bez půjčky"]
[null,"Bilance při lineárních odpisech bez půjčky [Kč]",{"$f":"SUM(C47:W47)","v":1655714599.5330625}]
[]
[null,"Bilance při zrychlených odpisech bez půjčky [Kč]",{"$f":"SUM(C49:W49)","v":1648869324.6883383}]

{"sheet":"Plyn","index":3,"n_rows":49,"n_cols":23,"rows_kept":49,"cut":false,"hidden":false,"merged":[[40,1,40,2],[41,1,41,2]]}
[]
[null,null,0,1,2,3,4,5,6,7,8,9,10,11,12,13,14,15,16,17,18,19,20]
[null,"Investice [Kč]",600000000,0,0,0,0,0,0,0,0,0,0,0,0,0,0,0,0,0,0,0,0]
[]
[null,"Cena plynu [Kč/m3]",{"$f":"'Společná data'!$B$17","v":7.6},{"$f":"'Společná data'!$B$17","v":7.6},{"$f":"'Společná data'!$B$17","v":7.6},{"$f":"'Společná data'!$B$17","v":7.6},{"$f":"'Společná data'!$B$17","v":7.6},{"$f":"'Společná data'!$B$17","v":7.6},{"$f":"'Společná data'!$B$17","v":7.6},{"$f":"'Společná data'!$B$17","v":7.6},{"$f":"'Společná data'!$B$17","v":7.6},{"$f":"'Společná data'!$B$17","v":7.6},{"$f":"C5+3.372","v":10.972},{"$f":"D5+3.372","v":10.972},10.972,10.972,10.972,10.972,10.972,10.972,10.972,10.972,{"$f":"M5","v":10.972}]
[null,"Množství spáleného plynu [m3]",{"$f":"'Společná data'!$B$3/('Společná data'!$B$16*'Společná data'!$B$15)","v":23312736.318959463},{"$f":"'Společná data'!$B$3/('Společná data'!$B$16*'Společná data'!$B$15)","v":23312736.318959463},{"$f":"'Společná data'!$B$3/('Společná data'!$B$16*'Společná data'!$B$15)","v":23312736.318959463},{"$f":"'Společná data'!$B$3/('Společná data'!$B$16*'Společná data'!$B$15)","v":23312736.318959463},{"$f":"'Společná data'!$B$3/('Společná data'!$B$16*'Společná data'!$B$15)","v":23312736.318959463},{"$f":"'Společná data'!$B$3/('Společná data'!$B$16*'Společná data'!$B$15)","v":23312736.318959463},{"$f":"'Společná data'!$B$3/('Společná data'!$B$16*'Společná data'!$B$15)","v":23312736.318959463},{"$f":"'Společná data'!$B$3/('Společná data'!$B$16*'Společná data'!$B$15)","v":23312736.318959463},{"$f":"'Společná data'!$B$3/('Společná data'!$B$16*'Společná data'!$B$15)","v":23312736.318959463},{"$f":"'Společná data'!$B$3/('Společná data'!$B$16*'Společná data'!$B$15)","v":23312736.318959463},{"$f":"'Společná data'!$B$3/('Společná data'!$B$16*'Společná data'!$B$15)","v":23312736.318959463},{"$f":"'Společná data'!$B$3/('Společná data'!$B$16*'Společná data'!$B$15)","v":23312736.318959463},{"$f":"'Společná data'!$B$3/('Společná data'!$B$16*'Společná data'!$B$15)","v":23312736.318959463},{"$f":"'Společná data'!$B$3/('Společná data'!$B$16*'Společná data'!$B$15)","v":23312736.318959463},{"$f":"'Společná data'!$B$3/('Společná data'!$B$16*'Společná data'!$B$15)","v":23312736.318959463},{"$f":"'Společná data'!$B$3/('Společná data'!$B$16*'Společná data'!$B$15)","v":23312736.318959463},{"$f":"'Společná data'!$B$3/('Společná data'!$B$16*'Společná data'!$B$15)","v":23312736.318959463},{"$f":"'Společná data'!$B$3/('Společná data'!$B$16*'Společná data'!$B$15)","v":23312736.318959463},{"$f":"'Společná data'!$B$3/('Společná data'!$B$16*'Společná data'!$B$15)","v":23312736.318959463},{"$f":"'Společná data'!$B$3/('Společná data'!$B$16*'Společná data'!$B$15)","v":23312736.318959463},{"$f":"'Společná data'!$B$3/('Společná data'!$B$16*'Společná data'!$B$15)","v":23312736.318959463}]
[null,"Cena odebraného plynu [Kč]",{"$f":"C6*C5","v":177176796.0240919},{"$f":"D6*D5","v":177176796.0240919},177176796.0240919,177176796.0240919,177176796.0240919,177176796.0240919,177176796.0240919,177176796.0240919,177176796.0240919,177176796.0240919,255787342.89162323,255787342.89162323,255787342.89162323,255787342.89162323,255787342.89162323,255787342.89162323,255787342.89162323,255787342.89162323,255787342.89162323,255787342.89162323,255787342.89162323]
[]
[null,"Cena použitých emisních povolenek [Kč]",{"$f":"'Společná data'!$B$3*'Společná data'!$B$18*HLOOKUP(Plyn!C2,'Společná data'!$B$44:$V$46,3,0)","v":29106521.104121998},{"$f":"'Společná data'!$B$3*'Společná data'!$B$18*HLOOKUP(Plyn!D2,'Společná data'!$B$44:$V$46,3,0)","v":26777999.415792238},{"$f":"'Společná data'!$B$3*'Společná data'!$B$18*HLOOKUP(Plyn!E2,'Společná data'!$B$44:$V$46,3,0)","v":27554561.39885021},{"$f":"'Společná data'!$B$3*'Společná data'!$B$18*HLOOKUP(Plyn!F2,'Společná data'!$B$44:$V$46,3,0)","v":28353643.679416865},{"$f":"'Společná data'!$B$3*'Společná data'!$B$18*HLOOKUP(Plyn!G2,'Společná data'!$B$44:$V$46,3,0)","v":29175899.346119951},{"$f":"'Společná data'!$B$3*'Společná data'!$B$18*HLOOKUP(Plyn!H2,'Společná data'!$B$44:$V$46,3,0)","v":30022000.427157428},{"$f":"'Společná data'!$B$3*'Společná data'!$B$18*HLOOKUP(Plyn!I2,'Společná data'!$B$44:$V$46,3,0)","v":30892638.439544991},{"$f":"'Společná data'!$B$3*'Společná data'!$B$18*HLOOKUP(Plyn!J2,'Společná data'!$B$44:$V$46,3,0)","v":31788524.954291791},{"$f":"'Společná data'!$B$3*'Společná data'!$B$18*HLOOKUP(Plyn!K2,'Společná data'!$B$44:$V$46,3,0)","v":32710392.177966248},{"$f":"'Společná data'!$B$3*'Společná data'!$B$18*HLOOKUP(Plyn!L2,'Společná data'!$B$44:$V$46,3,0)","v":33658993.55112727},{"$f":"'Společná data'!$B$3*'Společná data'!$B$18*HLOOKUP(Plyn!M2,'Společná data'!$B$44:$V$46,3,0)","v":34635104.364109956},{"$f":"'Společná data'!$B$3*'Společná data'!$B$18*HLOOKUP(Plyn!N2,'Společná data'!$B$44:$V$46,3,0)","v":35639522.390669145},{"$f":"'Společná data'!$B$3*'Společná data'!$B$18*HLOOKUP(Plyn!O2,'Společná data'!$B$44:$V$46,3,0)","v":36673068.539998546},{"$f":"'Společná data'!$B$3*'Společná data'!$B$18*HLOOKUP(Plyn!P2,'Společná data'!$B$44:$V$46,3,0)","v":37736587.5276585},{"$f":"'Společná data'!$B$3*'Společná data'!$B$18*HLOOKUP(Plyn!Q2,'Společná data'!$B$44:$V$46,3,0)","v":38830948.565960586},{"$f":"'Společná data'!$B$3*'Společná data'!$B$18*HLOOKUP(Plyn!R2,'Společná data'!$B$44:$V$46,3,0)","v":39957046.074373439},{"$f":"'Společná data'!$B$3*'Společná data'!$B$18*HLOOKUP(Plyn!S2,'Společná data'!$B$44:$V$46,3,0)","v":41115800.410530262},{"$f":"'Společná data'!$B$3*'Společná data'!$B$18*HLOOKUP(Plyn!T2,'Společná data'!$B$44:$V$46,3,0)","v":42308158.622435629},{"$f":"'Společná data'!$B$3*'Společná data'!$B$18*HLOOKUP(Plyn!U2,'Společná data'!$B$44:$V$46,3,0)","v":43535095.222486258},{"$f":"'Společná data'!$B$3*'Společná data'!$B$18*HLOOKUP(Plyn!V2,'Společná data'!$B$44:$V$46,3,0)","v":44797612.983938359},{"$f":"'Společná data'!$B$3*'Společná data'!$B$18*HLOOKUP(Plyn!W2,'Společná data'!$B$44:$V$46,3,0)","v":46096743.760472558}]
[]
[null,"Údržba [Kč]",{"$f":"1000000","v":1000000},{"$f":"C11*(1+'Společná data'!$C$47)","v":1028999.9999999999},{"$f":"D11*(1+'Společná data'!$C$47)","v":1058840.9999999998},{"$f":"E11*(1+'Společná data'!$C$47)","v":1089547.3889999997},{"$f":"F11*(1+'Společná data'!$C$47)","v":1121144.2632809996},{"$f":"G11*(1+'Společná data'!$C$47)","v":1153657.4469161485},{"$f":"H11*(1+'Společná data'!$C$47)","v":1187113.5128767167},{"$f":"I11*(1+'Společná data'!$C$47)","v":1221539.8047501415},{"$f":"J11*(1+'Společná data'!$C$47)","v":1256964.4590878955},{"$f":"K11*(1+'Společná data'!$C$47)","v":1293416.4284014443},{"$f":"L11*(1+'Společná data'!$C$47)","v":1330925.5048250861},{"$f":"M11*(1+'Společná data'!$C$47)","v":1369522.3444650136},{"$f":"N11*(1+'Společná data'!$C$47)","v":1409238.4924544988},{"$f":"O11*(1+'Společná data'!$C$47)","v":1450106.4087356792},{"$f":"P11*(1+'Společná data'!$C$47)","v":1492159.4945890137},{"$f":"Q11*(1+'Společná data'!$C$47)","v":1535432.1199320951},{"$f":"R11*(1+'Společná data'!$C$47)","v":1579959.6514101257},{"$f":"S11*(1+'Společná data'!$C$47)","v":1625778.4813010192},{"$f":"T11*(1+'Společná data'!$C$47)","v":1672926.0572587487},{"$f":"U11*(1+'Společná data'!$C$47)","v":1721440.9129192522},{"$f":"V11*(1+'Společná data'!$C$47)","v":1771362.6993939104}]
[]
[null,"Výše lineárního odpisu [Kč]",0,{"$f":"IF(D2=1,0.055,0.105)*$C$3","v":33000000},63000000,63000000,63000000,63000000,63000000,63000000,63000000,63000000,63000000,{"$f":"IF(N2=11,0.055,0.105)*$M$3","v":0},0,0,0,0,0,0,0,0,0]
[]
[null,"Výše zrychleného odpisu [Kč]",0,{"$f":"IF(D2=1,$C$3/10,(($C$3-(SUM($C$15:C15)))*2)/('Společná data'!$B$19+1-C2))","v":60000000},{"$f":"IF(E2=1,$C$3/10,(($C$3-(SUM($C$15:D15)))*2)/('Společná data'!$B$19+1-D2))","v":108000000},{"$f":"IF(F2=1,$C$3/10,(($C$3-(SUM($C$15:E15)))*2)/('Společná data'!$B$19+1-E2))","v":96000000},{"$f":"IF(G2=1,$C$3/10,(($C$3-(SUM($C$15:F15)))*2)/('Společná data'!$B$19+1-F2))","v":84000000},{"$f":"IF(H2=1,$C$3/10,(($C$3-(SUM($C$15:G15)))*2)/('Společná data'!$B$19+1-G2))","v":72000000},{"$f":"IF(I2=1,$C$3/10,(($C$3-(SUM($C$15:H15)))*2)/('Společná data'!$B$19+1-H2))","v":60000000},{"$f":"IF(J2=1,$C$3/10,(($C$3-(SUM($C$15:I15)))*2)/('Společná data'!$B$19+1-I2))","v":48000000},{"$f":"IF(K2=1,$C$3/10,(($C$3-(SUM($C$15:J15)))*2)/('Společná data'!$B$19+1-J2))","v":36000000},{"$f":"IF(L2=1,$C$3/10,(($C$3-(SUM($C$15:K15)))*2)/('Společná data'!$B$19+1-K2))","v":24000000},{"$f":"IF(M2=1,$C$3/10,(($C$3-(SUM($C$15:L15)))*2)/('Společná data'!$B$19+1-L2))","v":12000000},{"$f":"IF(N2=11,$M$3/10,(($M$3-(SUM($N$15:N15)))*2)/('Společná data'!$B$19+1-C2))","v":0},{"$f":"IF(O2=11,$M$3/10,(($M$3-(SUM($N$15:N15)))*2)/('Společná data'!$B$19+1-D2))","v":0},{"$f":"IF(P2=11,$M$3/10,(($M$3-(SUM($N$15:O15)))*2)/('Společná data'!$B$19+1-E2))","v":0},{"$f":"IF(Q2=11,$M$3/10,(($M$3-(SUM($N$15:P15)))*2)/('Společná data'!$B$19+1-F2))","v":0},{"$f":"IF(R2=11,$M$3/10,(($M$3-(SUM($N$15:Q15)))*2)/('Společná data'!$B$19+1-G2))","v":0},{"$f":"IF(S2=11,$M$3/10,(($M$3-(SUM($N$15:R15)))*2)/('Společná data'!$B$19+1-H2))","v":0},{"$f":"IF(T2=11,$M$3/10,(($M$3-(SUM($N$15:S15)))*2)/('Společná data'!$B$19+1-I2))","v":0},{"$f":"IF(U2=11,$M$3/10,(($M$3-(SUM($N$15:T15)))*2)/('Společná data'!$B$19+1-J2))","v":0},{"$f":"IF(V2=11,$M$3/10,(($M$3-(SUM($N$15:U15)))*2)/('Společná data'!$B$19+1-K2))","v":0},{"$f":"IF(W2=11,$M$3/10,(($M$3-(SUM($N$15:V15)))*2)/('Společná data'!$B$19+1-L2))","v":0}]
[]
[null,"Úmor [Kč]",0,{"$f":"$C$3/'Společná data'!$B$21","v":60000000},{"$f":"$C$3/'Společná data'!$B$21","v":60000000},{"$f":"$C$3/'Společná data'!$B$21","v":60000000},{"$f":"$C$3/'Společná data'!$B$21","v":60000000},{"$f":"$C$3/'Společná data'!$B$21","v":60000000},{"$f":"$C$3/'Společná data'!$B$21","v":60000000},{"$f":"$C$3/'Společná data'!$B$21","v":60000000},{"$f":"$C$3/'Společná data'!$B$21","v":60000000},{"$f":"$C$3/'Společná data'!$B$21","v":60000000},{"$f":"$C$3/'Společná data'!$B$21","v":60000000},{"$f":"$M$3/'Společná data'!$B$21","v":0},{"$f":"$M$3/'Společná data'!$B$21","v":0},{"$f":"$M$3/'Společná data'!$B$21","v":0},{"$f":"$M$3/'Společná data'!$B$21","v":0},{"$f":"$M$3/'Společná data'!$B$21","v":0},{"$f":"$M$3/'Společná data'!$B$21","v":0},{"$f":"$M$3/'Společná data'!$B$21","v":0},{"$f":"$M$3/'Společná data'!$B$21","v":0},{"$f":"$M$3/'Společná data'!$B$21","v":0},{"$f":"$M$3/'Společná data'!$B$21","v":0}]
[]
[null,"Úrok [Kč]",0,{"$f":"($C$3-SUM($C$17:C17))*'Společná data'!$B$20","v":13800000},{"$f":"($C$3-SUM($C$17:D17))*'Společná data'!$B$20","v":12420000},{"$f":"($C$3-SUM($C$17:E17))*'Společná data'!$B$20","v":11040000},{"$f":"($C$3-SUM($C$17:F17))*'Společná data'!$B$20","v":9660000},{"$f":"($C$3-SUM($C$17:G17))*'Společná data'!$B$20","v":8280000},{"$f":"($C$3-SUM($C$17:H17))*'Společná data'!$B$20","v":6900000},{"$f":"($C$3-SUM($C$17:I17))*'Společná data'!$B$20","v":5520000},{"$f":"($C$3-SUM($C$17:J17))*'Společná data'!$B$20","v":4140000},{"$f":"($C$3-SUM($C$17:K17))*'Společná data'!$B$20","v":2760000},{"$f":"($C$3-SUM($C$17:L17))*'Společná data'!$B$20","v":1380000},{"$f":"($M$3)*'Společná data'!$B$20","v":0},{"$f":"($M$3-SUM($N$17:N17))*'Společná data'!$B$20","v":0},{"$f":"($M$3-SUM($N$17:O17))*'Společná data'!$B$20","v":0},{"$f":"($M$3-SUM($N$17:P17))*'Společná data'!$B$20","v":0},{"$f":"($M$3-SUM($N$17:Q17))*'Společná data'!$B$20","v":0},{"$f":"($M$3-SUM($N$17:R17))*'Společná data'!$B$20","v":0},{"$f":"($M$3-SUM($N$17:S17))*'Společná data'!$B$20","v":0},{"$f":"($M$3-SUM($N$17:T17))*'Společná data'!$B$20","v":0},{"$f":"($M$3-SUM($N$17:U17))*'Společná data'!$B$20","v":0},{"$f":"($M$3-SUM($N$17:V17))*'Společná data'!$B$20","v":0}]
[]
[null,"Náklady při lineárních odpisech [Kč]",{"$f":"SUM(C7,C9,C11,C13,C17,C19)","v":207283317.12821388},{"$f":"SUM(D7,D9,D11,D13,D17,D19)","v":311783795.43988413},{"$f":"SUM(E7,E9,E11,E13,E17,E19)","v":341210198.4229421},340659987.09250879,340133839.63349283,339632453.89816546,339156547.97651362,338706860.78313386,338284152.66114604,337889206.00362062,416133372.76055831,292796387.62675738,293869649.92407626,294974036.82801741,296110450.95217282,297279821.0859288,298483102.95356357,299721279.99535984,300995364.17136824,302306396.78848082,303655449.35148972]
[]
[null,"Náklady při zrychlených odpisech [Kč]",{"$f":"SUM(C7,C9,C11,C15,C17,C19)","v":207283317.12821388},{"$f":"SUM(D7,D9,D11,D15,D17,D19)","v":338783795.43988413},386210198.4229421,373659987.09250879,361133839.63349283,348632453.89816546,336156547.97651362,323706860.78313386,311284152.66114604,298889206.00362062,365133372.76055831,292796387.62675738,293869649.92407626,294974036.82801741,296110450.95217282,297279821.0859288,298483102.95356357,299721279.99535984,300995364.17136824,302306396.78848082,303655449.35148972]
[]
[null,"Náklady při lineárních odpisech bez půjčky [Kč]",{"$f":"C21-C19-C17","v":207283317.12821388},{"$f":"D21-D19-D17","v":237983795.43988413},268790198.4229421,269619987.09250879,270473839.63349283,271352453.89816546,272256547.97651362,273186860.78313386,274144152.66114604,275129206.00362062,354753372.76055831,292796387.62675738,293869649.92407626,294974036.82801741,296110450.95217282,297279821.0859288,298483102.95356357,299721279.99535984,300995364.17136824,302306396.78848082,303655449.35148972]
[]
[null,"Náklady při zrychlených odpisech bez půjčky [Kč]",{"$f":"C23-C19-C17","v":207283317.12821388},{"$f":"D23-D19-D17","v":264983795.43988413},313790198.4229421,302619987.09250879,291473839.63349283,280352453.89816546,269256547.97651362,258186860.78313386,247144152.66114604,236129206.00362062,303753372.76055831,292796387.62675738,293869649.92407626,294974036.82801741,296110450.95217282,297279821.0859288,298483102.95356357,299721279.99535984,300995364.17136824,302306396.78848082,303655449.35148972]
[]
[null,"Daňový štít při lineárních odpisech [Kč]",{"$f":"C13*'Společná data'!$B$22","v":0},{"$f":"D13*'Společná data'!$B$22","v":6270000},{"$f":"E13*'Společná data'!$B$22","v":11970000},{"$f":"F13*'Společná data'!$B$22","v":11970000},{"$f":"G13*'Společná data'!$B$22","v":11970000},{"$f":"H13*'Společná data'!$B$22","v":11970000},{"$f":"I13*'Společná data'!$B$22","v":11970000},{"$f":"J13*'Společná data'!$B$22","v":11970000},{"$f":"K13*'Společná data'!$B$22","v":11970000},{"$f":"L13*'Společná data'!$B$22","v":11970000},{"$f":"M13*'Společná data'!$B$22","v":11970000},{"$f":"N13*'Společná data'!$B$22","v":0},{"$f":"O13*'Společná data'!$B$22","v":0},{"$f":"P13*'Společná data'!$B$22","v":0},{"$f":"Q13*'Společná data'!$B$22","v":0},{"$f":"R13*'Společná data'!$B$22","v":0},{"$f":"S13*'Společná data'!$B$22","v":0},{"$f":"T13*'Společná data'!$B$22","v":0},{"$f":"U13*'Společná data'!$B$22","v":0},{"$f":"V13*'Společná data'!$B$22","v":0},{"$f":"W13*'Společná data'!$B$22","v":0}]
[]
[null,"Daňový štít při zrychlených odpisech [Kč]",{"$f":"C15*'Společná data'!$B$22","v":0},{"$f":"D15*'Společná data'!$B$22","v":11400000},{"$f":"E15*'Společná data'!$B$22","v":20520000},{"$f":"F15*'Společná data'!$B$22","v":18240000},{"$f":"G15*'Společná data'!$B$22","v":15960000},{"$f":"H15*'Společná data'!$B$22","v":13680000},{"$f":"I15*'Společná data'!$B$22","v":11400000},{"$f":"J15*'Společná data'!$B$22","v":9120000},{"$f":"K15*'Společná data'!$B$22","v":6840000},{"$f":"L15*'Společná data'!$B$22","v":4560000},{"$f":"M15*'Společná data'!$B$22","v":2280000},{"$f":"N15*'Společná data'!$B$22","v":0},{"$f":"O15*'Společná data'!$B$22","v":0},{"$f":"P15*'Společná data'!$B$22","v":0},{"$f":"Q15*'Společná data'!$B$22","v":0},{"$f":"R15*'Společná data'!$B$22","v":0},{"$f":"S15*'Společná data'!$B$22","v":0},{"$f":"T15*'Společná data'!$B$22","v":0},{"$f":"U15*'Společná data'!$B$22","v":0},{"$f":"V15*'Společná data'!$B$22","v":0},{"$f":"W15*'Společná data'!$B$22","v":0}]
[]
[null,"Diskontované roční výdaje při lineárním odpisování s půjčkou [Kč]",{"$f":"(C21-C13-C29)/(POWER(1+'Společná data'!$C$37,Plyn!C2))","v":207283317.12821388},{"$f":"(D21-D13-D29)/(POWER(1+'Společná data'!$C$37,Plyn!D2))","v":252327588.37026307},{"$f":"(E21-E13-E29)/(POWER(1+'Společná data'!$C$37,Plyn!E2))","v":228258057.63283786},{"$f":"(F21-F13-F29)/(POWER(1+'Společná data'!$C$37,Plyn!F2))","v":210913277.8702662},{"$f":"(G21-G13-G29)/(POWER(1+'Společná data'!$C$37,Plyn!G2))","v":194903338.01274857},{"$f":"(H21-H13-H29)/(POWER(1+'Společná data'!$C$37,Plyn!H2))","v":180124819.00881171},{"$f":"(I21-I13-I29)/(POWER(1+'Společná data'!$C$37,Plyn!I2))","v":166482338.365895},{"$f":"(J21-J13-J29)/(POWER(1+'Společná data'!$C$37,Plyn!J2))","v":153887925.14354515},{"$f":"(K21-K13-K29)/(POWER(1+'Společná data'!$C$37,Plyn!K2))","v":142260443.53182033},{"$f":"(L21-L13-L29)/(POWER(1+'Společná data'!$C$37,Plyn!L2))","v":131525061.24233451},{"$f":"(M21-M13-M29)/(POWER(1+'Společná data'!$C$37,Plyn!M2))","v":158024652.63569835},{"$f":"(N21-N13-N29)/(POWER(1+'Společná data'!$C$37,Plyn!N2))","v":125575351.92910467},{"$f":"(O21-O13-O29)/(POWER(1+'Společná data'!$C$37,Plyn!O2))","v":116699681.23333156},{"$f":"(P21-P13-P29)/(POWER(1+'Společná data'!$C$37,Plyn!P2))","v":108461341.17384727},{"$f":"(Q21-Q13-Q29)/(POWER(1+'Společná data'!$C$37,Plyn!Q2))","v":100814072.48969202},{"$f":"(R21-R13-R29)/(POWER(1+'Společná data'!$C$37,Plyn!R2))","v":93714997.651082918},{"$f":"(S21-S13-S29)/(POWER(1+'Společná data'!$C$37,Plyn!S2))","v":87124372.480176523},{"$f":"(T21-T13-T29)/(POWER(1+'Společná data'!$C$37,Plyn!T2))","v":81005356.070212722},{"$f":"(U21-U13-U29)/(POWER(1+'Společná data'!$C$37,Plyn!U2))","v":75323797.652329311},{"$f":"(V21-V13-V29)/(POWER(1+'Společná data'!$C$37,Plyn!V2))","v":70048039.159167826},{"$f":"(W21-W13-W29)/(POWER(1+'Společná data'!$C$37,Plyn!W2))","v":65148732.326835401}]
[]
[null,"Diskontované roční výdaje při zrychleném odpisování s půjčkou [Kč]",{"$f":"(C23-C15-C31)/(POWER(1+'Společná data'!$C$37,Plyn!C2))","v":207283317.12821388},{"$f":"(D23-D15-D31)/(POWER(1+'Společná data'!$C$37,Plyn!D2))","v":247577588.37026307},{"$f":"(E23-E15-E31)/(POWER(1+'Společná data'!$C$37,Plyn!E2))","v":220927810.71925762},{"$f":"(F23-F15-F31)/(POWER(1+'Společná data'!$C$37,Plyn!F2))","v":205935949.71906972},{"$f":"(G23-G15-G31)/(POWER(1+'Společná data'!$C$37,Plyn!G2))","v":191970568.90009072},{"$f":"(H23-H15-H31)/(POWER(1+'Společná data'!$C$37,Plyn!H2))","v":178961021.74188399},{"$f":"(I23-I15-I31)/(POWER(1+'Společná data'!$C$37,Plyn!I2))","v":166841535.05321836},{"$f":"(J23-J15-J31)/(POWER(1+'Společná data'!$C$37,Plyn!J2))","v":155550872.77004221},{"$f":"(K23-K15-K31)/(POWER(1+'Společná data'!$C$37,Plyn!K2))","v":145032022.90931547},{"$f":"(L23-L15-L31)/(POWER(1+'Společná data'!$C$37,Plyn!L2))","v":135231906.08877861},{"$f":"(M23-M15-M31)/(POWER(1+'Společná data'!$C$37,Plyn!M2))","v":162512997.53523895},{"$f":"(N23-N15-N31)/(POWER(1+'Společná data'!$C$37,Plyn!N2))","v":125575351.92910467},{"$f":"(O23-O15-O31)/(POWER(1+'Společná data'!$C$37,Plyn!O2))","v":116699681.23333156},{"$f":"(P23-P15-P31)/(POWER(1+'Společná data'!$C$37,Plyn!P2))","v":108461341.17384727},{"$f":"(Q23-Q15-Q31)/(POWER(1+'Společná data'!$C$37,Plyn!Q2))","v":100814072.48969202},{"$f":"(R23-R15-R31)/(POWER(1+'Společná data'!$C$37,Plyn!R2))","v":93714997.651082918},{"$f":"(S23-S15-S31)/(POWER(1+'Společná data'!$C$37,Plyn!S2))","v":87124372.480176523},{"$f":"(T23-T15-T31)/(POWER(1+'Společná data'!$C$37,Plyn!T2))","v":81005356.070212722},{"$f":"(U23-U15-U31)/(POWER(1+'Společná data'!$C$37,Plyn!U2))","v":75323797.652329311},{"$f":"(V23-V15-V31)/(POWER(1+'Společná data'!$C$37,Plyn!V2))","v":70048039.159167826},{"$f":"(W23-W15-W31)/(POWER(1+'Společná data'!$C$37,Plyn!W2))","v":65148732.326835401}]
[]
[null,"Diskontované roční výdaje při lineárním odpisování bez půjčky [Kč]",{"$f":"(C25-C13+C3-C29)/POWER(1+'Společná data'!$C$37,Plyn!C2)","v":807283317.12821388},{"$f":"(D25-D13+D3-D29)/POWER(1+'Společná data'!$C$37,Plyn!D2)","v":183994255.03692973},{"$f":"(E25-E13+E3-E29)/POWER(1+'Společná data'!$C$37,Plyn!E2)","v":166169580.26658273},{"$f":"(F25-F13+F3-F29)/POWER(1+'Společná data'!$C$37,Plyn!F2)","v":154519435.46819335},{"$f":"(G25-G13+G3-G29)/POWER(1+'Společná data'!$C$37,Plyn!G2)","v":143701158.46694764},{"$f":"(H25-H13+H3-H29)/POWER(1+'Společná data'!$C$37,Plyn!H2)","v":133654598.31534706},{"$f":"(I25-I13+I3-I29)/POWER(1+'Společná data'!$C$37,Plyn!I2)","v":124323990.3274153},{"$f":"(J25-J13+J3-J29)/POWER(1+'Společná data'!$C$37,Plyn!J2)","v":115657634.44597013},{"$f":"(K25-K13+K3-K29)/POWER(1+'Společná data'!$C$37,Plyn!K2)","v":107607597.2798636},{"$f":"(L25-L13+L3-L29)/POWER(1+'Společná data'!$C$37,Plyn!L2)","v":100129436.06516415},{"$f":"(M25-M13+M3-M29)/POWER(1+'Společná data'!$C$37,Plyn!M2)","v":129593836.33706044},{"$f":"(N25-N13+N3-N29)/POWER(1+'Společná data'!$C$37,Plyn!N2)","v":125575351.92910467},{"$f":"(O25-O13+O3-O29)/POWER(1+'Společná data'!$C$37,Plyn!O2)","v":116699681.23333156},{"$f":"(P25-P13+P3-P29)/POWER(1+'Společná data'!$C$37,Plyn!P2)","v":108461341.17384727},{"$f":"(Q25-Q13+Q3-Q29)/POWER(1+'Společná data'!$C$37,Plyn!Q2)","v":100814072.48969202},{"$f":"(R25-R13+R3-R29)/POWER(1+'Společná data'!$C$37,Plyn!R2)","v":93714997.651082918},{"$f":"(S25-S13+S3-S29)/POWER(1+'Společná data'!$C$37,Plyn!S2)","v":87124372.480176523},{"$f":"(T25-T13+T3-T29)/POWER(1+'Společná data'!$C$37,Plyn!T2)","v":81005356.070212722},{"$f":"(U25-U13+U3-U29)/POWER(1+'Společná data'!$C$37,Plyn!U2)","v":75323797.652329311},{"$f":"(V25-V13+V3-V29)/POWER(1+'Společná data'!$C$37,Plyn!V2)","v":70048039.159167826},{"$f":"(W25-W13+W3-W29)/POWER(1+'Společná data'!$C$37,Plyn!W2)","v":65148732.326835401}]
[]
[null,"Diskontované roční výdaje bez půjčky [Kč]",{"$f":"(C27-C15+C3-C31)/POWER(1+'Společná data'!$C$37,Plyn!C2)","v":807283317.12821388},{"$f":"(D27-D15+D3-D31)/POWER(1+'Společná data'!$C$37,Plyn!D2)","v":179244255.03692973},{"$f":"(E27-E15+E3-E31)/POWER(1+'Společná data'!$C$37,Plyn!E2)","v":158839333.35300249},{"$f":"(F27-F15+F3-F31)/POWER(1+'Společná data'!$C$37,Plyn!F2)","v":149542107.31699687},{"$f":"(G27-G15+G3-G31)/POWER(1+'Společná data'!$C$37,Plyn!G2)","v":140768389.3542898},{"$f":"(H27-H15+H3-H31)/POWER(1+'Společná data'!$C$37,Plyn!H2)","v":132490801.04841934},{"$f":"(I27-I15+I3-I31)/POWER(1+'Společná data'!$C$37,Plyn!I2)","v":124683187.01473866},{"$f":"(J27-J15+J3-J31)/POWER(1+'Společná data'!$C$37,Plyn!J2)","v":117320582.07246721},{"$f":"(K27-K15+K3-K31)/POWER(1+'Společná data'!$C$37,Plyn!K2)","v":110379176.65735874},{"$f":"(L27-L15+L3-L31)/POWER(1+'Společná data'!$C$37,Plyn!L2)","v":103836280.91160826},{"$f":"(M27-M15+M3-M31)/POWER(1+'Společná data'!$C$37,Plyn!M2)","v":134082181.23660102},{"$f":"(N27-N15+N3-N31)/POWER(1+'Společná data'!$C$37,Plyn!N2)","v":125575351.92910467},{"$f":"(O27-O15+O3-O31)/POWER(1+'Společná data'!$C$37,Plyn!O2)","v":116699681.23333156},{"$f":"(P27-P15+P3-P31)/POWER(1+'Společná data'!$C$37,Plyn!P2)","v":108461341.17384727},{"$f":"(Q27-Q15+Q3-Q31)/POWER(1+'Společná data'!$C$37,Plyn!Q2)","v":100814072.48969202},{"$f":"(R27-R15+R3-R31)/POWER(1+'Společná data'!$C$37,Plyn!R2)","v":93714997.651082918},{"$f":"(S27-S15+S3-S31)/POWER(1+'Společná data'!$C$37,Plyn!S2)","v":87124372.480176523},{"$f":"(T27-T15+T3-T31)/POWER(1+'Společná data'!$C$37,Plyn!T2)","v":81005356.070212722},{"$f":"(U27-U15+U3-U31)/POWER(1+'Společná data'!$C$37,Plyn!U2)","v":75323797.652329311},{"$f":"(V27-V15+V3-V31)/POWER(1+'Společná data'!$C$37,Plyn!V2)","v":70048039.159167826},{"$f":"(W27-W15+W3-W31)/POWER(1+'Společná data'!$C$37,Plyn!W2)","v":65148732.326835401}]
[]
[null,"Výsledky"]
[null,"S půjčkou"]
[null,"Bilance při lineárních odpisech [Kč]",{"$f":"SUM(C33:W33)","v":2949906561.1082158}]
[]
[null,"Bilance při zrychlených odpisech [Kč]",{"$f":"SUM(C35:W35)","v":2941741333.1011534}]
[null,"Bez půjčky"]
[null,"Bilance při lineárních odpisech bez půjčky [Kč]",{"$f":"SUM(C37:W37)","v":3090550581.3034687}]
[]
[null,"Bilance při zrychlených odpisech bez půjčky [Kč]",{"$f":"SUM(C39:W39)","v":3082385353.2964063}]

{"sheet":"Zdroj","index":4,"n_rows":12,"n_cols":4,"rows_kept":12,"cut":false,"hidden":false,"merged":[]}
["NPV","Uhlí","Biomasa","Plyn"]
["Lineární odpisy s půjčkou",{"$f":"Uhlí!C47/1000000","v":1437.9905412704898},{"$f":"Biomasa!C53/1000000","v":1537.8064440387227},{"$f":"Plyn!C43/1000000","v":2949.906561108216}]
["Zrychlené odpisy s půjčkou",{"$f":"Uhlí!C49/1000000","v":1431.4124317999685},{"$f":"Biomasa!C55/1000000","v":1530.961169193999},{"$f":"Plyn!C45/1000000","v":2941.7413331011535}]
["Lineární odpisy",{"$f":"Uhlí!C51/1000000","v":1551.2968396884057},{"$f":"Biomasa!C57/1000000","v":1655.7145995330625},{"$f":"Plyn!C47/1000000","v":3090.5505813034688}]
["Zrychlené odpisy",{"$f":"Uhlí!C53/1000000","v":1544.7187302178852},{"$f":"Biomasa!C59/1000000","v":1648.8693246883383},{"$f":"Plyn!C49/1000000","v":3082.3853532964063}]
[]
["Počátek",0]
["Konec",0.2]
[]
["Hodnota2"]
["Počátek"]
["Konec"]

{"sheet":"Citlivostní analýza","index":5,"n_rows":37,"n_cols":101,"rows_kept":37,"cut":false,"hidden":false,"merged":[]}
["Poměr spalování"]
["Výše inflace [%]",2E-3,4.0000000000000001E-3,6.0000000000000001E-3,8.0000000000000002E-3,0.01,1.2E-2,1.4E-2,1.6E-2,1.8000000000000002E-2,2.0000000000000004E-2,2.2000000000000006E-2,2.4000000000000007E-2,2.6000000000000009E-2,2.8000000000000011E-2,3.0000000000000013E-2,3.2000000000000015E-2,3.4000000000000016E-2,3.6000000000000018E-2,3.800000000000002E-2,4.0000000000000022E-2,4.2000000000000023E-2,4.4000000000000025E-2,4.6000000000000027E-2,4.8000000000000029E-2,5.0000000000000031E-2,5.2000000000000032E-2,5.4000000000000034E-2,5.6000000000000036E-2,5.8000000000000038E-2,6.0000000000000039E-2,6.2000000000000041E-2,6.4000000000000043E-2,6.6000000000000045E-2,6.8000000000000047E-2,7.0000000000000048E-2,7.200000000000005E-2,7.4000000000000052E-2,7.6000000000000054E-2,7.8000000000000055E-2,8.0000000000000057E-2,8.2000000000000059E-2,8.4000000000000061E-2,8.6000000000000063E-2,8.8000000000000064E-2,9.0000000000000066E-2,9.2000000000000068E-2,9.400000000000007E-2,9.6000000000000071E-2,9.8000000000000073E-2,0.10000000000000007,0.10200000000000008,0.10400000000000008,0.10600000000000008,0.10800000000000008,0.11000000000000008,0.11200000000000009,0.11400000000000009,0.11600000000000009,0.11800000000000009,0.12000000000000009,0.12200000000000009,0.1240000000000001,0.12600000000000008,0.12800000000000009,0.13000000000000009,0.13200000000000009,0.13400000000000009,0.13600000000000009,0.13800000000000009,0.1400000000000001,0.1420000000000001,0.1440000000000001,0.1460000000000001,0.1480000000000001,0.15000000000000011,0.15200000000000011,0.15400000000000011,0.15600000000000011,0.15800000000000011,0.16000000000000011,0.16200000000000012,0.16400000000000012,0.16600000000000012,0.16800000000000012,0.17000000000000012,0.17200000000000013,0.17400000000000013,0.17600000000000013,0.17800000000000013,0.18000000000000013,0.18200000000000013,0.18400000000000014,0.18600000000000014,0.18800000000000014,0.19000000000000014,0.19200000000000014,0.19400000000000014,0.19600000000000015,0.19800000000000015,0.20000000000000015]
["Uhlí - Lineární odpisy s půjčkou",1484.7027316085839,1487.063847260134,1489.4764628306416,1491.9418549459936,1494.4613331479661,1497.0362407408734,1499.6679556594311,1502.3578913583385,1505.1074977240974,1507.9182620096101,1510.7917097920961,1513.7294059548767,1516.7329556936147,1519.8040055475744,1522.94424445651,1526.1554048437804,1529.4392637263259,1532.7976438521325,1536.2324148658433,1539.7454945031698,1543.3388498148017,1547.0144984204999,1550.7745097940756,1554.6210065800065,1558.5561659424072,1562.5822209471307,1566.7014619777688,1570.9162381863514,1575.2289589795491,1579.6420955412118,1584.1581823920922,1588.7798189876137,1593.5096713545786,1598.3504737677081,1603.3050304669468,1608.3762174164788,1613.5669841064023,1618.8803553980797,1624.3194334141381,1629.8873994741705,1635.5875160771893,1641.4231289318868,1647.3976690358315,1653.5146548046919,1659.7776942526548,1666.1904872251982,1672.7568276854197,1679.4806060551352,1686.3658116120059,1693.416534943959,1700.6369704622057,1708.0314189741944,1715.6042903178454,1723.3601060584567,1731.3035022497115,1739.4392322602091,1747.7721696670201,1756.3073112177608,1765.049779862733,1774.0048278586996,1783.1778399459072,1792.5743365999883,1802.1999773604282,1812.0605642372957,1822.1620451979927,1832.5105177358041,1843.1122325220579,1853.9735971437708,1865.1011799286591,1876.501713859466,1888.1821005795696,1900.1494144918966,1912.4109069532039,1924.9740105658179,1937.8463435689953,1951.03571433208,1964.550125951703,1978.3977809552971,1992.5870861132641,2007.1266573621685,2022.0253248413758,2037.2921380456205,2052.9363710960292,2068.9675281321615,2085.395348827722,2102.2298140326075,2119.4811515440365,2137.1598420095556,2155.2766249647689,2173.8425050087021,2192.8687581197737,2212.3669381153841,2232.3488832582334,2252.826723012503,2273.8128849531217,2295.3201018313889,2317.3614188003166,2339.9502008030763,2363.1001401280528,2386.8252641340496]
["Biomasa - Lineární odpisy s půjčkou",1502.1140135552369,1504.4126467677818,1506.7614170517925,1509.1615672496766,1511.6143722486754,1514.1211398051084,1516.6832113892667,1519.3019630514559,1521.9788063096885,1524.7151890595444,1527.5125965067396,1530.3725521229337,1533.2966186253357,1536.2863989806781,1539.3435374341316,1542.4697205637649,1545.6666783611408,1548.9361853386856,1552.2800616644461,1555.700174324905,1559.198438316494,1562.776817866498,1566.4373276840392,1570.1820342418418,1574.0130570895089,1577.9325701990483,1581.9428033434051,1586.0460435087618,1590.2446363414213,1594.5409876300498,1598.9375648241214,1603.4368985894141,1608.041584401396,1612.754284177403,1617.5777279485003,1622.5147155719426,1627.5681184851794,1632.7408815023632,1638.0360246543421,1643.4566450731318,1649.005918921906,1654.6871033715361,1660.5035386247584,1666.458649989057,1672.5559499993785,1678.7990405918233,1685.1916153294624,1691.737461681493,1698.4404633569229,1705.3046026940422,1712.3339631069412,1719.5327315903719,1726.9052012842724,1734.4557740993091,1742.1889634048123,1750.1093967805141,1758.2218188335305,1766.531094082045,1775.0422099072166,1783.7602795748123,1792.6905453281615,1801.8383815539985,1811.209298022851,1820.8089432056158,1830.6431076680426,1840.7177275448403,1851.0388880951991,1861.6128273415225,1872.4459397932133,1883.5447802574224,1894.9160677386494,1906.5666894291926,1918.5037047924297,1930.7343497409911,1943.2660409119082,1956.1063800408685,1969.2631584377584,1982.7443615657082,1996.5581737259172,2010.7129828505601,2025.2173854061441,2040.0801914097226,2055.3104295604276,2070.9173524888279,2086.9104421266697,2103.2994151996249,2120.0942288456918,2137.3050863619978,2154.9424430827435,2173.0170123911548,2191.5397718683062,2210.5219695817773,2229.9751305171403,2249.9110631553576,2270.3418661992014,2291.2799354519052,2312.737970851294,2334.7289836627156,2357.266303834162,2380.3635875170403]
["Plyn - lineární s půjčkou",2947.3756805074536,2947.5386721033487,2947.7052188211519,2947.8754087883931,2948.049332404838,2948.2270824009374,2948.408753897731,2948.5944444682596,2948.7842542005124,2948.9782857619407,2949.1766444655823,2949.3794383378413,2949.5867781879433,2949.7987776791356,2950.0155534016308,2950.237224947391,2950.463914986743,2950.6957493468976,2950.9328570924217,2951.1753706076843,2951.4234256813411,2951.6771615929224,2951.9367212015186,2952.2022510366769,2952.4739013915259,2952.7518264181772,2953.0361842254783,2953.327136979161,2953.6248510044238,2953.929496891049,2954.2412496010634,2954.5602885790395,2954.8867978650778,2955.2209662105433,2955.5629871966125,2955.9130593556979,2956.2713862958276,2956.6381768280266,2957.0136450967916,2957.3980107137063,2957.7914988943076,2958.1943405982247,2958.6067726727169,2959.0290379996545,2959.4613856460346,2959.9040710181198,2960.3573560192604,2960.8215092115061,2961.2968059810855,2961.7835287078346,2962.2819669386804,2962.7924175652506,2963.3151850057202,2963.8505813909851,2964.3989267552611,2964.9605492311935,2965.5357852496154,2966.1249797440228,2966.7284863598788,2967.3466676688818,2967.9798953882791,2968.6285506053464,2969.2930240071605,2969.9737161157705,2970.6710375288967,2971.3854091662688,2972.1172625217391,2972.867039921307,2973.6351947871558,2974.4221919078709,2975.228507714949,2976.0546305657608,2976.9010610330774,2977.7683122013459,2978.6569099698249,2979.567393362759,2980.5003148467308,2981.4562406553482,2982.4357511214403,2983.4394410169107,2984.467919900424,2985.5218124731027,2986.60175894238,2987.7084153942383,2988.8424541739569,2990.0045642755917,2991.1954517403697,2992.4158400641804,2993.6664706143724,2994.9481030560451,2996.2615157880527,2997.6075063889189,2998.9868920728832,3000.4005101562884,3001.8492185345422,3003.3338961698623,3004.855443590061,3006.4147833985758,3008.0128607960064,3009.6506441134061]
["Uhlí ",1394.7497942828202,1397.1109099343701,1399.5235255048781,1401.9889176202303,1404.5083958222017,1407.0833034151092,1409.7150183336676,1412.4049540325746,1415.1545603983332,1417.9653246838459,1420.8387724663314,1423.776468629113,1426.7800183678512,1429.8510682218111,1432.9913071307462,1436.2024675180166,1439.4863264005617,1442.8447065263695,1446.2794775400791,1449.7925571774053,1453.3859124890378,1457.0615610947355,1460.8215724683116,1464.6680692542427,1468.6032286166435,1472.6292836213668,1476.7485246520046,1480.9633008605877,1485.2760216537849,1489.6891582154483,1494.2052450663282,1498.8268816618499,1503.5567340288151,1508.3975364419441,1513.3520931411836,1518.423280090715,1523.6140467806388,1528.9274180723162,1534.3664960883741,1539.9344621484065,1545.6345787514254,1551.4701916061233,1557.4447317100678,1563.5617174789281,1569.8247569268913,1576.2375498994343,1582.8038903596562,1589.5276687293715,1596.4128742862422,1603.4635976181951,1610.6840331364422,1618.0784816484309,1625.6513529920815,1633.4071687326932,1641.3505649239478,1649.4862949344458,1657.8192323412568,1666.3543738919968,1675.0968425369688,1684.0518905329359,1693.2249026201432,1702.6213992742248,1712.2470400346647,1722.1076269115317,1732.2091078722294,1742.5575804100408,1753.159295196295,1764.0206598180068,1775.1482426028952,1786.548776533702,1798.2291632538058,1810.1964771661326,1822.4579696274404,1835.021073240054,1847.8934062432313,1861.0827770063165,1874.5971886259392,1888.4448436295334,1902.6341487875004,1917.1737200364053,1932.0723875156118,1947.3392007198572,1962.9834337702655,1979.0145908063971,1995.4424115019581,2012.2768767068437,2029.5282142182728,2047.2069046837919,2065.3236876390047,2083.8895676829388,2102.91582079401,2122.4140007896203,2142.3959459324701,2162.8737856867388,2183.8599476273575,2205.3671645056252,2227.4084814745529,2249.997263477313,2273.1472028022895,2296.8723268082854]
["Biomasa ",1495.2687387105132,1497.5673719230581,1499.9161422070688,1502.3162924049527,1504.7690974039517,1507.2758649603845,1509.8379365445428,1512.4566882067325,1515.1335314649648,1517.8699142148209,1520.6673216620163,1523.52727727821,1526.4513437806124,1529.4411241359544,1532.4982625894077,1535.624445719041,1538.8214035164169,1542.0909104939615,1545.4347868197228,1548.8548994801815,1552.3531634717701,1555.9315430217744,1559.5920528393158,1563.3367593971179,1567.1677822447846,1571.0872953543249,1575.097528498681,1579.2007686640382,1583.3993614966978,1587.6957127853254,1592.0922899793973,1596.5916237446897,1601.1963095566718,1605.9090093326788,1610.7324531037766,1615.6694407272187,1620.7228436404553,1625.89560665764,1631.1907498096182,1636.6113702284078,1642.1606440771825,1647.8418285268126,1653.6582637800345,1659.6133751443333,1665.7106751546551,1671.9537657470992,1678.3463404847387,1684.8921868367693,1691.5951885121988,1698.4593278493185,1705.4886882622175,1712.687456745648,1720.0599264395487,1727.6104992545854,1735.3436885600881,1743.2641219357904,1751.3765439888059,1759.6858192373211,1768.1969350624927,1776.9150047300884,1785.8452704834374,1794.9931067092746,1804.3640231781269,1813.9636683608926,1823.7978328233185,1833.8724527001164,1844.1936132504759,1854.7675524967983,1865.6006649484891,1876.6995054126983,1888.0707928939255,1899.7214145844687,1911.6584299477054,1923.8890748962672,1936.4207660671839,1949.2611051961451,1962.4178835930343,1975.8990867209841,1989.7128988811933,2003.8677080058367,2018.37211056142,2033.2349165649989,2048.4651547157041,2064.072077644104,2080.0651672819463,2096.4541403549006,2113.2489540009678,2130.4598115172739,2148.0971682380195,2166.1717375464309,2184.6944970235822,2203.6766947370529,2223.1298556724173,2243.0657883106342,2263.4965913544775,2284.4346606071813,2305.8926960065705,2327.8837088179912,2350.4210289894386,2373.5183126723159]
["Uhlí - Lineární odpisy bez půjčky",1598.0090300265001,1600.3701456780504,1602.782761248558,1605.24815336391,1607.7676315658823,1610.3425391587894,1612.9742540773475,1615.6641897762552,1618.4137961420136,1621.2245604275265,1624.0980082100125,1627.0357043727931,1630.0392541115316,1633.1103039654913,1636.2505428744266,1639.4617032616968,1642.7455621442425,1646.1039422700494,1649.53871328376,1653.0517929210857,1656.6451482327179,1660.3207968384161,1664.080808211992,1667.9273049979226,1671.8624643603237,1675.8885193650467,1680.0077603956856,1684.222536604268,1688.5352573974656,1692.9483939591289,1697.464480810009,1702.0861174055306,1706.815969772495,1711.656772185624,1716.6113288848637,1721.6825158343954,1726.8732825243189,1732.1866538159961,1737.625731832054,1743.1936978920869,1748.893814495106,1754.7294273498037,1760.7039674537477,1766.8209532226088,1773.0839926705719,1779.4967856431149,1786.0631261033366,1792.7869044730519,1799.672110029923,1806.7228333618755,1813.9432688801226,1821.3377173921108,1828.9105887357618,1836.6664044763734,1844.609800667628,1852.745530678126,1861.0784680849372,1869.6136096356779,1878.3560782806489,1887.3111262766158,1896.4841383638236,1905.880635017905,1915.5062757783444,1925.3668626552121,1935.4683436159096,1945.8168161537208,1956.4185309399745,1967.2798955616872,1978.4074783465755,1989.8080122773824,2001.4883989974858,2013.455712909813,2025.7172053711204,2038.2803089837344,2051.1526419869115,2064.3420127499967,2077.8564243696201,2091.7040793732135,2105.8933845311808,2120.4329557800856,2135.331623259292,2150.5984364635374,2166.2426695139457,2182.2738265500784,2198.7016472456385,2215.5361124505239,2232.7874499619534,2250.4661404274721,2268.5829233826853,2287.148803426619,2306.1750565376906,2325.673236533301,2345.6551816761498,2366.1330214304189,2387.1191833710377,2408.6264002493058,2430.6677172182331,2453.2564992209932,2476.4064385459701,2500.131562551966]
["Biomasa - Zrychlené odpisy bez půjčky",1620.0221690495766,1622.3208022621218,1624.6695725461313,1627.0697227440162,1629.5225277430145,1632.0292952994475,1634.5913668836063,1637.2101185457952,1639.886961804028,1642.623344553883,1645.4207520010793,1648.280707617273,1651.2047741196754,1654.1945544750183,1657.2516929284711,1660.3778760581044,1663.5748338554802,1666.8443408330245,1670.1882171587861,1673.6083298192448,1677.1065938108331,1680.6849733608378,1684.3454831783788,1688.0901897361809,1691.921212583849,1695.8407256933883,1699.8509588377444,1703.9541990031012,1708.1527918357613,1712.4491431243891,1716.8457203184607,1721.3450540837525,1725.9497398957349,1730.6624396717423,1735.4858834428403,1740.4228710662824,1745.4762739795187,1750.6490369967034,1755.9441801486814,1761.3648005674713,1766.9140744162457,1772.5952588658758,1778.411694119098,1784.3668054833963,1790.4641054937181,1796.7071960861629,1803.0997708238017,1809.6456171758321,1816.348618851262,1823.2127581883822,1830.2421186012807,1837.4408870847112,1844.8133567786117,1852.3639295936487,1860.0971188991514,1868.0175522748534,1876.1299743278694,1884.4392495763846,1892.9503654015564,1901.6684350691517,1910.5987008225006,1919.7465370483383,1929.1174535171906,1938.7170986999554,1948.5512631623819,1958.6258830391794,1968.9470435895389,1979.5209828358611,1990.3540952875528,2001.4529357517615,2012.8242232329887,2024.4748449235319,2036.4118602867688,2048.6425052353306,2061.174196406248,2074.0145355352083,2087.1713139320977,2100.6525170600476,2114.4663292202567,2128.6211383448999,2143.1255409004839,2157.9883469040624,2173.2185850547671,2188.8255079831665,2204.8185976210088,2221.2075706939645,2238.0023843400313,2255.2132418563374,2272.850598577083,2290.9251678854948,2309.4479273626462,2328.4301250761164,2347.8832860114803,2367.8192186496972,2388.2500216935409,2409.1880909462448,2430.6461263456345,2452.637139157056,2475.1744593285016,2498.2717430113803]
["Uhlí - Zrychlené odpisy bez půjčky",1508.0560927007371,1510.4172083522874,1512.8298239227943,1515.2952160381467,1517.8146942401186,1520.3896018330265,1523.021316751584,1525.7112524504912,1528.4608588162498,1531.2716231017628,1534.1450708842483,1537.0827670470294,1540.0863167857676,1543.1573666397276,1546.2976055486629,1549.5087659359333,1552.7926248184785,1556.1510049442861,1559.5857759579956,1563.098855595322,1566.6922109069542,1570.3678595126523,1574.1278708862283,1577.9743676721596,1581.9095270345597,1585.9355820392832,1590.0548230699214,1594.2695992785048,1598.5823200717018,1602.9954566333649,1607.5115434842446,1612.1331800797666,1616.8630324467313,1621.7038348598608,1626.6583915590998,1631.7295785086314,1636.9203451985554,1642.2337164902326,1647.6727945062905,1653.2407605663234,1658.9408771693415,1664.7764900240397,1670.7510301279844,1676.8680158968446,1683.1310553448077,1689.5438483173511,1696.1101887775728,1702.8339671472877,1709.7191727041586,1716.7698960361115,1723.9903315543581,1731.384780066347,1738.9576514099979,1746.7134671506099,1754.6568633418649,1762.792593352362,1771.1255307591732,1779.6606723099135,1788.4031409548852,1797.3581889508523,1806.5312010380596,1815.9276976921412,1825.5533384525811,1835.4139253294481,1845.5154062901458,1855.8638788279573,1866.4655936142108,1877.3269582359237,1888.454541020812,1899.8550749516189,1911.5354616717223,1923.5027755840492,1935.7642680453571,1948.3273716579706,1961.1997046611475,1974.3890754242329,1987.9034870438561,2001.75114204745,2015.9404472054168,2030.4800184543215,2045.3786859335289,2060.6454991377736,2076.2897321881819,2092.3208892243138,2108.7487099198747,2125.5831751247597,2142.8345126361892,2160.5132031017079,2178.629986056922,2197.1958661008553,2216.2221192119259,2235.7202992075368,2255.7022443503861,2276.1800841046552,2297.1662460452744,2318.673462923542,2340.7147798924693,2363.3035618952294,2386.4535012202059,2410.1786252262018]
["Biomasa - Lineární odpisy bez půjčky",1613.1768942048525,1615.4755274173972,1617.8242977014083,1620.2244478992923,1622.6772528982908,1625.1840204547236,1627.7460920388821,1630.364843701072,1633.0416869593041,1635.7780697091596,1638.5754771563559,1641.4354327725496,1644.359499274952,1647.3492796302935,1650.4064180837474,1653.5326012133803,1656.7295590107567,1659.999065988301,1663.3429423140626,1666.7630549745211,1670.2613189661095,1673.8396985161137,1677.5002083336551,1681.2449148914573,1685.0759377391244,1688.9954508486646,1693.0056839930203,1697.1089241583777,1701.3075169910371,1705.6038682796648,1710.0004454737368,1714.4997792390293,1719.1044650510114,1723.8171648270184,1728.6406085981164,1733.5775962215582,1738.630999134795,1743.8037621519795,1749.0989053039577,1754.5195257227476,1760.068799571522,1765.7499840211522,1771.5664192743743,1777.5215306386726,1783.6188306489944,1789.8619212414387,1796.2544959790785,1802.8003423311086,1809.5033440065383,1816.3674833436576,1823.3968437565572,1830.5956122399878,1837.9680819338882,1845.5186547489247,1853.2518440544277,1861.1722774301295,1869.2846994831457,1877.5939747316606,1886.1050905568322,1894.8231602244282,1903.7534259777767,1912.9012622036139,1922.2721786724669,1931.8718238552319,1941.7059883176578,1951.7806081944559,1962.1017687448154,1972.675707991137,1983.5088204428291,1994.6076609070378,2005.9789483882646,2017.6295700788082,2029.5665854420447,2041.797230390607,2054.3289215615241,2067.1692606904844,2080.3260390873738,2093.8072422153236,2107.6210543755333,2121.7758635001755,2136.2802660557595,2151.143072059338,2166.3733102100437,2181.9802331384435,2197.9733227762854,2214.3622958492397,2231.1571094953074,2248.3679670116139,2266.0053237323596,2284.0798930407705,2302.6026525179223,2321.5848502313929,2341.0380111667564,2360.9739438049737,2381.404746848817,2402.3428161015204,2423.8008515009096,2445.7918643123317,2468.3291844837781,2491.4264681666559]
["Plyn - bez půjčky lineární",3088.0197007027064,3088.182692298602,3088.3492390164056,3088.5194289836468,3088.6933526000917,3088.8711025961898,3089.0527740929842,3089.2384646635128,3089.4282743957656,3089.6223059571939,3089.8206646608355,3090.0234585330945,3090.2307983831975,3090.4427978743893,3090.6595735968845,3090.8812451426447,3091.1079351819958,3091.3397695421513,3091.576877287675,3091.8193908029366,3092.0674458765943,3092.3211817881761,3092.5807413967718,3092.8462712319297,3093.1179215867787,3093.39584661343,3093.6802044207311,3093.9711571744137,3094.2688711996771,3094.5735170863022,3094.8852697963166,3095.2043087742932,3095.5308180603315,3095.8649864057966,3096.2070073918662,3096.5570795509516,3096.9154064910808,3097.2821970232803,3097.6576652920448,3098.0420309089604,3098.4355190895608,3098.8383607934779,3099.2507928679706,3099.6730581949073,3100.1054058412883,3100.5480912133726,3101.0013762145136,3101.4655294067593,3101.9408261763388,3102.4275489030874,3102.9259871339341,3103.4364377605038,3103.959205200973,3104.4946015862383,3105.0429469505134,3105.6045694264467,3106.1798054448682,3106.768999939276,3107.372506555133,3107.9906878641359,3108.6239155835324,3109.2725708005992,3109.9370442024137,3110.6177363110237,3111.3150577241508,3112.029429361522,3112.7612827169924,3113.5110601165607,3114.279214982409,3115.0662121031241,3115.8725279102023,3116.6986507610141,3117.5450812283316,3118.4123323965991,3119.3009301650782,3120.2114135580123,3121.1443350419836,3122.1002608506024,3123.079771316694,3124.0834612121639,3125.1119400956768,3126.1658326683555,3127.2457791376332,3128.3524355894924,3129.4864743692106,3130.6485844708454,3131.8394719356238,3133.0598602594337,3134.3104908096257,3135.5921232512983,3136.9055359833055,3138.2515265841721,3139.6309122681369,3141.0445303515426,3142.4932387297954,3143.977916365116,3145.4994637853151,3147.0588035938285,3148.6568809912596,3150.2946643086598]
["Plyn",2939.2104525003911,2939.3734440962867,2939.5399908140898,2939.710180781331,2939.8841043977759,2940.0618543938758,2940.243525890668,2940.429216461197,2940.6190261934503,2940.8130577548782,2941.0114164585202,2941.2142103307797,2941.4215501808822,2941.633549672074,2941.8503253945682,2942.0719969403285,2942.298686979681,2942.530521339836,2942.7676290853597,2943.0101426006217,2943.2581976742795,2943.5119335858608,2943.771493194457,2944.0370230296148,2944.3086733844639,2944.5865984111147,2944.8709562184163,2945.1619089720989,2945.4596229973617,2945.7642688839869,2946.0760215940013,2946.3950605719774,2946.7215698580162,2947.0557382034822,2947.39775918955,2947.7478313486358,2948.106158288766,2948.472948820965,2948.8484170897291,2949.2327827066447,2949.6262708872455,2950.0291125911626,2950.441544665654,2950.863809992592,2951.2961576389735,2951.7388430110573,2952.1921280121983,2952.656281204444,2953.1315779740235,2953.6183007007721,2954.1167389316183,2954.6271895581885,2955.1499569986577,2955.685353383923,2956.2336987481985,2956.7953212241309,2957.3705572425533,2957.9597517369602,2958.5632583528172,2959.1814396618206,2959.8146673812171,2960.4633225982839,2961.1277960000989,2961.8084881087088,2962.5058095218346,2963.2201811592067,2963.9520345146771,2964.7018119142454,2965.4699667800933,2966.2569639008088,2967.063279707887,2967.8894025586992,2968.7358330260154,2969.6030841942838,2970.4916819627629,2971.4021653556974,2972.3350868396687,2973.2910126482861,2974.2705231143786,2975.2742130098486,2976.302691893362,2977.3565844660402,2978.4365309353179,2979.5431873871771,2980.6772261668953,2981.8393362685292,2983.0302237333085,2984.2506120571188,2985.5012426073099,2986.782875048983,2988.0962877809907,2989.4422783818568,2990.8216640658211,2992.2352821492268,2993.6839905274801,2995.1686681628007,2996.6902155829998,2998.2495553915132,2999.8476327889443,3001.485416106344]
["Plyn bez půjčky zrychlený",3079.8544726956443,3080.0174642915404,3080.1840110093431,3080.3542009765847,3080.5281245930296,3080.7058745891281,3080.8875460859222,3081.0732366564507,3081.263046388704,3081.4570779501319,3081.6554366537739,3081.8582305260325,3082.0655703761354,3082.2775698673267,3082.4943455898224,3082.7160171355831,3082.9427071749333,3083.1745415350897,3083.4116492806129,3083.6541627958745,3083.9022178695327,3084.155953781114,3084.4155133897098,3084.6810432248676,3084.9526935797167,3085.2306186063679,3085.5149764136695,3085.8059291673517,3086.103643192615,3086.4082890792401,3086.7200417892545,3087.0390807672311,3087.3655900532694,3087.6997583987345,3088.0417793848037,3088.3918515438895,3088.7501784840188,3089.1169690162183,3089.4924372849828,3089.8768029018979,3090.2702910824992,3090.6731327864159,3091.0855648609086,3091.5078301878452,3091.9401778342262,3092.3828632063114,3092.836148207452,3093.3003013996972,3093.7755981692767,3094.2623208960258,3094.7607591268716,3095.2712097534418,3095.7939771939109,3096.3293735791763,3096.8777189434518,3097.4393414193846,3098.0145774378066,3098.6037719322139,3099.2072785480705,3099.8254598570743,3100.4586875764699,3101.1073427935371,3101.7718161953512,3102.4525083039621,3103.1498297170888,3103.8642013544604,3104.5960547099303,3105.3458321094986,3106.113986975347,3106.9009840960621,3107.7072999031407,3108.533422753952,3109.3798532212695,3110.2471043895375,3111.1357021580161,3112.0461855509507,3112.9791070349215,3113.9350328435403,3114.9145433096319,3115.9182332051018,3116.9467120886147,3118.000604661293,3119.0805511305712,3120.1872075824303,3121.3212463621489,3122.4833564637834,3123.6742439285617,3124.894632252372,3126.1452628025636,3127.4268952442367,3128.7403079762439,3130.0862985771105,3131.4656842610752,3132.87930234448,3134.3280107227324,3135.8126883580539,3137.3342357782526,3138.8935755867669,3140.4916529841976,3142.1294363015977]
["Uhlí - Lineární odpisy s půjčkou",{"$f":"RANK(B3,B$3:B$14,1)","v":2},{"$f":"RANK(C3,C$3:C$14,1)","v":2},2,2,2,2,2,2,2,2,2,2,2,2,2,2,2,2,2,2,2,2,2,2,2,2,2,2,2,2,2,2,2,2,2,2,2,2,2,2,2,2,2,2,2,2,2,2,2,2,2,2,2,2,2,2,2,2,2,2,2,2,2,2,2,{"$f":"RANK(BO3,BO$3:BO$14,1)","v":2},2,2,2,2,3,3,3,3,3,3,3,3,3,3,3,3,3,3,3,3,3,3,4,4,4,4,4,4,4,4,4,4,4,4]
["Biomasa - Lineární odpisy s půjčkou",{"$f":"RANK(B4,B$3:B$14,1)","v":4},4,4,4,4,4,4,4,4,4,4,4,4,4,4,4,4,4,4,4,4,4,4,4,4,4,4,4,4,4,4,4,4,4,4,4,4,4,4,4,4,4,4,4,4,4,4,4,4,4,4,4,4,4,4,4,4,4,4,4,4,4,4,4,4,4,4,4,4,4,4,4,4,4,4,4,4,4,4,4,4,4,4,4,4,4,4,4,3,3,3,3,3,3,3,3,3,3,3,3]
["Plyn - s půjčkou",10,{"$f":"RANK(C5,C$3:C$14,1)","v":10},10,10,10,10,10,10,10,10,10,10,10,10,10,10,10,10,10,10,10,10,10,10,10,10,10,10,10,10,10,10,10,10,10,10,10,10,10,10,10,10,10,10,10,10,10,10,10,10,10,10,10,10,10,10,10,10,10,10,10,10,10,10,10,10,10,10,10,10,10,10,10,10,10,10,10,10,10,10,10,10,10,10,10,10,10,10,10,10,10,10,10,10,10,10,10,10,10,10]
["Uhlí - Zrychlené odpisy s půjčkou",1,1,1,1,1,1,1,1,1,1,1,1,1,1,1,1,1,1,1,1,1,1,1,1,1,1,1,1,1,1,1,1,1,1,1,1,1,1,1,1,1,1,1,1,1,1,1,1,1,1,1,1,1,1,1,1,1,1,1,1,1,1,1,1,1,1,1,1,1,1,1,1,1,1,1,1,1,1,1,1,1,1,1,1,1,1,1,1,1,1,1,1,1,1,1,1,1,1,1,1]
["Biomasa - Zrychlené odpisy s půjčkou",3,3,3,3,3,3,3,3,3,3,3,3,3,3,3,3,3,3,3,3,3,3,3,3,3,3,3,3,3,3,3,3,3,3,3,3,3,3,3,3,3,3,3,3,3,3,3,3,3,3,3,3,3,3,3,3,3,3,3,3,3,3,3,3,3,3,3,3,3,3,2,2,2,2,2,2,2,2,2,2,2,2,2,2,2,2,2,2,2,2,2,2,2,2,2,2,2,2,2,2]
["Uhlí - Lineární odpisy bez půjčky",6,6,6,6,6,6,6,6,6,6,6,6,6,6,6,6,6,6,6,6,6,6,6,6,6,6,6,6,6,6,6,6,6,6,6,6,6,6,6,6,6,6,6,6,6,6,6,6,6,6,6,6,6,6,6,6,6,6,6,6,6,6,6,6,{"$f":"RANK(BN8,BN$3:BN$14,1)","v":6},6,6,6,6,6,6,6,6,6,6,6,6,6,6,6,6,6,6,7,7,7,7,7,7,7,7,7,7,7,7,7,8,8,8,8]
["Biomasa - Zrychlené odpisy bez půjčky",8,{"$f":"RANK(C9,C$3:C$14,1)","v":8},8,8,8,8,8,8,8,8,8,8,8,8,8,8,8,8,8,8,8,8,8,8,8,8,8,8,8,8,8,8,8,8,8,8,8,8,8,8,8,8,8,8,8,8,8,8,8,8,8,8,8,8,8,8,8,8,8,8,8,8,8,8,8,8,8,8,8,8,8,8,8,8,8,8,8,8,8,8,8,8,8,8,8,8,8,8,8,8,8,8,8,8,8,8,7,7,7,7]
["Uhlí - Zrychlené odpisy bez půjčky",5,5,5,5,5,5,5,5,5,5,5,5,5,5,5,5,5,5,5,5,5,5,5,5,5,5,5,5,5,5,5,5,5,5,5,5,5,5,5,5,5,5,5,5,5,5,5,5,5,5,5,5,5,5,5,5,5,5,5,5,5,5,5,5,5,5,5,5,5,5,5,5,5,5,5,5,5,5,5,5,5,5,5,5,5,5,5,5,5,5,5,5,5,5,5,5,5,5,5,5]
["Biomasa - Lineární odpisy bez půjčky",7,7,7,7,7,7,7,7,7,7,7,7,7,7,7,7,7,7,7,7,7,7,7,7,7,7,7,7,7,7,7,7,7,7,7,7,7,7,7,7,7,7,7,7,7,7,7,7,7,7,7,7,7,7,7,7,7,7,7,7,7,7,7,7,7,7,7,7,7,7,7,7,7,7,7,7,7,7,7,7,7,7,7,6,6,6,6,6,6,6,6,6,6,6,6,6,6,6,6,6]
["Plyn - bez půjčky",12,12,12,12,12,12,12,12,12,12,12,12,12,12,12,12,12,12,12,12,12,12,12,12,12,12,12,12,12,12,12,12,12,12,12,12,12,12,12,12,12,12,12,12,12,12,12,12,12,12,12,12,12,12,12,12,12,12,12,12,12,12,12,12,{"$f":"RANK(BN12,BN$3:BN$14,1)","v":12},12,12,12,12,12,12,12,12,12,12,12,12,12,12,12,12,12,12,12,12,12,12,12,12,12,12,12,12,12,12,12,12,12,12,12]
[{"$f":"A13","v":"Plyn"},9,{"$f":"RANK(C13,C$3:C$14,1)","v":9},9,9,9,9,9,9,9,9,9,9,9,9,9,9,9,9,9,9,9,9,9,9,9,9,9,9,9,9,9,9,9,9,9,9,9,9,9,9,9,9,9,9,9,9,9,9,9,9,9,9,9,9,9,9,9,9,9,9,9,9,9,9,9,{"$f":"RANK(BO13,BO$3:BO$14,1)","v":9},9,9,9,9,9,9,9,9,9,9,9,9,9,9,9,9,9,9,9,9,9,9,9,9,9,9,9,9,9,9,9,9,9,9]
[{"$f":"A5","v":"Plyn - lineární s půjčkou"},{"$f":"RANK(B5,B$3:B$14,1)","v":10},{"$f":"RANK(C5,C$3:C$14,1)","v":10},10,10,10,10,10,10,10,10,10,10,10,10,10,10,10,10,10,10,10,10,10,10,10,10,10,10,10,10,10,10,10,10,10,10,10,10,10,10,10,10,10,10,10,10,10,10,10,10,10,10,10,10,10,10,10,10,10,10,10,10,10,10,10,{"$f":"RANK(BO5,BO$3:BO$14,1)","v":10},10,10,10,10,10,10,10,10,10,10,10,10,10,10,10,10,10,10,10,10,10,10,10,10,10,10,10,10,10,10,10,10,10,10]
[]
["Varianta uhlí",{"$f":"IF(B18<B15,$A$18,$A$15)","v":"Uhlí - Zrychlené odpisy s půjčkou"},{"$f":"IF(C18<C15,$A$18,$A$15)","v":"Uhlí - Zrychlené odpisy s půjčkou"},"Uhlí - Zrychlené odpisy s půjčkou","Uhlí - Zrychlené odpisy s půjčkou","Uhlí - Zrychlené odpisy s půjčkou","Uhlí - Zrychlené odpisy s půjčkou","Uhlí - Zrychlené odpisy s půjčkou","Uhlí - Zrychlené odpisy s půjčkou","Uhlí - Zrychlené odpisy s půjčkou","Uhlí - Zrychlené odpisy s půjčkou","Uhlí - Zrychlené odpisy s půjčkou","Uhlí - Zrychlené odpisy s půjčkou","Uhlí - Zrychlené odpisy s půjčkou","Uhlí - Zrychlené odpisy s půjčkou","Uhlí - Zrychlené odpisy s půjčkou","Uhlí - Zrychlené odpisy s půjčkou","Uhlí - Zrychlené odpisy s půjčkou","Uhlí - Zrychlené odpisy s půjčkou","Uhlí - Zrychlené odpisy s půjčkou","Uhlí - Zrychlené odpisy s půjčkou","Uhlí - Zrychlené odpisy s půjčkou","Uhlí - Zrychlené odpisy s půjčkou","Uhlí - Zrychlené odpisy s půjčkou","Uhlí - Zrychlené odpisy s půjčkou","Uhlí - Zrychlené odpisy s půjčkou","Uhlí - Zrychlené odpisy s půjčkou","Uhlí - Zrychlené odpisy s půjčkou","Uhlí - Zrychlené odpisy s půjčkou","Uhlí - Zrychlené odpisy s půjčkou","Uhlí - Zrychlené odpisy s půjčkou","Uhlí - Zrychlené odpisy s půjčkou","Uhlí - Zrychlené odpisy s půjčkou","Uhlí - Zrychlené odpisy s půjčkou","Uhlí - Zrychlené odpisy s půjčkou","Uhlí - Zrychlené odpisy s půjčkou","Uhlí - Zrychlené odpisy s půjčkou","Uhlí - Zrychlené odpisy s půjčkou","Uhlí - Zrychlené odpisy s půjčkou","Uhlí - Zrychlené odpisy s půjčkou","Uhlí - Zrychlené odpisy s půjčkou","Uhlí - Zrychlené odpisy s půjčkou","Uhlí - Zrychlené odpisy s půjčkou","Uhlí - Zrychlené odpisy s půjčkou","Uhlí - Zrychlené odpisy s půjčkou","Uhlí - Zrychlené odpisy s půjčkou","Uhlí - Zrychlené odpisy s půjčkou","Uhlí - Zrychlené odpisy s půjčkou","Uhlí - Zrychlené odpisy s půjčkou","Uhlí - Zrychlené odpisy s půjčkou","Uhlí - Zrychlené odpisy s půjčkou","Uhlí - Zrychlené odpisy s půjčkou","Uhlí - Zrychlené odpisy s půjčkou","Uhlí - Zrychlené odpisy s půjčkou","Uhlí - Zrychlené odpisy s půjčkou","Uhlí - Zrychlené odpisy s půjčkou","Uhlí - Zrychlené odpisy s půjčkou","Uhlí - Zrychlené odpisy s půjčkou","Uhlí - Zrychlené odpisy s půjčkou","Uhlí - Zrychlené odpisy s půjčkou","Uhlí - Zrychlené odpisy s půjčkou","Uhlí - Zrychlené odpisy s půjčkou","Uhlí - Zrychlené odpisy s půjčkou","Uhlí - Zrychlené odpisy s půjčkou","Uhlí - Zrychlené odpisy s půjčkou","Uhlí - Zrychlené odpisy s půjčkou",{"$f":"IF(BO18<BO15,$A$18,$A$15)","v":"Uhlí - Zrychlené odpisy s půjčkou"},"Uhlí - Zrychlené odpisy s půjčkou","Uhlí - Zrychlené odpisy s půjčkou","Uhlí - Zrychlené odpisy s půjčkou","Uhlí - Zrychlené odpisy s půjčkou","Uhlí - Zrychlené odpisy s půjčkou","Uhlí - Zrychlené odpisy s půjčkou","Uhlí - Zrychlené odpisy s půjčkou","Uhlí - Zrychlené odpisy s půjčkou","Uhlí - Zrychlené odpisy s půjčkou","Uhlí - Zrychlené odpisy s půjčkou","Uhlí - Zrychlené odpisy s půjčkou","Uhlí - Zrychlené odpisy s půjčkou","Uhlí - Zrychlené odpisy s půjčkou","Uhlí - Zrychlené odpisy s půjčkou","Uhlí - Zrychlené odpisy s půjčkou","Uhlí - Zrychlené odpisy s půjčkou","Uhlí - Zrychlené odpisy s půjčkou","Uhlí - Zrychlené odpisy s půjčkou","Uhlí - Zrychlené odpisy s půjčkou","Uhlí - Zrychlené odpisy s půjčkou","Uhlí - Zrychlené odpisy s půjčkou","Uhlí - Zrychlené odpisy s půjčkou","Uhlí - Zrychlené odpisy s půjčkou","Uhlí - Zrychlené odpisy s půjčkou","Uhlí - Zrychlené odpisy s půjčkou","Uhlí - Zrychlené odpisy s půjčkou","Uhlí - Zrychlené odpisy s půjčkou","Uhlí - Zrychlené odpisy s půjčkou","Uhlí - Zrychlené odpisy s půjčkou","Uhlí - Zrychlené odpisy s půjčkou","Uhlí - Zrychlené odpisy s půjčkou","Uhlí - Zrychlené odpisy s půjčkou","Uhlí - Zrychlené odpisy s půjčkou","Uhlí - Zrychlené odpisy s půjčkou"]
["Varianta biomasa",{"$f":"IF(B16<B19,$A$16,$A$19)","v":"Biomasa - Zrychlené odpisy s půjčkou"},{"$f":"IF(C16<C19,$A$16,$A$19)","v":"Biomasa - Zrychlené odpisy s půjčkou"},"Biomasa - Zrychlené odpisy s půjčkou","Biomasa - Zrychlené odpisy s půjčkou","Biomasa - Zrychlené odpisy s půjčkou","Biomasa - Zrychlené odpisy s půjčkou","Biomasa - Zrychlené odpisy s půjčkou","Biomasa - Zrychlené odpisy s půjčkou","Biomasa - Zrychlené odpisy s půjčkou","Biomasa - Zrychlené odpisy s půjčkou","Biomasa - Zrychlené odpisy s půjčkou","Biomasa - Zrychlené odpisy s půjčkou","Biomasa - Zrychlené odpisy s půjčkou","Biomasa - Zrychlené odpisy s půjčkou","Biomasa - Zrychlené odpisy s půjčkou","Biomasa - Zrychlené odpisy s půjčkou","Biomasa - Zrychlené odpisy s půjčkou","Biomasa - Zrychlené odpisy s půjčkou","Biomasa - Zrychlené odpisy s půjčkou","Biomasa - Zrychlené odpisy s půjčkou","Biomasa - Zrychlené odpisy s půjčkou","Biomasa - Zrychlené odpisy s půjčkou","Biomasa - Zrychlené odpisy s půjčkou","Biomasa - Zrychlené odpisy s půjčkou","Biomasa - Zrychlené odpisy s půjčkou","Biomasa - Zrychlené odpisy s půjčkou","Biomasa - Zrychlené odpisy s půjčkou","Biomasa - Zrychlené odpisy s půjčkou","Biomasa - Zrychlené odpisy s půjčkou","Biomasa - Zrychlené odpisy s půjčkou","Biomasa - Zrychlené odpisy s půjčkou","Biomasa - Zrychlené odpisy s půjčkou","Biomasa - Zrychlené odpisy s půjčkou","Biomasa - Zrychlené odpisy s půjčkou","Biomasa - Zrychlené odpisy s půjčkou","Biomasa - Zrychlené odpisy s půjčkou","Biomasa - Zrychlené odpisy s půjčkou","Biomasa - Zrychlené odpisy s půjčkou","Biomasa - Zrychlené odpisy s půjčkou","Biomasa - Zrychlené odpisy s půjčkou","Biomasa - Zrychlené odpisy s půjčkou","Biomasa - Zrychlené odpisy s půjčkou","Biomasa - Zrychlené odpisy s půjčkou","Biomasa - Zrychlené odpisy s půjčkou","Biomasa - Zrychlené odpisy s půjčkou","Biomasa - Zrychlené odpisy s půjčkou","Biomasa - Zrychlené odpisy s půjčkou","Biomasa - Zrychlené odpisy s půjčkou","Biomasa - Zrychlené odpisy s půjčkou","Biomasa - Zrychlené odpisy s půjčkou","Biomasa - Zrychlené odpisy s půjčkou","Biomasa - Zrychlené odpisy s půjčkou","Biomasa - Zrychlené odpisy s půjčkou","Biomasa - Zrychlené odpisy s půjčkou","Biomasa - Zrychlené odpisy s půjčkou","Biomasa - Zrychlené odpisy s půjčkou","Biomasa - Zrychlené odpisy s půjčkou","Biomasa - Zrychlené odpisy s půjčkou","Biomasa - Zrychlené odpisy s půjčkou","Biomasa - Zrychlené odpisy s půjčkou","Biomasa - Zrychlené odpisy s půjčkou","Biomasa - Zrychlené odpisy s půjčkou","Biomasa - Zrychlené odpisy s půjčkou","Biomasa - Zrychlené odpisy s půjčkou","Biomasa - Zrychlené odpisy s půjčkou",{"$f":"IF(BO16<BO19,$A$16,$A$19)","v":"Biomasa - Zrychlené odpisy s půjčkou"},"Biomasa - Zrychlené odpisy s půjčkou","Biomasa - Zrychlené odpisy s půjčkou","Biomasa - Zrychlené odpisy s půjčkou","Biomasa - Zrychlené odpisy s půjčkou","Biomasa - Zrychlené odpisy s půjčkou","Biomasa - Zrychlené odpisy s půjčkou","Biomasa - Zrychlené odpisy s půjčkou","Biomasa - Zrychlené odpisy s půjčkou","Biomasa - Zrychlené odpisy s půjčkou","Biomasa - Zrychlené odpisy s půjčkou","Biomasa - Zrychlené odpisy s půjčkou","Biomasa - Zrychlené odpisy s půjčkou","Biomasa - Zrychlené odpisy s půjčkou","Biomasa - Zrychlené odpisy s půjčkou","Biomasa - Zrychlené odpisy s půjčkou","Biomasa - Zrychlené odpisy s půjčkou","Biomasa - Zrychlené odpisy s půjčkou","Biomasa - Zrychlené odpisy s půjčkou","Biomasa - Zrychlené odpisy s půjčkou","Biomasa - Zrychlené odpisy s půjčkou","Biomasa - Zrychlené odpisy s půjčkou","Biomasa - Zrychlené odpisy s půjčkou","Biomasa - Zrychlené odpisy s půjčkou","Biomasa - Zrychlené odpisy s půjčkou","Biomasa - Zrychlené odpisy s půjčkou","Biomasa - Zrychlené odpisy s půjčkou","Biomasa - Zrychlené odpisy s půjčkou","Biomasa - Zrychlené odpisy s půjčkou","Biomasa - Zrychlené odpisy s půjčkou","Biomasa - Zrychlené odpisy s půjčkou","Biomasa - Zrychlené odpisy s půjčkou","Biomasa - Zrychlené odpisy s půjčkou","Biomasa - Zrychlené odpisy s půjčkou","Biomasa - Zrychlené odpisy s půjčkou"]
[null,null,{"$f":"IF(B28=C28,1,0)","v":1},{"$f":"IF(C28=D28,1,0)","v":1},1,1,1,{"$f":"IF(G28=H28,1,0)","v":1},1,1,1,1,1,1,1,1,1,1,1,1,1,1,1,1,1,1,1,1,1,1,1,1,1,1,1,1,1,1,1,1,1,1,1,1,1,1,1,1,1,1,1,1,1,1,1,1,1,1,1,1,1,1,1,1,1,1,1,{"$f":"IF(BO28=BP28,1,0)","v":1},1,1,1,1,1,1,1,1,1,1,1,1,1,1,1,1,1,1,1,1,1,1,1,1,1,1,1,1,1,1,1,1,1]
[null,null,{"$f":"IF(B29=C29,1,0)","v":1},{"$f":"IF(C29=D29,1,0)","v":1},1,1,1,{"$f":"IF(G29=H29,1,0)","v":1},1,1,1,1,1,1,1,1,1,1,1,1,1,1,1,1,1,1,1,1,1,1,1,1,1,1,1,1,1,1,1,1,1,1,1,1,1,1,1,1,1,1,1,1,1,1,1,1,1,1,1,1,1,1,1,1,1,1,1,{"$f":"IF(BO29=BP29,1,0)","v":1},1,1,1,1,1,1,1,1,1,1,1,1,1,1,1,1,1,1,1,1,1,1,1,1,1,1,1,1,1,1,1,1,1]
["Varianta Plynu",{"$f":"IF(B25<B26,$A$25,$A$26)","v":"Plyn"},{"$f":"IF(C25<C26,$A$25,$A$26)","v":"Plyn"},"Plyn","Plyn","Plyn","Plyn","Plyn","Plyn","Plyn","Plyn","Plyn","Plyn","Plyn","Plyn","Plyn","Plyn","Plyn","Plyn","Plyn","Plyn","Plyn","Plyn","Plyn","Plyn","Plyn","Plyn","Plyn","Plyn","Plyn","Plyn","Plyn","Plyn","Plyn","Plyn","Plyn","Plyn","Plyn","Plyn","Plyn","Plyn","Plyn","Plyn","Plyn","Plyn","Plyn","Plyn","Plyn","Plyn","Plyn","Plyn","Plyn","Plyn","Plyn","Plyn","Plyn","Plyn","Plyn","Plyn","Plyn","Plyn","Plyn","Plyn","Plyn","Plyn","Plyn",{"$f":"IF(BO25<BO26,$A$25,$A$26)","v":"Plyn"},"Plyn","Plyn","Plyn","Plyn","Plyn","Plyn","Plyn","Plyn","Plyn","Plyn","Plyn","Plyn","Plyn","Plyn","Plyn","Plyn","Plyn","Plyn","Plyn","Plyn","Plyn","Plyn","Plyn","Plyn","Plyn","Plyn","Plyn","Plyn","Plyn","Plyn","Plyn","Plyn","Plyn","Plyn"]
[]
[null,null,{"$f":"IF(B32=C32,1,0)","v":1},{"$f":"IF(C32=D32,1,0)","v":1},1,1,1,1,1,1,1,1,1,1,1,1,1,1,1,1,1,1,1,1,1,1,1,1,1,1,1,1,1,1,1,1,1,1,1,1,1,1,1,1,1,1,1,1,1,1,1,1,1,1,1,1,1,1,1,1,1,1,1,1,1,1,1,{"$f":"IF(BO32=BP32,1,0)","v":1},1,1,1,1,1,1,1,1,1,1,1,1,1,1,1,1,1,1,1,1,1,1,1,1,1,1,1,1,1,1,1,1,1]
["Dojde ke změně v průběhu u uhlí",{"$f":"IF(SUM(C30:CW30)=99,\"NE\",\"ANO\")","v":"NE"},"Doporučená varianta",{"$f":"B28","v":"Uhlí - Zrychlené odpisy s půjčkou"}]
["Dojde ke změně v průběhu u biomasy",{"$f":"IF(SUM(C31:CW31)=99,\"NE\",\"ANO\")","v":"NE"},"Doporučená varianta",{"$f":"B29","v":"Biomasa - Zrychlené odpisy s půjčkou"}]
["Dojde ke změně v průběhu u plynu",{"$f":"IF(SUM(C34:CW34)=99,\"NE\",\"ANO\")","v":"NE"},"Doporučená varianta",{"$f":"B32","v":"Plyn"}]

{"sheet":"Výsledky","index":6,"n_rows":4,"n_cols":38,"rows_kept":4,"cut":false,"hidden":false,"merged":[]}
[null,null,null,null,null,null,null,null,2020,2021,2022,2023,2024,2025,2026,2027,2028,2029,2030,2031,2032,2033,2034,2035,2036,2037,2038,2039,2040]
[null,null,"Uhlí","Biomasa","Plyn",null,null,"Uhlí",{"$f":"Uhlí!C39","v":91443938.072619081},{"$f":"Uhlí!D39","v":119963352.11440216},{"$f":"Uhlí!E39","v":106562548.21893524},{"$f":"Uhlí!F39","v":100561860.28583457},{"$f":"Uhlí!G39","v":94903494.400546417},{"$f":"Uhlí!H39","v":89567865.599012241},{"$f":"Uhlí!I39","v":84536496.902286127},{"$f":"Uhlí!J39","v":79791958.627319694},{"$f":"Uhlí!K39","v":75317810.798403621},{"$f":"Uhlí!L39","v":71098548.523978308},{"$f":"Uhlí!M39","v":71467798.9309268},{"$f":"Uhlí!N39","v":58266557.439693108},{"$f":"Uhlí!O39","v":53616148.657084376},{"$f":"Uhlí!P39","v":50617120.282864615},{"$f":"Uhlí!Q39","v":47791650.933965072},{"$f":"Uhlí!R39","v":45129376.439299099},{"$f":"Uhlí!S39","v":42620568.036660634},{"$f":"Uhlí!T39","v":40256092.636751138},{"$f":"Uhlí!U39","v":38027375.604150131},{"$f":"Uhlí!V39","v":35926365.894872718},{"$f":"Uhlí!W39","v":33945503.40036352},{"$f":"Uhlí!X39","v":0},{"$f":"Uhlí!Y39","v":0},{"$f":"Uhlí!Z39","v":0},{"$f":"Uhlí!AA39","v":0},{"$f":"Uhlí!AB39","v":0},{"$f":"Uhlí!AC39","v":0},{"$f":"Uhlí!AD39","v":0},{"$f":"Uhlí!AE39","v":0},{"$f":"Uhlí!AF39","v":0}]
[null,"NPV",{"$f":"Uhlí!C49","v":1431412431.7999685},{"$f":"Biomasa!C55","v":1530961169.1939991},{"$f":"Plyn!C45","v":2941741333.1011534},null,null,"Biomasa",{"$f":"Biomasa!C45","v":98889636.232405379},{"$f":"Biomasa!D45","v":129549297.41812479},{"$f":"Biomasa!E45","v":114815213.22434443},{"$f":"Biomasa!F45","v":107841721.10727024},{"$f":"Biomasa!G45","v":101299201.62884043},{"$f":"Biomasa!H45","v":95160755.176096141},{"$f":"Biomasa!I45","v":89401164.634763852},{"$f":"Biomasa!J45","v":83996790.79482457},{"$f":"Biomasa!K45","v":78925474.158225},{"$f":"Biomasa!L45","v":74166442.767632589},{"$f":"Biomasa!M45","v":78056938.060332477},{"$f":"Biomasa!N45","v":63922355.134334199},{"$f":"Biomasa!O45","v":58538048.089581676},{"$f":"Biomasa!P45","v":54946085.612442426},{"$f":"Biomasa!Q45","v":51582238.250053652},{"$f":"Biomasa!R45","v":48431609.399482936},{"$f":"Biomasa!S45","v":45480295.98719383},{"$f":"Biomasa!T45","v":42715321.208760381},{"$f":"Biomasa!U45","v":40124571.866978675},{"$f":"Biomasa!V45","v":37696739.992155008},{"$f":"Biomasa!W45","v":35421268.450156376}]
[null,null,null,null,null,null,null,"Plyn",{"$f":"Plyn!C35","v":207283317.12821388},{"$f":"Plyn!D35","v":247577588.37026307},{"$f":"Plyn!E35","v":220927810.71925762},{"$f":"Plyn!F35","v":205935949.71906972},{"$f":"Plyn!G35","v":191970568.90009072},{"$f":"Plyn!H35","v":178961021.74188399},{"$f":"Plyn!I35","v":166841535.05321836},{"$f":"Plyn!J35","v":155550872.77004221},{"$f":"Plyn!K35","v":145032022.90931547},{"$f":"Plyn!L35","v":135231906.08877861},{"$f":"Plyn!M35","v":162512997.53523895},{"$f":"Plyn!N35","v":125575351.92910467},{"$f":"Plyn!O35","v":116699681.23333156},{"$f":"Plyn!P35","v":108461341.17384727},{"$f":"Plyn!Q35","v":100814072.48969202},{"$f":"Plyn!R35","v":93714997.651082918},{"$f":"Plyn!S35","v":87124372.480176523},{"$f":"Plyn!T35","v":81005356.070212722},{"$f":"Plyn!U35","v":75323797.652329311},{"$f":"Plyn!V35","v":70048039.159167826},{"$f":"Plyn!W35","v":65148732.326835401}]

{"sheet":"Přehledy","index":7,"n_rows":15,"n_cols":6,"rows_kept":15,"cut":false,"hidden":false,"merged":[[8,1,8,5],[1,1,1,3]]}
[]
[null,"Společná vstupní data"]
[null,"Roční inflace",2.9,"%"]
[null,"Vychozí cena emisní povolenky",641,"Kč"]
[null,"Roční nárůst ceny povolenky",2.9,"%"]
[null,"Diskontní míra",8,"%"]
[null,"Teplo vyrobené na K1 a K4",756745,"GJ"]
[]
[null,"Data jednotlivých variant"]
[null,"Varianta/parametr","Uhlí","Biomasa","Plyn","Jednotka"]
[null,"Výše investice 0. rok",400,415,600,"mil. Kč"]
[null,"Výše investice 10. rok",180,190,0,"mil. Kč"]
[null,"Výhřevnost jednotky paliva při zahrnutí účinnosti",12.11,11.64,0.03,"GJ"]
[null,"Cena jednotky paliva",450,7.6,1450,"Kč"]
[null,"Emisní faktor",0.1,0.06,0,"t/GJ"]