{"text_format":"1","workbook":"xlsx","n_sheets":6,"sheets":["poznámky","Vstupní data","Porovnání v trojúhelníku párů","Uložení hodnot z trojúhelníku","Metoda PATTERN","Export do PDF"],"not_rendered":{"charts":4,"images":0,"macros":1,"external_links":0,"defined_names":10,"comments":1,"pivot_tables":3},"unopened":[],"bounds":{"document_bytes":16777216,"sheet_cells":100000,"rows_first":2000,"rows_last":500,"rows_between":2000,"halvings":0,"cell_chars":16384,"cell_head_chars":4096},"cells_cut":0,"cells_raw":0,"read":"whole","date_system":"1900"}

{"sheet":"poznámky","index":0,"n_rows":19,"n_cols":13,"rows_kept":19,"cut":false,"hidden":true,"merged":[]}
[]
[]
[]
[null,null,"tady by mělo vyjet:"]
[]
[null,null,"dotaz na počet expertů",null,null,null,null,{"$f":"MMULT","v":{"$error":"#NAME?"}}]
[null,null,"počet kritérií"]
[null,null,"volba typu stanovení kritérií"]
[null,null,"a pak se uvidí jestli udělat jen pattern či i ostatní"]
[]
[]
[null,null,"parametry robotů",null,null,null,null,null,null,null,null,null,1]
[null,null,null,null,null,null,null,null,null,null,null,null,2]
[]
[]
[]
[]
[null,null,null,false]
[null,null,false]

{"sheet":"Vstupní data","index":1,"n_rows":59,"n_cols":30,"rows_kept":59,"cut":false,"hidden":false,"merged":[[44,5,45,6],[46,5,47,6],[48,5,49,6],[44,3,45,4],[38,3,39,4],[40,3,41,4],[42,3,43,4],[38,5,39,6],[40,5,41,6],[42,5,43,6],[36,3,37,4],[1,4,2,6],[4,4,5,6],[34,5,35,6],[36,5,37,6],[28,0,49,0],[1,7,2,8],[4,7,5,8],[1,16,3,27],[32,5,33,6],[21,3,25,6],[26,3,27,4],[26,5,27,6],[28,3,29,4],[28,5,29,6],[30,3,31,4],[30,5,31,6],[46,3,47,4],[48,3,49,4],[32,3,33,4],[34,3,35,4]]}
[]
[null,null,null,null,"Počet kritérií:",null,null,{"$f":"_xlnm.Criteria","v":6},null,null,null,null,null,null,null,null,"Tabulka vstupů - kritéria, varianty a jejich hodnoty"]
[]
[]
[null,null,null,null,"Počet expertů",null,null,{"$f":"experti","v":3}]
[]
[null,null,null,null,"Počet expertů",null,3,null,"MIN 1 !!"]
[null,null,null,null,"Počet kritérií",null,6,null,"MAX 15!!"]
[]
[]
[]
[]
[]
[]
["MAX"]
["MIN"]
[]
["MIN",null,null,null,null,null,null,null,null,null,null,null,null,"Sloupec1","Sloupec2","Sloupec3","Sloupec4","Sloupec5","Sloupec6","Sloupec7","Sloupec8","Sloupec9","Sloupec10","Sloupec11","Sloupec12","Sloupec13","Sloupec14","Sloupec15","Sloupec16","Sloupec17"]
[null,null,null,null,null,null,null,null,null,null,null,null,null,null,"Kritérium →","K1","K2","K3","K4","K5","K6"]
[null,null,null,null,null,null,null,null,null,null,null,null,null,null,"Název kr. →","Cena","Nosnost","Dosah (horinz.)","Opakovatelnost","M-M interface","Flexibilita prog."]
[null,null,null,null,null,null,null,null,null,null,null,null,null,null,"Jednotka kr. →","EUR","kg","m","mm","-","-"]
[null,null,null,"Fuzzy převodní tabulka pro přiřazení hodnoty kvalitativním kritériím",null,null,null,null,null,null,null,null,null,"Varianta ↓","Název var.↓           Charakter kr. →","MIN","MAX","MAX","MIN","MAX","MAX"]
[null,null,null,null,null,null,null,null,null,null,null,null,null,{"$f":"IF(O23 <> \"\", \"V1\", \"\")","v":"V1"},"ABB 1600 - 6/1.45",28400,6,1.45,0.02,0.77270000000000005,0.59089999999999998]
[null,null,null,null,null,null,null,null,null,null,null,null,null,{"$f":"IF(O24 <> \"\", \"V2\", \"\")","v":"V2"},"ABB 1600 - 10/1.45",25600,10,1.45,0.05,0.77270000000000005,0.59089999999999998]
[null,null,null,null,null,null,null,null,null,null,null,null,null,{"$f":"IF(O25 <> \"\", \"V3\", \"\")","v":"V3"},"KUKA KR6 R1820",35000,6,1.82,0.04,0.68179999999999996,0.77270000000000005]
[null,null,null,null,null,null,null,null,null,null,null,null,null,{"$f":"IF(O26 <> \"\", \"V4\", \"\")","v":"V4"},"KUKA KR10 R1420",29500,10,1.42,0.04,0.68179999999999996,0.77270000000000005]
[null,null,null,"Jazykový pojem",null,"Fuzzy hodnota",null,null,null,null,null,null,null,{"$f":"IF(O27 <> \"\", \"V5\", \"\")","v":"V5"},"Yaskawa Motoman HP20F",36500,20,1.72,0.06,0.5,0.59089999999999998]
[null,null,null,null,null,null,null,null,null,null,null,null,null,{"$f":"IF(O28 <> \"\", \"V6\", \"\")","v":"V6"},"Fanuc M-10iA/10M",38000,10,1.42,0.03,0.59089999999999998,0.68179999999999996]
["ÚROVEŇ / KVALITA",null,null,"Mimořádně nízká",null,4.5499999999999999E-2,null,null,null,null,null,null,null,{"$f":"IF(O29 <> \"\", \"V7\", \"\")","v":"V7"},"Fanuc M-10iA/7L",42000,7,1.63,0.03,0.59089999999999998,0.68179999999999996]
[null,null,null,null,null,null,null,null,null,null,null,null,null,{"$f":"IF(O30 <> \"\", \"V8\", \"\")","v":""}]
[null,null,null,"Extrémně nízká",null,0.13639999999999999,null,null,null,null,null,null,null,{"$f":"IF(O31 <> \"\", \"V9\", \"\")","v":""}]
[null,null,null,null,null,null,null,null,null,null,null,null,null,{"$f":"IF(O32 <> \"\", \"V10\", \"\")","v":""}]
[null,null,null,"Velmi nízká",null,0.2273,null,null,null,null,null,null,null,{"$f":"IF(O33 <> \"\", \"V11\", \"\")","v":""}]
[null,null,null,null,null,null,null,null,null,null,null,null,null,{"$f":"IF(O34 <> \"\", \"V12\", \"\")","v":""}]
[null,null,null,"Nízká",null,0.31819999999999998,null,null,null,null,null,null,null,{"$f":"IF(O35 <> \"\", \"V13\", \"\")","v":""}]
[null,null,null,null,null,null,null,null,null,null,null,null,null,{"$f":"IF(O36 <> \"\", \"V14\", \"\")","v":""}]
[null,null,null,"Podprůměrná",null,0.40910000000000002,null,null,null,null,null,null,null,{"$f":"IF(O37 <> \"\", \"V15\", \"\")","v":""}]
[null,null,null,null,null,null,null,null,null,null,null,null,null,{"$f":"IF(O38 <> \"\", \"V16\", \"\")","v":""}]
[null,null,null,"Průměrná",null,0.5,null,null,null,null,null,null,null,{"$f":"IF(O39 <> \"\", \"V17\", \"\")","v":""}]
[null,null,null,null,null,null,null,null,null,null,null,null,null,{"$f":"IF(O40 <> \"\", \"V18\", \"\")","v":""}]
[null,null,null,"Nadprůměrná",null,0.59089999999999998,null,null,null,null,null,null,null,{"$f":"IF(O41 <> \"\", \"V19\", \"\")","v":""}]
[null,null,null,null,null,null,null,null,null,null,null,null,null,{"$f":"IF(O42 <> \"\", \"V20\", \"\")","v":""}]
[null,null,null,"Vysoká",null,0.68179999999999996,null,null,null,null,null,null,null,{"$f":"IF(O43 <> \"\", \"V21\", \"\")","v":""}]
[null,null,null,null,null,null,null,null,null,null,null,null,null,{"$f":"IF(O44 <> \"\", \"V22\", \"\")","v":""}]
[null,null,null,"Velmi vysoká",null,0.77270000000000005,null,null,null,null,null,null,null,{"$f":"IF(O45 <> \"\", \"V23\", \"\")","v":""}]
[null,null,null,null,null,null,null,null,null,null,null,null,null,{"$f":"IF(O46 <> \"\", \"V24\", \"\")","v":""}]
[null,null,null,"Exrémně vysoká",null,0.86360000000000003,null,null,null,null,null,null,null,{"$f":"IF(O47 <> \"\", \"V25\", \"\")","v":""}]
[null,null,null,null,null,null,null,null,null,null,null,null,null,{"$f":"IF(O48 <> \"\", \"V26\", \"\")","v":""}]
[null,null,null,"Mimořádně vysoká",null,0.95450000000000002,null,null,null,null,null,null,null,{"$f":"IF(O49 <> \"\", \"V27\", \"\")","v":""}]
[null,null,null,null,null,null,null,null,null,null,null,null,null,{"$f":"IF(O50 <> \"\", \"V28\", \"\")","v":""}]
[null,null,null,null,null,null,null,null,null,null,null,null,null,{"$f":"IF(O51 <> \"\", \"V29\", \"\")","v":""}]
[null,null,null,null,null,null,null,null,null,null,null,null,null,{"$f":"IF(O52 <> \"\", \"V30\", \"\")","v":""}]
[]
[]
[]
[]
[]
[null,null,null,null,"MAX"]
[null,null,null,null,"MIN"]

{"sheet":"Porovnání v trojúhelníku párů","index":2,"n_rows":185,"n_cols":56,"rows_kept":185,"cut":false,"hidden":false,"merged":[[0,0,0,1],[30,0,31,3],[30,4,31,5],[28,4,29,5],[28,0,29,3],[3,27,4,34],[3,21,4,24],[1,6,3,16],[25,21,28,23],[25,24,28,25]]}
["SEZNAM KRITÉRIÍ"]
[{"$f":"IF('Vstupní data'!P19=0,\"\",'Vstupní data'!P19)","v":"K1"},{"$f":"IF('Vstupní data'!P20=0,\"\",'Vstupní data'!P20)","v":"Cena"},null,null,null,null,"Porovnání kritérií v trojúhelníku párů"]
[{"$f":"IF('Vstupní data'!Q19=0,\"\",'Vstupní data'!Q19)","v":"K2"},{"$f":"IF('Vstupní data'!Q20=0,\"\",'Vstupní data'!Q20)","v":"Nosnost"}]
[{"$f":"IF('Vstupní data'!R19=0,\"\",'Vstupní data'!R19)","v":"K3"},{"$f":"IF('Vstupní data'!R20=0,\"\",'Vstupní data'!R20)","v":"Dosah (horinz.)"},null,null,null,null,null,null,null,null,null,null,null,null,null,null,null,null,null,null,null,"Tabulka vah kritérií",null,null,null,null,null,"Tabulka počtu zaškrnutí kritérií danými experty"]
[{"$f":"IF('Vstupní data'!S19=0,\"\",'Vstupní data'!S19)","v":"K4"},{"$f":"IF('Vstupní data'!S20=0,\"\",'Vstupní data'!S20)","v":"Opakovatelnost"}]
[{"$f":"IF('Vstupní data'!T19=0,\"\",'Vstupní data'!T19)","v":"K5"},{"$f":"IF('Vstupní data'!T20=0,\"\",'Vstupní data'!T20)","v":"M-M interface"}]
[{"$f":"IF('Vstupní data'!U19=0,\"\",'Vstupní data'!U19)","v":"K6"},{"$f":"IF('Vstupní data'!U20=0,\"\",'Vstupní data'!U20)","v":"Flexibilita prog."}]
[{"$f":"IF('Vstupní data'!V19=0,\"\",'Vstupní data'!V19)","v":""},{"$f":"IF('Vstupní data'!V20=0,\"\",'Vstupní data'!V20)","v":""},null,null,null,null,null,null,null,null,null,null,null,null,null,null,null,null,null,null,null,null,"Kritérium","Váha kritéria",null,null,null,null,"Kritéria"]
[{"$f":"IF('Vstupní data'!W19=0,\"\",'Vstupní data'!W19)","v":""},{"$f":"IF('Vstupní data'!W20=0,\"\",'Vstupní data'!W20)","v":""},null,null,null,null,null,null,null,null,null,null,null,null,null,null,null,null,null,null,null,null,1,0.26666666666666666,null,null,null,"Experti",1,2,3,4,5,6,"Celkový součet"]
[{"$f":"IF('Vstupní data'!X19=0,\"\",'Vstupní data'!X19)","v":""},{"$f":"IF('Vstupní data'!X20=0,\"\",'Vstupní data'!X20)","v":""},null,null,null,null,null,null,null,null,null,null,null,null,null,null,null,null,null,null,null,null,2,8.8888888888888892E-2,null,null,null,1]
[{"$f":"IF('Vstupní data'!Y19=0,\"\",'Vstupní data'!Y19)","v":""},{"$f":"IF('Vstupní data'!Y20=0,\"\",'Vstupní data'!Y20)","v":""},null,null,null,null,null,null,null,null,null,null,null,null,null,null,null,null,null,null,null,null,3,0.17777777777777778,null,null,null,"Počet zaškrtnutí",4,1,3,5,0,2,15]
[{"$f":"IF('Vstupní data'!Z19=0,\"\",'Vstupní data'!Z19)","v":""},{"$f":"IF('Vstupní data'!Z20=0,\"\",'Vstupní data'!Z20)","v":""},null,null,null,null,null,null,null,null,null,null,null,null,null,null,null,null,null,null,null,null,4,0.28888888888888886,null,null,null,"Dílčí pořadí",2,5,3,1,6,4,21]
[{"$f":"IF('Vstupní data'!AA19=0,\"\",'Vstupní data'!AA19)","v":""},{"$f":"IF('Vstupní data'!AA20=0,\"\",'Vstupní data'!AA20)","v":""},null,null,null,null,null,null,null,null,null,null,null,null,null,null,null,null,null,null,null,null,5,6.6666666666666666E-2,null,null,null,2]
[{"$f":"IF('Vstupní data'!AB19=0,\"\",'Vstupní data'!AB19)","v":""},{"$f":"IF('Vstupní data'!AB20=0,\"\",'Vstupní data'!AB20)","v":""},null,null,null,null,null,null,null,null,null,null,null,null,null,null,null,null,null,null,null,null,6,0.1111111111111111,null,null,null,"Počet zaškrtnutí",5,3,1,3,2,1,15]
[{"$f":"IF('Vstupní data'!AC19=0,\"\",'Vstupní data'!AC19)","v":""},{"$f":"IF('Vstupní data'!AC20=0,\"\",'Vstupní data'!AC20)","v":""},null,null,null,null,null,null,null,null,null,null,null,null,null,null,null,null,null,null,null,null,"Celkový součet",1,null,null,null,"Dílčí pořadí",1,2.5,5.5,2.5,4,5.5,21]
[{"$f":"IF('Vstupní data'!AD19=0,\"\",'Vstupní data'!AD19)","v":""},{"$f":"IF('Vstupní data'!AD20=0,\"\",'Vstupní data'!AD20)","v":""},null,null,null,null,null,null,null,null,null,null,null,null,null,null,null,null,null,null,null,null,null,null,null,null,null,3]
[null,null,null,null,null,null,null,null,null,null,null,null,null,null,null,null,null,null,null,null,null,null,null,null,null,null,null,"Počet zaškrtnutí",3,0,4,5,1,2,15]
[null,null,null,null,null,null,null,null,null,null,null,null,null,null,null,null,null,null,null,null,null,null,null,null,null,null,null,"Dílčí pořadí",3,6,2,1,5,4,21]
[null,null,null,null,null,null,null,null,null,null,null,null,null,null,null,null,null,null,null,null,null,null,null,null,null,null,null,"Celkem Počet zaškrtnutí",12,4,8,13,3,5,45]
[null,null,null,null,null,null,null,null,null,null,null,null,null,null,null,null,null,null,null,null,null,null,null,null,null,null,null,"Celkem Dílčí pořadí",6,13.5,10.5,4.5,15,13.5,63]
[]
[]
[]
[null,null,null,null,null,null,null,null,null,null,null,null,null,null,null,null,null,null,null,null,null,null,null,null,null,null,null,null,null,null,null,null,null,null,null,null,null,null,null,null,null,null,null,null,null,null,null,null,"W:"]
[null,null,null,null,null,null,null,null,null,null,null,null,null,null,null,null,null,null,null,null,null,null,null,null,null,null,null,null,null,null,null,null,null,null,null,null,null,null,null,null,null,null,null,null,null,null,null,null,"Součet pořadí kritéria"]
[null,null,null,null,null,null,null,null,null,null,null,null,null,null,null,null,null,null,null,null,null,"Kendallův koeficient shody expertů W =",null,null,{"$f":"IFERROR(AX44,\"\")","v":0.61165048543689315},null,null,null,null,null,null,null,null,null,null,null,null,null,null,null,null,null,null,null,null,null,null,null,"KRIT","SOUCET PORADI",null,null,"Zavorka1",null,"T",{"$f":"IFERROR('Uložení hodnot z trojúhelníku'!H1,\"\")","v":12}]
[null,null,null,null,null,null,null,null,null,null,null,null,null,null,null,null,null,null,null,null,null,null,null,null,null,null,null,null,null,null,null,null,null,null,null,null,null,null,null,null,null,null,null,null,null,null,null,null,1,{"$f":"IFERROR(GETPIVOTDATA(\"[Measures].[Součet Dílčí pořadí kritéria]\",$AB$8,\"[Tabulka1].[Kritéria]\",\"[Tabulka1].[Kritéria].&[1]\"),\"\")","v":6},{"$f":"IFERROR(IFERROR(AX27^2,\"\"),\"\")","v":36},null,{"$f":"IFERROR((AX27-(experti*(_xlnm.Criteria+1)/2))^2,\"\")","v":20.25},{"$f":"IFERROR(SUM(IF(ISERR($BA$27:$BA$42),0,BA27)),\"\")","v":20.25},"krit",{"$f":"IFERROR(MAX(A158:A175),\"\")","v":6}]
[null,null,null,null,null,null,null,null,null,null,null,null,null,null,null,null,null,null,null,null,null,null,null,null,null,null,null,null,null,null,null,null,null,null,null,null,null,null,null,null,null,null,null,null,null,null,null,null,2,{"$f":"IFERROR(GETPIVOTDATA(\"[Measures].[Součet Dílčí pořadí kritéria]\",$AB$8,\"[Tabulka1].[Kritéria]\",\"[Tabulka1].[Kritéria].&[2]\"),\"\")","v":13.5},182.25,null,{"$f":"IFERROR((AX28-(experti*(_xlnm.Criteria+1))/2)^2,\"\")","v":9},9]
["Počet zadávajících expertů",null,null,null,{"$f":"IFERROR(experti,\"\")","v":3},null,null,null,null,null,null,null,null,null,null,null,null,null,null,null,null,null,null,null,null,null,null,null,null,null,null,null,null,null,null,null,null,null,null,null,null,null,null,null,null,null,null,null,3,{"$f":"IFERROR(GETPIVOTDATA(\"[Measures].[Součet Dílčí pořadí kritéria]\",$AB$8,\"[Tabulka1].[Kritéria]\",\"[Tabulka1].[Kritéria].&[3]\"),\"\")","v":10.5},110.25,null,0,0]
[null,null,null,null,null,null,null,null,null,null,null,null,null,null,null,null,null,null,null,null,null,null,null,null,null,null,null,null,null,null,null,null,null,null,null,null,null,null,null,null,null,null,null,null,null,null,null,null,4,{"$f":"IFERROR(GETPIVOTDATA(\"[Measures].[Součet Dílčí pořadí kritéria]\",$AB$8,\"[Tabulka1].[Kritéria]\",\"[Tabulka1].[Kritéria].&[4]\"),\"\")","v":4.5},20.25,null,36,36]
["Počet vyplněných expertů",null,null,null,{"$f":"IFERROR('Uložení hodnot z trojúhelníku'!G1,\"\")","v":3},null,null,null,null,null,null,null,null,null,null,null,null,null,null,null,null,null,null,null,null,null,null,null,null,null,null,null,null,null,null,null,null,null,null,null,null,null,null,null,null,null,null,null,5,{"$f":"IFERROR(GETPIVOTDATA(\"[Measures].[Součet Dílčí pořadí kritéria]\",$AB$8,\"[Tabulka1].[Kritéria]\",\"[Tabulka1].[Kritéria].&[5]\"),\"\")","v":15},225,null,20.25,20.25]
[null,null,null,null,null,null,null,null,null,null,null,null,null,null,null,null,null,null,null,null,null,null,null,null,null,null,null,null,null,null,null,null,null,null,null,null,null,null,null,null,null,null,null,null,null,null,null,null,6,{"$f":"IFERROR(GETPIVOTDATA(\"[Measures].[Součet Dílčí pořadí kritéria]\",$AB$8,\"[Tabulka1].[Kritéria]\",\"[Tabulka1].[Kritéria].&[6]\"),\"\")","v":13.5},182.25,null,9,9]
[null,null,null,null,null,null,null,null,null,null,null,null,null,null,null,null,null,null,null,null,null,null,null,null,null,null,null,null,null,null,null,null,null,null,null,null,null,null,null,null,null,null,null,null,null,null,null,null,7,{"$f":"IFERROR(GETPIVOTDATA(\"[Measures].[Součet Dílčí pořadí kritéria]\",$AB$8,\"[Tabulka1].[Kritéria]\",\"[Tabulka1].[Kritéria].&[7]\"),\"\")","v":""},"",null,"",0]
[null,null,null,null,null,null,null,null,null,null,null,null,null,null,null,null,null,null,null,null,null,null,null,null,null,null,null,null,null,null,null,null,null,null,null,null,null,null,null,null,null,null,null,null,null,null,null,null,8,{"$f":"IFERROR(GETPIVOTDATA(\"[Measures].[Součet Dílčí pořadí kritéria]\",$AB$8,\"[Tabulka1].[Kritéria]\",\"[Tabulka1].[Kritéria].&[8]\"),\"\")","v":""},"",null,"",0]
[null,null,null,null,null,null,null,null,null,null,null,null,null,null,null,null,null,null,null,null,null,null,null,null,null,null,null,null,null,null,null,null,null,null,null,null,null,null,null,null,null,null,null,null,null,null,null,null,9,{"$f":"IFERROR(GETPIVOTDATA(\"[Measures].[Součet Dílčí pořadí kritéria]\",$AB$8,\"[Tabulka1].[Kritéria]\",\"[Tabulka1].[Kritéria].&[9]\"),\"\")","v":""},"",null,"",0]
[null,null,null,null,null,null,null,null,null,null,null,null,null,null,null,null,null,null,null,null,null,null,null,null,null,null,null,null,null,null,null,null,null,null,null,null,null,null,null,null,null,null,null,null,null,null,null,null,10,{"$f":"IFERROR(GETPIVOTDATA(\"[Measures].[Součet Dílčí pořadí kritéria]\",$AB$8,\"[Tabulka1].[Kritéria]\",\"[Tabulka1].[Kritéria].&[10]\"),\"\")","v":""},"",null,"",0]
[null,null,null,null,null,null,null,null,null,null,null,null,null,null,null,null,null,null,null,null,null,null,null,null,null,null,null,null,null,null,null,null,null,null,null,null,null,null,null,null,null,null,null,null,null,null,null,null,11,{"$f":"IFERROR(GETPIVOTDATA(\"[Measures].[Součet Dílčí pořadí kritéria]\",$AB$8,\"[Tabulka1].[Kritéria]\",\"[Tabulka1].[Kritéria].&[11]\"),\"\")","v":""},"",null,"",0]
[null,null,null,null,null,null,null,null,null,null,null,null,null,null,null,null,null,null,null,null,null,null,null,null,null,null,null,null,null,null,null,null,null,null,null,null,null,null,null,null,null,null,null,null,null,null,null,null,12,{"$f":"IFERROR(GETPIVOTDATA(\"[Measures].[Součet Dílčí pořadí kritéria]\",$AB$8,\"[Tabulka1].[Kritéria]\",\"[Tabulka1].[Kritéria].&[12]\"),\"\")","v":""},"",null,"",0]
[null,null,null,null,null,null,null,null,null,null,null,null,null,null,null,null,null,null,null,null,null,null,null,null,null,null,null,null,null,null,null,null,null,null,null,null,null,null,null,null,null,null,null,null,null,null,null,null,13,{"$f":"IFERROR(GETPIVOTDATA(\"[Measures].[Součet Dílčí pořadí kritéria]\",$AB$8,\"[Tabulka1].[Kritéria]\",\"[Tabulka1].[Kritéria].&[13]\"),\"\")","v":""},"",null,"",0]
[null,null,null,null,null,null,null,null,null,null,null,null,null,null,null,null,null,null,null,null,null,null,null,null,null,null,null,null,null,null,null,null,null,null,null,null,null,null,null,null,null,null,null,null,null,null,null,null,14,{"$f":"IFERROR(GETPIVOTDATA(\"[Measures].[Součet Dílčí pořadí kritéria]\",$AB$8,\"[Tabulka1].[Kritéria]\",\"[Tabulka1].[Kritéria].&[14]\"),\"\")","v":""},"",null,"",0]
[null,null,null,null,null,null,null,null,null,null,null,null,null,null,null,null,null,null,null,null,null,null,null,null,null,null,null,null,null,null,null,null,null,null,null,null,null,null,null,null,null,null,null,null,null,null,null,null,15,{"$f":"IFERROR(GETPIVOTDATA(\"[Measures].[Součet Dílčí pořadí kritéria]\",$AB$8,\"[Tabulka1].[Kritéria]\",\"[Tabulka1].[Kritéria].&[15]\"),\"\")","v":""},"",null,"",0]
[null,null,null,null,null,null,null,null,null,null,null,null,null,null,null,null,null,null,null,null,null,null,null,null,null,null,null,null,null,null,null,null,null,null,null,null,null,null,null,null,null,null,null,null,null,null,null,null,null,null,null,"SUMA",{"$f":"IFERROR(SUM(IF(ISERR(BA27:BA42),\"\",BA27:BA42)),\"\")","v":0},{"$f":"IFERROR(SUM(BB27:BB41),\"\")","v":94.5}]
[null,null,null,null,null,null,null,null,null,null,null,null,null,null,null,null,null,null,null,null,null,null,null,null,null,null,null,null,null,null,null,null,null,null,null,null,null,null,null,null,null,null,null,null,null,null,null,null,null,null,null,null,"S",{"$f":"IFERROR((SUM(AY27:AY41)),\"\")","v":756}]
[null,null,null,null,null,null,null,null,null,null,null,null,null,null,null,null,null,null,null,null,null,null,null,null,null,null,null,null,null,null,null,null,null,null,null,null,null,null,null,null,null,null,null,null,null,null,null,null,"HODNOTA W",{"$f":"IFERROR(((12*BB43)-(3*experti^2*_xlnm.Criteria*((_xlnm.Criteria+1)^2)))/(((experti^2)*(_xlnm.Criteria^3-_xlnm.Criteria))-(experti*BD26)),1)","v":0.61165048543689315}]
[]
[]
[]
[]
[]
[]
[]
[]
[]
[]
[]
[]
[null,null,null,null,null,null,null,null,null,null,null,null,null,null,null,null,null,null,null,null,null,null,2,3,4,5,6,7,8,9,10,11,12,13,14,15,16]
[null,null,null,null,null,null,false,false,false,false,false,null,null,null,null,null,null,null,null,null,null,15,{"$f":"IFERROR(AND(G58,G59)*1,\"\")","v":0},0,0,0,0,"","","","","","","","",""]
[null,null,null,null,null,null,false,false,false,false,false,null,null,null,null,null,null,null,null,null,null,14,null,{"$f":"IFERROR(AND(H60,H61)*1,\"\")","v":0},0,0,0,"","","","","","","","",""]
[null,null,null,null,null,null,null,false,false,false,false,null,null,null,null,null,null,null,null,null,null,13,null,null,{"$f":"IFERROR(AND(I62,I63)*1,\"\")","v":0},0,0,"","","","","","","","",""]
[null,null,null,null,null,null,null,false,false,false,false,null,null,null,null,null,null,null,null,null,null,12,null,null,null,{"$f":"IFERROR(AND(J64,J65)*1,\"\")","v":0},0,"","","","","","","","",""]
[null,null,null,null,null,null,null,null,false,false,false,null,null,null,null,null,null,null,null,null,null,11,null,null,null,null,{"$f":"IFERROR(AND(K66,K67)*1,\"\")","v":0},"","","","","","","","",""]
[null,null,null,null,null,null,null,null,false,false,false,null,null,null,null,null,null,null,null,null,null,10,null,null,null,null,null,{"$f":"IFERROR(AND(L68,L69)*1,\"\")","v":""},"","","","","","","",""]
[null,null,null,null,null,null,null,null,null,false,false,null,null,null,null,null,null,null,null,null,null,9,null,null,null,null,null,null,{"$f":"IFERROR(AND(M70,M71)*1,\"\")","v":""},"","","","","","",""]
[null,null,null,null,null,null,null,null,null,false,false,null,null,null,null,null,null,null,null,null,null,8,null,null,null,null,null,null,null,{"$f":"IFERROR(AND(N72,N73)*1,\"\")","v":""},"","","","","",""]
[null,null,null,null,null,null,null,null,null,null,false,null,null,null,null,null,null,null,null,null,null,7,null,null,null,null,null,null,null,null,{"$f":"IFERROR(AND(O74,O75)*1,\"\")","v":""},"","","","",""]
[null,null,null,null,null,null,null,null,null,null,false,null,null,null,null,null,null,null,null,null,null,6,null,null,null,null,null,null,null,null,null,{"$f":"IFERROR(AND(P76,P77)*1,\"\")","v":""},{"$f":"IFERROR(AND(Q76,Q77)*1,\"\")","v":""},{"$f":"IFERROR(AND(R76,R77)*1,\"\")","v":""},{"$f":"IFERROR(AND(S76,S77)*1,\"\")","v":""},{"$f":"IFERROR(AND(T76,T77)*1,\"\")","v":""}]
[null,null,null,null,null,null,null,null,null,null,null,null,null,null,null,null,null,null,null,null,null,5,null,null,null,null,null,null,null,null,null,null,{"$f":"IFERROR(AND(Q78,Q79)*1,\"\")","v":""},{"$f":"IFERROR(AND(R78,R79)*1,\"\")","v":""},{"$f":"IFERROR(AND(S78,S79)*1,\"\")","v":""},{"$f":"IFERROR(AND(T78,T79)*1,\"\")","v":""}]
[null,null,null,null,null,null,null,null,null,null,null,null,null,null,null,null,null,null,null,null,null,4,null,null,null,null,null,null,null,null,null,null,null,{"$f":"IFERROR(AND(R80,R81)*1,\"\")","v":""},{"$f":"IFERROR(AND(S80,S81)*1,\"\")","v":""},{"$f":"IFERROR(AND(T80,T81)*1,\"\")","v":""}]
[null,null,null,null,null,null,null,null,null,null,null,null,null,null,null,null,null,null,null,null,null,3,null,null,null,null,null,null,null,null,null,null,null,null,{"$f":"IFERROR(AND(S82,S83)*1,\"\")","v":""},{"$f":"IFERROR(AND(T82,T83)*1,\"\")","v":""}]
[null,null,null,null,null,null,null,null,null,null,null,null,null,null,null,null,null,null,null,null,null,2,null,null,null,null,null,null,null,null,null,null,null,null,null,{"$f":"IFERROR(AND(T84,T85)*1,\"\")","v":""}]
[null,null,null,null,null,null,null,null,null,null,null,null,null,null,null,null,null,null,null,null,null,1]
[null,null,null,null,null,null,null,null,null,null,null,null,null,null,null,null,null,null,null,null,null,null,{"$f":"MAX(W58:AA62)","v":0}]
[]
[null,null,null,null,null,null,null,null,null,null,null,null,null,null,null,null,null,null,null,null,null,null,"KONTROLA DVOJIC:"]
[]
[]
[]
[]
[]
[]
[]
[]
[]
[]
[]
[]
[]
[]
[]
[]
[]
[]
[]
[]
[]
[]
[]
[]
[]
[]
[]
[]
[]
[]
[]
[]
[null,null,null,null,null,null,1,1,1,1,1]
[null,null,null,null,null,null,2,3,4,5,6]
[null,null,null,null,null,null,null,2,2,2,2]
[null,null,null,null,null,null,null,3,4,5,6]
[null,null,null,null,null,null,null,null,3,3,3]
[null,null,null,null,null,null,null,null,4,5,6]
[null,null,null,null,null,null,null,null,null,4,4]
[null,null,null,null,null,null,null,null,null,5,6]
[null,null,null,null,null,null,null,null,null,null,5]
[null,null,null,null,null,null,null,null,null,null,6]
[]
[]
[]
[]
[]
[]
[]
[]
[]
[]
[]
[]
[]
[]
["Kritérium","Korekce remíz"]
[1,{"$f":"IFERROR(COUNTIF($W$158:$AJ$185, A133)/2,\"\")","v":0}]
[2,0]
[3,0]
[4,0]
[5,0]
[6,0]
[7,0]
[8,0]
[9,0]
[10,0]
[11,0]
[12,0]
[13,0]
[14,0]
[15,0]
[]
[]
[]
[]
["celk. počet kroužků",null,"kontrolní hodnota kroužků"]
[null,{"$f":"IFERROR(SUM(B158:B172),\"\")","v":0},null,{"$f":"IFERROR(_xlnm.Criteria*(_xlnm.Criteria-1)/2,\"\")","v":15}]
[]
[]
[]
["Kritérium","Počet","id experta","Pořadí","Počet remíz -1"]
[1,{"$f":"COUNTIF($G$158:$T$185, A158)-B133","v":0},4,{"$f":"_xlfn.RANK.AVG(B158, B$158:B163)","v":3.5},{"$f":"IFERROR(IF(A158<>\"\",IF(COUNTIF($B$157:B157,B158)=0,COUNTIF(B159:$B172,B158),0),0),\"\")","v":5},null,{"$f":"IF(G58 = TRUE, G108, 0)","v":0},0,0,0,0,null,null,null,null,null,null,null,null,null,null,null,{"$f":"IFERROR(G158*W58,\"\")","v":0},0,0,0,0,"","","","","","","","",""]
[2,0,4,{"$f":"_xlfn.RANK.AVG(B159, B$158:B163)","v":3.5},{"$f":"IFERROR(IF(A159<>\"\",IF(COUNTIF($B$157:B158,B159)=0,COUNTIF(B160:$B173,B159),0),0),\"\")","v":0},null,0,0,0,0,0,null,null,null,null,null,null,null,null,null,null,null,{"$f":"IFERROR(G159*W58,\"\")","v":0},0,0,0,0,"","","","","","","","",""]
[3,0,4,{"$f":"_xlfn.RANK.AVG(B160, B$158:B163)","v":3.5},{"$f":"IFERROR(IF(A160<>\"\",IF(COUNTIF($B$157:B159,B160)=0,COUNTIF(B161:$B174,B160),0),0),\"\")","v":0},null,null,{"$f":"IF(H60 = TRUE, H110, 0)","v":0},0,0,0,null,null,null,null,null,null,null,null,null,null,null,null,{"$f":"IFERROR(H160*X59,\"\")","v":0},0,0,0,"","","","","","","","",""]
[4,0,4,{"$f":"_xlfn.RANK.AVG(B161, B$158:B163)","v":3.5},{"$f":"IFERROR(IF(A161<>\"\",IF(COUNTIF($B$157:B160,B161)=0,COUNTIF(B162:$B175,B161),0),0),\"\")","v":0},null,null,0,0,0,0,null,null,null,null,null,null,null,null,null,null,null,null,{"$f":"IFERROR(H161*X59,\"\")","v":0},0,0,0,"","","","","","","","",""]
[5,0,4,{"$f":"_xlfn.RANK.AVG(B162, B$158:B163)","v":3.5},{"$f":"IFERROR(IF(A162<>\"\",IF(COUNTIF($B$157:B161,B162)=0,COUNTIF(B163:$B176,B162),0),0),\"\")","v":0},null,null,null,{"$f":"IF(I62 = TRUE, I112, 0)","v":0},0,0,null,null,null,null,null,null,null,null,null,null,null,null,null,{"$f":"IFERROR(I162*Y60,\"\")","v":0},0,0,"","","","","","","","",""]
[6,0,4,{"$f":"_xlfn.RANK.AVG(B163, B$158:B163)","v":3.5},{"$f":"IFERROR(IF(A163<>\"\",IF(COUNTIF($B$157:B162,B163)=0,COUNTIF(B164:$B177,B163),0),0),\"\")","v":0},null,null,null,0,0,0,null,null,null,null,null,null,null,null,null,null,null,null,null,{"$f":"IFERROR(I163*Y60,\"\")","v":0},0,0,"","","","","","","","",""]
[null,null,null,null,{"$f":"IFERROR(IF(A164<>\"\",IF(COUNTIF($B$157:B163,B164)=0,COUNTIF(B165:$B178,B164),0),0),\"\")","v":0},null,null,null,null,{"$f":"IF(J64 = TRUE, J114, 0)","v":0},{"$f":"IF(K64 = TRUE, K114, 0)","v":0},null,null,null,null,null,null,null,null,null,null,null,null,null,null,{"$f":"IFERROR(J164*Z61,\"\")","v":0},0,"","","","","","","","",""]
[null,null,null,null,{"$f":"IFERROR(IF(A165<>\"\",IF(COUNTIF($B$157:B164,B165)=0,COUNTIF(B166:$B179,B165),0),0),\"\")","v":0},null,null,null,null,{"$f":"IF(J65 = TRUE, J115, 0)","v":0},{"$f":"IF(K65 = TRUE, K115, 0)","v":0},null,null,null,null,null,null,null,null,null,null,null,null,null,null,{"$f":"IFERROR(J165*Z61,\"\")","v":0},0,"","","","","","","","",""]
[null,null,null,null,{"$f":"IFERROR(IF(A166<>\"\",IF(COUNTIF($B$157:B165,B166)=0,COUNTIF(B167:$B180,B166),0),0),\"\")","v":0},null,null,null,null,null,{"$f":"IF(K66 = TRUE, K116, 0)","v":0},null,null,null,null,null,null,null,null,null,null,null,null,null,null,null,{"$f":"IFERROR(K166*AA62,\"\")","v":0},"","","","","","","","",""]
[null,null,null,null,{"$f":"IFERROR(IF(A167<>\"\",IF(COUNTIF($B$157:B166,B167)=0,COUNTIF(B168:$B181,B167),0),0),\"\")","v":0},null,null,null,null,null,{"$f":"IF(K67 = TRUE, K117, 0)","v":0},null,null,null,null,null,null,null,null,null,null,null,null,null,null,null,{"$f":"IFERROR(K167*AA62,\"\")","v":0},"","","","","","","","",""]
[null,null,null,null,{"$f":"IFERROR(IF(A168<>\"\",IF(COUNTIF($B$157:B167,B168)=0,COUNTIF(B169:$B182,B168),0),0),\"\")","v":0},null,null,null,null,null,null,null,null,null,null,null,null,null,null,null,null,null,null,null,null,null,null,{"$f":"IFERROR(L168*AB63,\"\")","v":""},"","","","","","","",""]
[null,null,null,null,{"$f":"IFERROR(IF(A169<>\"\",IF(COUNTIF($B$157:B168,B169)=0,COUNTIF(B170:$B183,B169),0),0),\"\")","v":0},null,null,null,null,null,null,null,null,null,null,null,null,null,null,null,null,null,null,null,null,null,null,{"$f":"IFERROR(L169*AB63,\"\")","v":""},"","","","","","","",""]
[null,null,null,null,{"$f":"IFERROR(IF(A170<>\"\",IF(COUNTIF($B$157:B169,B170)=0,COUNTIF(B171:$B184,B170),0),0),\"\")","v":0},null,null,null,null,null,null,null,null,null,null,null,null,null,null,null,null,null,null,null,null,null,null,null,{"$f":"IFERROR(M170*AC64,\"\")","v":""},"","","","","","",""]
[null,null,null,null,{"$f":"IFERROR(IF(A171<>\"\",IF(COUNTIF($B$157:B170,B171)=0,COUNTIF(B172:$B185,B171),0),0),\"\")","v":0},null,null,null,null,null,null,null,null,null,null,null,null,null,null,null,null,null,null,null,null,null,null,null,{"$f":"IFERROR(M171*AC64,\"\")","v":""},"","","","","","",""]
[null,null,null,null,{"$f":"IFERROR(IF(A172<>\"\",IF(COUNTIF($B$157:B171,B172)=0,COUNTIF(B173:$B186,B172),0),0),\"\")","v":0},null,null,null,null,null,null,null,null,null,null,null,null,null,null,null,null,null,null,null,null,null,null,null,null,{"$f":"IFERROR(N172*AD65,\"\")","v":""},"","","","","",""]
[null,null,null,null,null,null,null,null,null,null,null,null,null,null,null,null,null,null,null,null,null,null,null,null,null,null,null,null,null,{"$f":"IFERROR(N173*AD65,\"\")","v":""},"","","","","",""]
[null,null,null,null,null,null,null,null,null,null,null,null,null,null,null,null,null,null,null,null,null,null,null,null,null,null,null,null,null,null,{"$f":"IFERROR(O174*AE66,\"\")","v":""},"","","","",""]
[null,null,null,null,null,null,null,null,null,null,null,null,null,null,null,null,null,null,null,null,null,null,null,null,null,null,null,null,null,null,{"$f":"IFERROR(O175*AE66,\"\")","v":""},"","","","",""]
[null,null,null,null,null,null,null,null,null,null,null,null,null,null,null,null,null,null,null,null,null,null,null,null,null,null,null,null,null,null,null,{"$f":"IFERROR(P176*AF67,\"\")","v":""},{"$f":"IFERROR(Q176*AG67,\"\")","v":""},{"$f":"IFERROR(R176*AH67,\"\")","v":""},{"$f":"IFERROR(S176*AI67,\"\")","v":""},{"$f":"IFERROR(T176*AJ67,\"\")","v":""}]
[null,null,null,null,null,null,null,null,null,null,null,null,null,null,null,null,null,null,null,null,null,null,null,null,null,null,null,null,null,null,null,{"$f":"IFERROR(P177*AF67,\"\")","v":""},{"$f":"IFERROR(Q177*AG67,\"\")","v":""},{"$f":"IFERROR(R177*AH67,\"\")","v":""},{"$f":"IFERROR(S177*AI67,\"\")","v":""},{"$f":"IFERROR(T177*AJ67,\"\")","v":""}]
[null,null,null,null,null,null,null,null,null,null,null,null,null,null,null,null,null,null,null,null,null,null,null,null,null,null,null,null,null,null,null,null,{"$f":"IFERROR(Q178*AG68,\"\")","v":""},{"$f":"IFERROR(R178*AH68,\"\")","v":""},{"$f":"IFERROR(S178*AI68,\"\")","v":""},{"$f":"IFERROR(T178*AJ68,\"\")","v":""}]
[null,null,null,null,null,null,null,null,null,null,null,null,null,null,null,null,null,null,null,null,null,null,null,null,null,null,null,null,null,null,null,null,{"$f":"IFERROR(Q179*AG68,\"\")","v":""},{"$f":"IFERROR(R179*AH68,\"\")","v":""},{"$f":"IFERROR(S179*AI68,\"\")","v":""},{"$f":"IFERROR(T179*AJ68,\"\")","v":""}]
[null,null,null,null,null,null,null,null,null,null,null,null,null,null,null,null,null,null,null,null,null,null,null,null,null,null,null,null,null,null,null,null,null,{"$f":"IFERROR(R180*AH69,\"\")","v":""},{"$f":"IFERROR(S180*AI69,\"\")","v":""},{"$f":"IFERROR(T180*AJ69,\"\")","v":""}]
[null,null,null,null,null,null,null,null,null,null,null,null,null,null,null,null,null,null,null,null,null,null,null,null,null,null,null,null,null,null,null,null,null,{"$f":"IFERROR(R181*AH69,\"\")","v":""},{"$f":"IFERROR(S181*AI69,\"\")","v":""},{"$f":"IFERROR(T181*AJ69,\"\")","v":""}]
[null,null,null,null,null,null,null,null,null,null,null,null,null,null,null,null,null,null,null,null,null,null,null,null,null,null,null,null,null,null,null,null,null,null,{"$f":"IFERROR(S182*AI70,\"\")","v":""},{"$f":"IFERROR(T182*AJ70,\"\")","v":""}]
[null,null,null,null,null,null,null,null,null,null,null,null,null,null,null,null,null,null,null,null,null,null,null,null,null,null,null,null,null,null,null,null,null,null,{"$f":"IFERROR(S183*AI70,\"\")","v":""},{"$f":"IFERROR(T183*AJ70,\"\")","v":""}]
[null,null,null,null,null,null,null,null,null,null,null,null,null,null,null,null,null,null,null,null,null,null,null,null,null,null,null,null,null,null,null,null,null,null,null,{"$f":"IFERROR(T184*AJ71,\"\")","v":""}]
[null,null,null,null,null,null,null,null,null,null,null,null,null,null,null,null,null,null,null,null,null,null,null,null,null,null,null,null,null,null,null,null,null,null,null,{"$f":"IFERROR(T185*AJ71,\"\")","v":""}]

{"sheet":"Uložení hodnot z trojúhelníku","index":3,"n_rows":28,"n_cols":10,"rows_kept":28,"cut":false,"hidden":false,"merged":[]}
["Kritéria","Počet","Expert","Dílčí pořadí kritéria","Počet členů v remíze -1",null,{"$f":"MAX(C:C)","v":3},{"$f":"SUMPRODUCT((Tabulka1[Počet členů v remíze -1]+1)^3-(Tabulka1[Počet členů v remíze -1]+1))","v":12},null,{"$f":"SUMSQ(Tabulka1[Dílčí pořadí kritéria])","v":272}]
[1,4,1,2,0]
[2,1,1,5,0]
[3,3,1,3,0]
[4,5,1,1,0]
[5,0,1,6,0]
[6,2,1,4,0]
[1,5,2,1,0]
[2,3,2,2.5,1]
[3,1,2,5.5,1]
[4,3,2,2.5,0]
[5,2,2,4,0]
[6,1,2,5.5,0]
[1,3,3,3,0]
[2,0,3,6,0]
[3,4,3,2,0]
[4,5,3,1,0]
[5,1,3,5,0]
[6,2,3,4,0]
[null,null,null,null,0]
[null,null,null,null,0]
[null,null,null,null,0]
[null,null,null,null,0]
[null,null,null,null,0]
[null,null,null,null,0]
[null,null,null,null,0]
[null,null,null,null,0]
[null,null,null,null,0]

{"sheet":"Metoda PATTERN","index":4,"n_rows":55,"n_cols":86,"rows_kept":55,"cut":false,"hidden":false,"merged":[[14,3,18,19],[54,61,54,62],[54,63,54,64],[54,65,54,66],[54,3,54,6],[53,3,53,6],[52,3,52,5],[54,43,54,44],[54,45,54,46],[54,47,54,48],[54,49,54,50],[54,51,54,52],[54,53,54,54],[54,55,54,56],[54,57,54,58],[54,59,54,60],[54,25,54,26],[54,27,54,28],[54,29,54,30],[54,31,54,32],[54,33,54,34],[54,35,54,36],[54,37,54,38],[54,39,54,40],[54,41,54,42],[54,7,54,8],[54,9,54,10],[54,11,54,12],[54,13,54,14],[54,15,54,16],[54,17,54,18],[54,19,54,20],[54,21,54,22],[54,23,54,24],[53,49,53,50],[53,51,53,52],[53,53,53,54],[53,55,53,56],[53,57,53,58],[53,59,53,60],[53,61,53,62],[53,63,53,64],[53,65,53,66],[52,61,52,62],[52,63,52,64],[52,65,52,66],[53,7,53,8],[53,9,53,10],[53,11,53,12],[53,13,53,14],[53,15,53,16],[53,17,53,18],[53,19,53,20],[53,21,53,22],[53,23,53,24],[53,25,53,26],[53,27,53,28],[53,29,53,30],[53,31,53,32],[53,33,53,34],[53,35,53,36],[53,37,53,38],[53,39,53,40],[53,41,53,42],[53,43,53,44],[53,45,53,46],[53,47,53,48],[52,43,52,44],[52,45,52,46],[52,47,52,48],[52,49,52,50],[52,51,52,52],[52,53,52,54],[52,55,52,56],[52,57,52,58],[52,59,52,60],[52,25,52,26],[52,27,52,28],[52,29,52,30],[52,31,52,32],[52,33,52,34],[52,35,52,36],[52,37,52,38],[52,39,52,40],[52,41,52,42],[52,7,52,8],[52,9,52,10],[52,11,52,12],[52,13,52,14],[52,15,52,16],[52,17,52,18],[52,19,52,20],[52,21,52,22],[52,23,52,24],[46,6,47,6],[48,6,49,6],[50,6,51,6],[44,5,45,5],[46,5,47,5],[48,5,49,5],[50,5,51,5],[22,6,23,6],[24,6,25,6],[26,6,27,6],[28,6,29,6],[30,6,31,6],[32,6,33,6],[34,6,35,6],[36,6,37,6],[38,6,39,6],[40,6,41,6],[42,6,43,6],[44,6,45,6],[34,5,35,5],[36,5,37,5],[38,5,39,5],[40,5,41,5],[42,5,43,5],[24,5,25,5],[26,5,27,5],[28,5,29,5],[30,5,31,5],[32,5,33,5],[20,5,21,5],[20,6,21,6],[22,4,23,4],[20,7,20,8],[21,7,21,8],[22,5,23,5],[20,9,20,10],[21,9,21,10],[20,11,20,12],[21,11,21,12],[20,13,20,14],[21,13,21,14],[20,15,20,16],[21,15,21,16],[20,17,20,18],[21,17,21,18],[20,19,20,20],[21,19,21,20],[20,21,20,22],[21,21,21,22],[20,23,20,24],[21,23,21,24],[20,25,20,26],[21,25,21,26],[20,27,20,28],[21,27,21,28],[20,29,20,30],[21,29,21,30],[20,31,20,32],[21,31,21,32],[20,33,20,34],[21,33,21,34],[20,35,20,36],[21,35,21,36],[20,37,20,38],[21,37,21,38],[21,53,21,54],[20,55,20,56],[21,55,21,56],[20,45,20,46],[21,45,21,46],[20,47,20,48],[21,47,21,48],[20,49,20,50],[21,49,21,50],[20,65,20,66],[21,61,21,62],[21,63,21,64],[21,65,21,66],[24,4,25,4],[26,4,27,4],[20,57,20,58],[21,57,21,58],[21,59,21,60],[20,59,20,60],[20,61,20,62],[20,63,20,64],[20,51,20,52],[21,51,21,52],[20,53,20,54],[20,3,21,4],[24,3,25,3],[26,3,27,3],[20,39,20,40],[21,39,21,40],[20,41,20,42],[21,41,21,42],[20,43,20,44],[21,43,21,44],[46,4,47,4],[48,4,49,4],[40,3,41,3],[42,3,43,3],[44,3,45,3],[46,3,47,3],[48,3,49,3],[50,3,51,3],[50,4,51,4],[44,4,45,4],[28,3,29,3],[30,3,31,3],[32,3,33,3],[34,3,35,3],[36,3,37,3],[38,3,39,3],[22,3,23,3],[40,4,41,4],[42,4,43,4],[38,4,39,4],[28,4,29,4],[30,4,31,4],[32,4,33,4],[34,4,35,4],[36,4,37,4]]}
[]
[]
[]
[]
[]
[]
[]
[]
[]
[]
[]
[]
[]
[]
[null,null,null,"Hodnocení technické úrovně metodou PATTERN:"]
[]
[]
[]
[]
[null,null,null,null,null,null,null,null,null,null,null,null,null,null,null,null,null,null,null,null,null,null,null,null,null,null,null,null,null,null,null,null,null,null,null,null,null,null,null,null,null,null,null,null,null,null,null,null,null,null,null,null,null,null,null,null,null,null,null,null,null,null,null,null,null,null,null,null,null,null,null,null,null,null,null,null,"VARIANTY","VÝZNAMNOSTI",null,null,null,null,null,null,"Popisky řádků","Součet z VÝZNAMNOSTI"]
[null,null,null,"Kritérium (parametr)",null,"Jednotka","Váha (q)",{"$f":"'Vstupní data'!N23","v":"V1"},null,{"$f":"'Vstupní data'!N24","v":"V2"},null,{"$f":"'Vstupní data'!N25","v":"V3"},null,{"$f":"'Vstupní data'!N26","v":"V4"},null,{"$f":"'Vstupní data'!N27","v":"V5"},null,{"$f":"'Vstupní data'!N28","v":"V6"},null,{"$f":"'Vstupní data'!N29","v":"V7"},null,{"$f":"'Vstupní data'!N30","v":""},null,{"$f":"'Vstupní data'!N31","v":""},null,{"$f":"'Vstupní data'!N32","v":""},null,{"$f":"'Vstupní data'!N33","v":""},null,{"$f":"'Vstupní data'!N34","v":""},null,{"$f":"'Vstupní data'!N35","v":""},null,{"$f":"'Vstupní data'!N36","v":""},null,{"$f":"'Vstupní data'!N37","v":""},null,{"$f":"'Vstupní data'!N38","v":""},null,{"$f":"'Vstupní data'!N39","v":""},null,{"$f":"'Vstupní data'!N40","v":""},null,{"$f":"'Vstupní data'!N41","v":""},null,{"$f":"'Vstupní data'!N42","v":""},null,{"$f":"'Vstupní data'!N43","v":""},null,{"$f":"'Vstupní data'!N44","v":""},null,{"$f":"'Vstupní data'!N45","v":""},null,{"$f":"'Vstupní data'!N46","v":""},null,{"$f":"'Vstupní data'!N47","v":""},null,{"$f":"'Vstupní data'!N48","v":""},null,{"$f":"'Vstupní data'!N49","v":""},null,{"$f":"'Vstupní data'!N50","v":""},null,{"$f":"'Vstupní data'!N51","v":""},null,{"$f":"'Vstupní data'!N52","v":""},null,null,null,null,null,null,null,null,null,null,{"$f":"H21","v":"V1"},{"$f":"H53","v":1.7455931768388107},null,null,null,null,null,null,"V1",1.7455931768388107]
[null,null,null,null,null,null,null,{"$f":"IF(H21 <> \"\", 'Vstupní data'!O23, \"\")","v":"ABB 1600 - 6/1.45"},null,{"$f":"IF(J21 <> \"\", 'Vstupní data'!O24, \"\")","v":"ABB 1600 - 10/1.45"},null,{"$f":"IF(L21 <> \"\", 'Vstupní data'!O25, \"\")","v":"KUKA KR6 R1820"},null,{"$f":"IF(N21 <> \"\", 'Vstupní data'!O26, \"\")","v":"KUKA KR10 R1420"},null,{"$f":"IF(P21 <> \"\", 'Vstupní data'!O27, \"\")","v":"Yaskawa Motoman HP20F"},null,{"$f":"IF(R21 <> \"\", 'Vstupní data'!O28, \"\")","v":"Fanuc M-10iA/10M"},null,{"$f":"IF(T21 <> \"\", 'Vstupní data'!O29, \"\")","v":"Fanuc M-10iA/7L"},null,{"$f":"IF(V21 <> \"\", 'Vstupní data'!O30, \"\")","v":""},null,{"$f":"IF(X21 <> \"\", 'Vstupní data'!O31, \"\")","v":""},null,{"$f":"IF(Z21 <> \"\", 'Vstupní data'!O32, \"\")","v":""},null,{"$f":"IF(AB21 <> \"\", 'Vstupní data'!O33, \"\")","v":""},null,{"$f":"IF(AD21 <> \"\", 'Vstupní data'!O34, \"\")","v":""},null,{"$f":"IF(AF21 <> \"\", 'Vstupní data'!O35, \"\")","v":""},null,{"$f":"IF(AH21 <> \"\", 'Vstupní data'!O36, \"\")","v":""},null,{"$f":"IF(AJ21 <> \"\", 'Vstupní data'!O37, \"\")","v":""},null,{"$f":"IF(AL21 <> \"\", 'Vstupní data'!O38, \"\")","v":""},null,{"$f":"IF(AN21 <> \"\", 'Vstupní data'!O39, \"\")","v":""},null,{"$f":"IF(AP21 <> \"\", 'Vstupní data'!O40, \"\")","v":""},null,{"$f":"IF(AR21 <> \"\", 'Vstupní data'!O41, \"\")","v":""},null,{"$f":"IF(AT21 <> \"\", 'Vstupní data'!O42, \"\")","v":""},null,{"$f":"IF(AV21 <> \"\", 'Vstupní data'!O43, \"\")","v":""},null,{"$f":"IF(AX21 <> \"\", 'Vstupní data'!O44, \"\")","v":""},null,{"$f":"IF(AZ21 <> \"\", 'Vstupní data'!O45, \"\")","v":""},null,{"$f":"IF(BB21 <> \"\", 'Vstupní data'!O46, \"\")","v":""},null,{"$f":"IF(BD21 <> \"\", 'Vstupní data'!O47, \"\")","v":""},null,{"$f":"IF(BF21 <> \"\", 'Vstupní data'!O48, \"\")","v":""},null,{"$f":"IF(BH21 <> \"\", 'Vstupní data'!O49, \"\")","v":""},null,{"$f":"IF(BJ21 <> \"\", 'Vstupní data'!O50, \"\")","v":""},null,{"$f":"IF(BL21 <> \"\", 'Vstupní data'!O51, \"\")","v":""},null,{"$f":"IF(BN21 <> \"\", 'Vstupní data'!O52, \"\")","v":""},null,null,null,null,null,null,null,null,null,null,{"$f":"J21","v":"V2"},{"$f":"J53","v":1.3279862389149713},null,null,null,null,null,null,"V2",1.3279862389149713]
[null,null,null,{"$f":"'Vstupní data'!P19","v":"K1"},{"$f":"'Vstupní data'!P20","v":"Cena"},{"$f":"'Vstupní data'!P21","v":"EUR"},{"$f":"IFERROR(GETPIVOTDATA(\"[Measures].[Míra 1]\",'Porovnání v trojúhelníku párů'!$W$8,\"[Tabulka1].[Kritéria]\",\"[Tabulka1].[Kritéria].&[1]\"),0)","v":0.26666666666666666},{"$f":"'Vstupní data'!P23","v":28400},null,{"$f":"'Vstupní data'!P24","v":25600},null,{"$f":"'Vstupní data'!P25","v":35000},null,{"$f":"'Vstupní data'!P26","v":29500},null,{"$f":"'Vstupní data'!P27","v":36500},null,{"$f":"'Vstupní data'!P28","v":38000},null,{"$f":"'Vstupní data'!P29","v":42000},null,{"$f":"'Vstupní data'!P30","v":0},null,{"$f":"'Vstupní data'!P31","v":0},null,{"$f":"'Vstupní data'!P32","v":0},null,{"$f":"'Vstupní data'!P33","v":0},null,{"$f":"'Vstupní data'!P34","v":0},null,{"$f":"'Vstupní data'!P35","v":0},null,{"$f":"'Vstupní data'!P36","v":0},null,{"$f":"'Vstupní data'!P37","v":0},null,{"$f":"'Vstupní data'!P38","v":0},null,{"$f":"'Vstupní data'!P39","v":0},null,{"$f":"'Vstupní data'!P40","v":0},null,{"$f":"'Vstupní data'!P41","v":0},null,{"$f":"'Vstupní data'!P42","v":0},null,{"$f":"'Vstupní data'!P43","v":0},null,{"$f":"'Vstupní data'!P44","v":0},null,{"$f":"'Vstupní data'!P45","v":0},null,{"$f":"'Vstupní data'!P46","v":0},null,{"$f":"'Vstupní data'!P47","v":0},null,{"$f":"'Vstupní data'!P48","v":0},null,{"$f":"'Vstupní data'!P49","v":0},null,{"$f":"'Vstupní data'!P50","v":0},null,{"$f":"'Vstupní data'!P51","v":0},null,{"$f":"'Vstupní data'!P52","v":0},null,null,null,null,null,null,null,null,null,null,{"$f":"L21","v":"V3"},{"$f":"L53","v":1.3062811663489899},null,null,null,null,null,null,"V3",1.3062811663489899]
[null,null,null,null,null,null,null,{"$f":"IFERROR(IF('Vstupní data'!$P$22=\"MAX\",H23/SMALL($H$23:$BO$23,COUNTIF($H$23:$BO$23,0)+1),MAX($H$23:$BO$23)/H23),\"\")","v":1.4788732394366197},{"$f":"IFERROR($G23*H24,\"\")","v":0.39436619718309862},{"$f":"IFERROR(IF('Vstupní data'!$P$22=\"MAX\",J23/SMALL($H$23:$BO$23,COUNTIF($H$23:$BO$23,0)+1),MAX($H$23:$BO$23)/J23),\"\")","v":1.640625},{"$f":"IFERROR($G23*J24,\"\")","v":0.4375},{"$f":"IFERROR(IF('Vstupní data'!$P$22=\"MAX\",L23/SMALL($H$23:$BO$23,COUNTIF($H$23:$BO$23,0)+1),MAX($H$23:$BO$23)/L23),\"\")","v":1.2},{"$f":"IFERROR($G23*L24,\"\")","v":0.32},{"$f":"IFERROR(IF('Vstupní data'!$P$22=\"MAX\",N23/SMALL($H$23:$BO$23,COUNTIF($H$23:$BO$23,0)+1),MAX($H$23:$BO$23)/N23),\"\")","v":1.423728813559322},{"$f":"IFERROR($G23*N24,\"\")","v":0.37966101694915255},{"$f":"IFERROR(IF('Vstupní data'!$P$22=\"MAX\",P23/SMALL($H$23:$BO$23,COUNTIF($H$23:$BO$23,0)+1),MAX($H$23:$BO$23)/P23),\"\")","v":1.1506849315068493},{"$f":"IFERROR($G23*P24,\"\")","v":0.30684931506849311},{"$f":"IFERROR(IF('Vstupní data'!$P$22=\"MAX\",R23/SMALL($H$23:$BO$23,COUNTIF($H$23:$BO$23,0)+1),MAX($H$23:$BO$23)/R23),\"\")","v":1.1052631578947369},{"$f":"IFERROR($G23*R24,\"\")","v":0.29473684210526319},{"$f":"IFERROR(IF('Vstupní data'!$P$22=\"MAX\",T23/SMALL($H$23:$BO$23,COUNTIF($H$23:$BO$23,0)+1),MAX($H$23:$BO$23)/T23),\"\")","v":1},{"$f":"IFERROR($G23*T24,\"\")","v":0.26666666666666666},{"$f":"IFERROR(IF('Vstupní data'!$P$22=\"MAX\",V23/SMALL($H$23:$BO$23,COUNTIF($H$23:$BO$23,0)+1),MAX($H$23:$BO$23)/V23),\"\")","v":""},{"$f":"IFERROR($G23*V24,\"\")","v":""},{"$f":"IFERROR(IF('Vstupní data'!$P$22=\"MAX\",X23/SMALL($H$23:$BO$23,COUNTIF($H$23:$BO$23,0)+1),MAX($H$23:$BO$23)/X23),\"\")","v":""},{"$f":"IFERROR($G23*X24,\"\")","v":""},{"$f":"IFERROR(IF('Vstupní data'!$P$22=\"MAX\",Z23/SMALL($H$23:$BO$23,COUNTIF($H$23:$BO$23,0)+1),MAX($H$23:$BO$23)/Z23),\"\")","v":""},{"$f":"IFERROR($G23*Z24,\"\")","v":""},{"$f":"IFERROR(IF('Vstupní data'!$P$22=\"MAX\",AB23/SMALL($H$23:$BO$23,COUNTIF($H$23:$BO$23,0)+1),MAX($H$23:$BO$23)/AB23),\"\")","v":""},{"$f":"IFERROR($G23*AB24,\"\")","v":""},{"$f":"IFERROR(IF('Vstupní data'!$P$22=\"MAX\",AD23/SMALL($H$23:$BO$23,COUNTIF($H$23:$BO$23,0)+1),MAX($H$23:$BO$23)/AD23),\"\")","v":""},{"$f":"IFERROR($G23*AD24,\"\")","v":""},{"$f":"IFERROR(IF('Vstupní data'!$P$22=\"MAX\",AF23/SMALL($H$23:$BO$23,COUNTIF($H$23:$BO$23,0)+1),MAX($H$23:$BO$23)/AF23),\"\")","v":""},{"$f":"IFERROR($G23*AF24,\"\")","v":""},{"$f":"IFERROR(IF('Vstupní data'!$P$22=\"MAX\",AH23/SMALL($H$23:$BO$23,COUNTIF($H$23:$BO$23,0)+1),MAX($H$23:$BO$23)/AH23),\"\")","v":""},{"$f":"IFERROR($G23*AH24,\"\")","v":""},{"$f":"IFERROR(IF('Vstupní data'!$P$22=\"MAX\",AJ23/SMALL($H$23:$BO$23,COUNTIF($H$23:$BO$23,0)+1),MAX($H$23:$BO$23)/AJ23),\"\")","v":""},{"$f":"IFERROR($G23*AJ24,\"\")","v":""},{"$f":"IFERROR(IF('Vstupní data'!$P$22=\"MAX\",AL23/SMALL($H$23:$BO$23,COUNTIF($H$23:$BO$23,0)+1),MAX($H$23:$BO$23)/AL23),\"\")","v":""},{"$f":"IFERROR($G23*AL24,\"\")","v":""},{"$f":"IFERROR(IF('Vstupní data'!$P$22=\"MAX\",AN23/SMALL($H$23:$BO$23,COUNTIF($H$23:$BO$23,0)+1),MAX($H$23:$BO$23)/AN23),\"\")","v":""},{"$f":"IFERROR($G23*AN24,\"\")","v":""},{"$f":"IFERROR(IF('Vstupní data'!$P$22=\"MAX\",AP23/SMALL($H$23:$BO$23,COUNTIF($H$23:$BO$23,0)+1),MAX($H$23:$BO$23)/AP23),\"\")","v":""},{"$f":"IFERROR($G23*AP24,\"\")","v":""},{"$f":"IFERROR(IF('Vstupní data'!$P$22=\"MAX\",AR23/SMALL($H$23:$BO$23,COUNTIF($H$23:$BO$23,0)+1),MAX($H$23:$BO$23)/AR23),\"\")","v":""},{"$f":"IFERROR($G23*AR24,\"\")","v":""},{"$f":"IFERROR(IF('Vstupní data'!$P$22=\"MAX\",AT23/SMALL($H$23:$BO$23,COUNTIF($H$23:$BO$23,0)+1),MAX($H$23:$BO$23)/AT23),\"\")","v":""},{"$f":"IFERROR($G23*AT24,\"\")","v":""},{"$f":"IFERROR(IF('Vstupní data'!$P$22=\"MAX\",AV23/SMALL($H$23:$BO$23,COUNTIF($H$23:$BO$23,0)+1),MAX($H$23:$BO$23)/AV23),\"\")","v":""},{"$f":"IFERROR($G23*AV24,\"\")","v":""},{"$f":"IFERROR(IF('Vstupní data'!$P$22=\"MAX\",AX23/SMALL($H$23:$BO$23,COUNTIF($H$23:$BO$23,0)+1),MAX($H$23:$BO$23)/AX23),\"\")","v":""},{"$f":"IFERROR($G23*AX24,\"\")","v":""},{"$f":"IFERROR(IF('Vstupní data'!$P$22=\"MAX\",AZ23/SMALL($H$23:$BO$23,COUNTIF($H$23:$BO$23,0)+1),MAX($H$23:$BO$23)/AZ23),\"\")","v":""},{"$f":"IFERROR($G23*AZ24,\"\")","v":""},{"$f":"IFERROR(IF('Vstupní data'!$P$22=\"MAX\",BB23/SMALL($H$23:$BO$23,COUNTIF($H$23:$BO$23,0)+1),MAX($H$23:$BO$23)/BB23),\"\")","v":""},{"$f":"IFERROR($G23*BB24,\"\")","v":""},{"$f":"IFERROR(IF('Vstupní data'!$P$22=\"MAX\",BD23/SMALL($H$23:$BO$23,COUNTIF($H$23:$BO$23,0)+1),MAX($H$23:$BO$23)/BD23),\"\")","v":""},{"$f":"IFERROR($G23*BD24,\"\")","v":""},{"$f":"IFERROR(IF('Vstupní data'!$P$22=\"MAX\",BF23/SMALL($H$23:$BO$23,COUNTIF($H$23:$BO$23,0)+1),MAX($H$23:$BO$23)/BF23),\"\")","v":""},{"$f":"IFERROR($G23*BF24,\"\")","v":""},{"$f":"IFERROR(IF('Vstupní data'!$P$22=\"MAX\",BH23/SMALL($H$23:$BO$23,COUNTIF($H$23:$BO$23,0)+1),MAX($H$23:$BO$23)/BH23),\"\")","v":""},{"$f":"IFERROR($G23*BH24,\"\")","v":""},{"$f":"IFERROR(IF('Vstupní data'!$P$22=\"MAX\",BJ23/SMALL($H$23:$BO$23,COUNTIF($H$23:$BO$23,0)+1),MAX($H$23:$BO$23)/BJ23),\"\")","v":""},{"$f":"IFERROR($G23*BJ24,\"\")","v":""},{"$f":"IFERROR(IF('Vstupní data'!$P$22=\"MAX\",BL23/SMALL($H$23:$BO$23,COUNTIF($H$23:$BO$23,0)+1),MAX($H$23:$BO$23)/BL23),\"\")","v":""},{"$f":"IFERROR($G23*BL24,\"\")","v":""},{"$f":"IFERROR(IF('Vstupní data'!$P$22=\"MAX\",BN23/SMALL($H$23:$BO$23,COUNTIF($H$23:$BO$23,0)+1),MAX($H$23:$BO$23)/BN23),\"\")","v":""},{"$f":"IFERROR($G23*BN24,\"\")","v":""},null,null,null,null,null,null,null,null,null,{"$f":"N21","v":"V4"},{"$f":"N53","v":1.3751231952960559},null,null,null,null,null,null,"V4",1.3751231952960559]
[null,null,null,{"$f":"'Vstupní data'!Q19","v":"K2"},{"$f":"'Vstupní data'!Q20","v":"Nosnost"},{"$f":"'Vstupní data'!Q21","v":"kg"},{"$f":"IFERROR(GETPIVOTDATA(\"[Measures].[Míra 1]\",'Porovnání v trojúhelníku párů'!$W$8,\"[Tabulka1].[Kritéria]\",\"[Tabulka1].[Kritéria].&[2]\"),0)","v":8.8888888888888892E-2},{"$f":"'Vstupní data'!Q23","v":6},null,{"$f":"'Vstupní data'!Q24","v":10},null,{"$f":"'Vstupní data'!Q25","v":6},null,{"$f":"'Vstupní data'!Q26","v":10},null,{"$f":"'Vstupní data'!Q27","v":20},null,{"$f":"'Vstupní data'!Q28","v":10},null,{"$f":"'Vstupní data'!Q29","v":7},null,{"$f":"'Vstupní data'!Q30","v":0},null,{"$f":"'Vstupní data'!Q31","v":0},null,{"$f":"'Vstupní data'!Q32","v":0},null,{"$f":"'Vstupní data'!Q33","v":0},null,{"$f":"'Vstupní data'!Q34","v":0},null,{"$f":"'Vstupní data'!Q35","v":0},null,{"$f":"'Vstupní data'!Q36","v":0},null,{"$f":"'Vstupní data'!Q37","v":0},null,{"$f":"'Vstupní data'!Q38","v":0},null,{"$f":"'Vstupní data'!Q39","v":0},null,{"$f":"'Vstupní data'!Q40","v":0},null,{"$f":"'Vstupní data'!Q41","v":0},null,{"$f":"'Vstupní data'!Q42","v":0},null,{"$f":"'Vstupní data'!Q43","v":0},null,{"$f":"'Vstupní data'!Q44","v":0},null,{"$f":"'Vstupní data'!Q45","v":0},null,{"$f":"'Vstupní data'!Q46","v":0},null,{"$f":"'Vstupní data'!Q47","v":0},null,{"$f":"'Vstupní data'!Q48","v":0},null,{"$f":"'Vstupní data'!Q49","v":0},null,{"$f":"'Vstupní data'!Q50","v":0},null,{"$f":"'Vstupní data'!Q51","v":0},null,{"$f":"'Vstupní data'!Q52","v":0},null,null,null,null,null,null,null,null,null,null,{"$f":"P21","v":"V5"},{"$f":"P53","v":1.2851487412552434},null,null,null,null,null,null,"V5",1.2851487412552434]
[null,null,null,null,null,null,null,{"$f":"IFERROR(IF('Vstupní data'!$Q$22=\"MAX\",H25/SMALL($H$25:$BO$25,COUNTIF($H$25:$BO$25,0)+1),MAX($H$25:$BO$25)/H25),\"\")","v":1},{"$f":"IFERROR($G25*H26,\"\")","v":8.8888888888888892E-2},{"$f":"IFERROR(IF('Vstupní data'!$Q$22=\"MAX\",J25/SMALL($H$25:$BO$25,COUNTIF($H$25:$BO$25,0)+1),MAX($H$25:$BO$25)/J25),\"\")","v":1.6666666666666667},{"$f":"IFERROR($G25*J26,\"\")","v":0.14814814814814817},{"$f":"IFERROR(IF('Vstupní data'!$Q$22=\"MAX\",L25/SMALL($H$25:$BO$25,COUNTIF($H$25:$BO$25,0)+1),MAX($H$25:$BO$25)/L25),\"\")","v":1},{"$f":"IFERROR($G25*L26,\"\")","v":8.8888888888888892E-2},{"$f":"IFERROR(IF('Vstupní data'!$Q$22=\"MAX\",N25/SMALL($H$25:$BO$25,COUNTIF($H$25:$BO$25,0)+1),MAX($H$25:$BO$25)/N25),\"\")","v":1.6666666666666667},{"$f":"IFERROR($G25*N26,\"\")","v":0.14814814814814817},{"$f":"IFERROR(IF('Vstupní data'!$Q$22=\"MAX\",P25/SMALL($H$25:$BO$25,COUNTIF($H$25:$BO$25,0)+1),MAX($H$25:$BO$25)/P25),\"\")","v":3.3333333333333335},{"$f":"IFERROR($G25*P26,\"\")","v":0.29629629629629634},{"$f":"IFERROR(IF('Vstupní data'!$Q$22=\"MAX\",R25/SMALL($H$25:$BO$25,COUNTIF($H$25:$BO$25,0)+1),MAX($H$25:$BO$25)/R25),\"\")","v":1.6666666666666667},{"$f":"IFERROR($G25*R26,\"\")","v":0.14814814814814817},{"$f":"IFERROR(IF('Vstupní data'!$Q$22=\"MAX\",T25/SMALL($H$25:$BO$25,COUNTIF($H$25:$BO$25,0)+1),MAX($H$25:$BO$25)/T25),\"\")","v":1.1666666666666667},{"$f":"IFERROR($G25*T26,\"\")","v":0.10370370370370371},{"$f":"IFERROR(IF('Vstupní data'!$Q$22=\"MAX\",V25/SMALL($H$25:$BO$25,COUNTIF($H$25:$BO$25,0)+1),MAX($H$25:$BO$25)/V25),\"\")","v":0},{"$f":"IFERROR($G25*V26,\"\")","v":0},{"$f":"IFERROR(IF('Vstupní data'!$Q$22=\"MAX\",X25/SMALL($H$25:$BO$25,COUNTIF($H$25:$BO$25,0)+1),MAX($H$25:$BO$25)/X25),\"\")","v":0},{"$f":"IFERROR($G25*X26,\"\")","v":0},{"$f":"IFERROR(IF('Vstupní data'!$Q$22=\"MAX\",Z25/SMALL($H$25:$BO$25,COUNTIF($H$25:$BO$25,0)+1),MAX($H$25:$BO$25)/Z25),\"\")","v":0},{"$f":"IFERROR($G25*Z26,\"\")","v":0},{"$f":"IFERROR(IF('Vstupní data'!$Q$22=\"MAX\",AB25/SMALL($H$25:$BO$25,COUNTIF($H$25:$BO$25,0)+1),MAX($H$25:$BO$25)/AB25),\"\")","v":0},{"$f":"IFERROR($G25*AB26,\"\")","v":0},{"$f":"IFERROR(IF('Vstupní data'!$Q$22=\"MAX\",AD25/SMALL($H$25:$BO$25,COUNTIF($H$25:$BO$25,0)+1),MAX($H$25:$BO$25)/AD25),\"\")","v":0},{"$f":"IFERROR($G25*AD26,\"\")","v":0},{"$f":"IFERROR(IF('Vstupní data'!$Q$22=\"MAX\",AF25/SMALL($H$25:$BO$25,COUNTIF($H$25:$BO$25,0)+1),MAX($H$25:$BO$25)/AF25),\"\")","v":0},{"$f":"IFERROR($G25*AF26,\"\")","v":0},{"$f":"IFERROR(IF('Vstupní data'!$Q$22=\"MAX\",AH25/SMALL($H$25:$BO$25,COUNTIF($H$25:$BO$25,0)+1),MAX($H$25:$BO$25)/AH25),\"\")","v":0},{"$f":"IFERROR($G25*AH26,\"\")","v":0},{"$f":"IFERROR(IF('Vstupní data'!$Q$22=\"MAX\",AJ25/SMALL($H$25:$BO$25,COUNTIF($H$25:$BO$25,0)+1),MAX($H$25:$BO$25)/AJ25),\"\")","v":0},{"$f":"IFERROR($G25*AJ26,\"\")","v":0},{"$f":"IFERROR(IF('Vstupní data'!$Q$22=\"MAX\",AL25/SMALL($H$25:$BO$25,COUNTIF($H$25:$BO$25,0)+1),MAX($H$25:$BO$25)/AL25),\"\")","v":0},{"$f":"IFERROR($G25*AL26,\"\")","v":0},{"$f":"IFERROR(IF('Vstupní data'!$Q$22=\"MAX\",AN25/SMALL($H$25:$BO$25,COUNTIF($H$25:$BO$25,0)+1),MAX($H$25:$BO$25)/AN25),\"\")","v":0},{"$f":"IFERROR($G25*AN26,\"\")","v":0},{"$f":"IFERROR(IF('Vstupní data'!$Q$22=\"MAX\",AP25/SMALL($H$25:$BO$25,COUNTIF($H$25:$BO$25,0)+1),MAX($H$25:$BO$25)/AP25),\"\")","v":0},{"$f":"IFERROR($G25*AP26,\"\")","v":0},{"$f":"IFERROR(IF('Vstupní data'!$Q$22=\"MAX\",AR25/SMALL($H$25:$BO$25,COUNTIF($H$25:$BO$25,0)+1),MAX($H$25:$BO$25)/AR25),\"\")","v":0},{"$f":"IFERROR($G25*AR26,\"\")","v":0},{"$f":"IFERROR(IF('Vstupní data'!$Q$22=\"MAX\",AT25/SMALL($H$25:$BO$25,COUNTIF($H$25:$BO$25,0)+1),MAX($H$25:$BO$25)/AT25),\"\")","v":0},{"$f":"IFERROR($G25*AT26,\"\")","v":0},{"$f":"IFERROR(IF('Vstupní data'!$Q$22=\"MAX\",AV25/SMALL($H$25:$BO$25,COUNTIF($H$25:$BO$25,0)+1),MAX($H$25:$BO$25)/AV25),\"\")","v":0},{"$f":"IFERROR($G25*AV26,\"\")","v":0},{"$f":"IFERROR(IF('Vstupní data'!$Q$22=\"MAX\",AX25/SMALL($H$25:$BO$25,COUNTIF($H$25:$BO$25,0)+1),MAX($H$25:$BO$25)/AX25),\"\")","v":0},{"$f":"IFERROR($G25*AX26,\"\")","v":0},{"$f":"IFERROR(IF('Vstupní data'!$Q$22=\"MAX\",AZ25/SMALL($H$25:$BO$25,COUNTIF($H$25:$BO$25,0)+1),MAX($H$25:$BO$25)/AZ25),\"\")","v":0},{"$f":"IFERROR($G25*AZ26,\"\")","v":0},{"$f":"IFERROR(IF('Vstupní data'!$Q$22=\"MAX\",BB25/SMALL($H$25:$BO$25,COUNTIF($H$25:$BO$25,0)+1),MAX($H$25:$BO$25)/BB25),\"\")","v":0},{"$f":"IFERROR($G25*BB26,\"\")","v":0},{"$f":"IFERROR(IF('Vstupní data'!$Q$22=\"MAX\",BD25/SMALL($H$25:$BO$25,COUNTIF($H$25:$BO$25,0)+1),MAX($H$25:$BO$25)/BD25),\"\")","v":0},{"$f":"IFERROR($G25*BD26,\"\")","v":0},{"$f":"IFERROR(IF('Vstupní data'!$Q$22=\"MAX\",BF25/SMALL($H$25:$BO$25,COUNTIF($H$25:$BO$25,0)+1),MAX($H$25:$BO$25)/BF25),\"\")","v":0},{"$f":"IFERROR($G25*BF26,\"\")","v":0},{"$f":"IFERROR(IF('Vstupní data'!$Q$22=\"MAX\",BH25/SMALL($H$25:$BO$25,COUNTIF($H$25:$BO$25,0)+1),MAX($H$25:$BO$25)/BH25),\"\")","v":0},{"$f":"IFERROR($G25*BH26,\"\")","v":0},{"$f":"IFERROR(IF('Vstupní data'!$Q$22=\"MAX\",BJ25/SMALL($H$25:$BO$25,COUNTIF($H$25:$BO$25,0)+1),MAX($H$25:$BO$25)/BJ25),\"\")","v":0},{"$f":"IFERROR($G25*BJ26,\"\")","v":0},{"$f":"IFERROR(IF('Vstupní data'!$Q$22=\"MAX\",BL25/SMALL($H$25:$BO$25,COUNTIF($H$25:$BO$25,0)+1),MAX($H$25:$BO$25)/BL25),\"\")","v":0},{"$f":"IFERROR($G25*BL26,\"\")","v":0},{"$f":"IFERROR(IF('Vstupní data'!$Q$22=\"MAX\",BN25/SMALL($H$25:$BO$25,COUNTIF($H$25:$BO$25,0)+1),MAX($H$25:$BO$25)/BN25),\"\")","v":0},{"$f":"IFERROR($G25*BN26,\"\")","v":0},null,null,null,null,null,null,null,null,null,{"$f":"R21","v":"V6"},{"$f":"R53","v":1.4054308942416776},null,null,null,null,null,null,"V6",1.4054308942416776]
[null,null,null,{"$f":"'Vstupní data'!R19","v":"K3"},{"$f":"'Vstupní data'!R20","v":"Dosah (horinz.)"},{"$f":"'Vstupní data'!R21","v":"m"},{"$f":"IFERROR(GETPIVOTDATA(\"[Measures].[Míra 1]\",'Porovnání v trojúhelníku párů'!$W$8,\"[Tabulka1].[Kritéria]\",\"[Tabulka1].[Kritéria].&[3]\"),0)","v":0.17777777777777778},{"$f":"'Vstupní data'!R23","v":1.45},null,{"$f":"'Vstupní data'!R24","v":1.45},null,{"$f":"'Vstupní data'!R25","v":1.82},null,{"$f":"'Vstupní data'!R26","v":1.42},null,{"$f":"'Vstupní data'!R27","v":1.72},null,{"$f":"'Vstupní data'!R28","v":1.42},null,{"$f":"'Vstupní data'!R29","v":1.63},null,{"$f":"'Vstupní data'!R30","v":0},null,{"$f":"'Vstupní data'!R31","v":0},null,{"$f":"'Vstupní data'!R32","v":0},null,{"$f":"'Vstupní data'!R33","v":0},null,{"$f":"'Vstupní data'!R34","v":0},null,{"$f":"'Vstupní data'!R35","v":0},null,{"$f":"'Vstupní data'!R36","v":0},null,{"$f":"'Vstupní data'!R37","v":0},null,{"$f":"'Vstupní data'!R38","v":0},null,{"$f":"'Vstupní data'!R39","v":0},null,{"$f":"'Vstupní data'!R40","v":0},null,{"$f":"'Vstupní data'!R41","v":0},null,{"$f":"'Vstupní data'!R42","v":0},null,{"$f":"'Vstupní data'!R43","v":0},null,{"$f":"'Vstupní data'!R44","v":0},null,{"$f":"'Vstupní data'!R45","v":0},null,{"$f":"'Vstupní data'!R46","v":0},null,{"$f":"'Vstupní data'!R47","v":0},null,{"$f":"'Vstupní data'!R48","v":0},null,{"$f":"'Vstupní data'!R49","v":0},null,{"$f":"'Vstupní data'!R50","v":0},null,{"$f":"'Vstupní data'!R51","v":0},null,{"$f":"'Vstupní data'!R52","v":0},null,null,null,null,null,null,null,null,null,null,{"$f":"T21","v":"V7"},{"$f":"T53","v":1.3592073541708434},null,null,null,null,null,null,"V7",1.3592073541708434]
[null,null,null,null,null,null,null,{"$f":"IFERROR(IF('Vstupní data'!$R$22=\"MAX\",H27/SMALL($H$27:$BO$27,COUNTIF($H$27:$BO$27,0)+1),MAX($H$27:$BO$27)/H27),\"\")","v":1.0211267605633803},{"$f":"IFERROR($G27*H28,\"\")","v":0.18153364632237873},{"$f":"IFERROR(IF('Vstupní data'!$R$22=\"MAX\",J27/SMALL($H$27:$BO$27,COUNTIF($H$27:$BO$27,0)+1),MAX($H$27:$BO$27)/J27),\"\")","v":1.0211267605633803},{"$f":"IFERROR($G27*J28,\"\")","v":0.18153364632237873},{"$f":"IFERROR(IF('Vstupní data'!$R$22=\"MAX\",L27/SMALL($H$27:$BO$27,COUNTIF($H$27:$BO$27,0)+1),MAX($H$27:$BO$27)/L27),\"\")","v":1.2816901408450705},{"$f":"IFERROR($G27*L28,\"\")","v":0.22785602503912364},{"$f":"IFERROR(IF('Vstupní data'!$R$22=\"MAX\",N27/SMALL($H$27:$BO$27,COUNTIF($H$27:$BO$27,0)+1),MAX($H$27:$BO$27)/N27),\"\")","v":1},{"$f":"IFERROR($G27*N28,\"\")","v":0.17777777777777778},{"$f":"IFERROR(IF('Vstupní data'!$R$22=\"MAX\",P27/SMALL($H$27:$BO$27,COUNTIF($H$27:$BO$27,0)+1),MAX($H$27:$BO$27)/P27),\"\")","v":1.2112676056338028},{"$f":"IFERROR($G27*P28,\"\")","v":0.21533646322378716},{"$f":"IFERROR(IF('Vstupní data'!$R$22=\"MAX\",R27/SMALL($H$27:$BO$27,COUNTIF($H$27:$BO$27,0)+1),MAX($H$27:$BO$27)/R27),\"\")","v":1},{"$f":"IFERROR($G27*R28,\"\")","v":0.17777777777777778},{"$f":"IFERROR(IF('Vstupní data'!$R$22=\"MAX\",T27/SMALL($H$27:$BO$27,COUNTIF($H$27:$BO$27,0)+1),MAX($H$27:$BO$27)/T27),\"\")","v":1.147887323943662},{"$f":"IFERROR($G27*T28,\"\")","v":0.20406885758998436},{"$f":"IFERROR(IF('Vstupní data'!$R$22=\"MAX\",V27/SMALL($H$27:$BO$27,COUNTIF($H$27:$BO$27,0)+1),MAX($H$27:$BO$27)/V27),\"\")","v":0},{"$f":"IFERROR($G27*V28,\"\")","v":0},{"$f":"IFERROR(IF('Vstupní data'!$R$22=\"MAX\",X27/SMALL($H$27:$BO$27,COUNTIF($H$27:$BO$27,0)+1),MAX($H$27:$BO$27)/X27),\"\")","v":0},{"$f":"IFERROR($G27*X28,\"\")","v":0},{"$f":"IFERROR(IF('Vstupní data'!$R$22=\"MAX\",Z27/SMALL($H$27:$BO$27,COUNTIF($H$27:$BO$27,0)+1),MAX($H$27:$BO$27)/Z27),\"\")","v":0},{"$f":"IFERROR($G27*Z28,\"\")","v":0},{"$f":"IFERROR(IF('Vstupní data'!$R$22=\"MAX\",AB27/SMALL($H$27:$BO$27,COUNTIF($H$27:$BO$27,0)+1),MAX($H$27:$BO$27)/AB27),\"\")","v":0},{"$f":"IFERROR($G27*AB28,\"\")","v":0},{"$f":"IFERROR(IF('Vstupní data'!$R$22=\"MAX\",AD27/SMALL($H$27:$BO$27,COUNTIF($H$27:$BO$27,0)+1),MAX($H$27:$BO$27)/AD27),\"\")","v":0},{"$f":"IFERROR($G27*AD28,\"\")","v":0},{"$f":"IFERROR(IF('Vstupní data'!$R$22=\"MAX\",AF27/SMALL($H$27:$BO$27,COUNTIF($H$27:$BO$27,0)+1),MAX($H$27:$BO$27)/AF27),\"\")","v":0},{"$f":"IFERROR($G27*AF28,\"\")","v":0},{"$f":"IFERROR(IF('Vstupní data'!$R$22=\"MAX\",AH27/SMALL($H$27:$BO$27,COUNTIF($H$27:$BO$27,0)+1),MAX($H$27:$BO$27)/AH27),\"\")","v":0},{"$f":"IFERROR($G27*AH28,\"\")","v":0},{"$f":"IFERROR(IF('Vstupní data'!$R$22=\"MAX\",AJ27/SMALL($H$27:$BO$27,COUNTIF($H$27:$BO$27,0)+1),MAX($H$27:$BO$27)/AJ27),\"\")","v":0},{"$f":"IFERROR($G27*AJ28,\"\")","v":0},{"$f":"IFERROR(IF('Vstupní data'!$R$22=\"MAX\",AL27/SMALL($H$27:$BO$27,COUNTIF($H$27:$BO$27,0)+1),MAX($H$27:$BO$27)/AL27),\"\")","v":0},{"$f":"IFERROR($G27*AL28,\"\")","v":0},{"$f":"IFERROR(IF('Vstupní data'!$R$22=\"MAX\",AN27/SMALL($H$27:$BO$27,COUNTIF($H$27:$BO$27,0)+1),MAX($H$27:$BO$27)/AN27),\"\")","v":0},{"$f":"IFERROR($G27*AN28,\"\")","v":0},{"$f":"IFERROR(IF('Vstupní data'!$R$22=\"MAX\",AP27/SMALL($H$27:$BO$27,COUNTIF($H$27:$BO$27,0)+1),MAX($H$27:$BO$27)/AP27),\"\")","v":0},{"$f":"IFERROR($G27*AP28,\"\")","v":0},{"$f":"IFERROR(IF('Vstupní data'!$R$22=\"MAX\",AR27/SMALL($H$27:$BO$27,COUNTIF($H$27:$BO$27,0)+1),MAX($H$27:$BO$27)/AR27),\"\")","v":0},{"$f":"IFERROR($G27*AR28,\"\")","v":0},{"$f":"IFERROR(IF('Vstupní data'!$R$22=\"MAX\",AT27/SMALL($H$27:$BO$27,COUNTIF($H$27:$BO$27,0)+1),MAX($H$27:$BO$27)/AT27),\"\")","v":0},{"$f":"IFERROR($G27*AT28,\"\")","v":0},{"$f":"IFERROR(IF('Vstupní data'!$R$22=\"MAX\",AV27/SMALL($H$27:$BO$27,COUNTIF($H$27:$BO$27,0)+1),MAX($H$27:$BO$27)/AV27),\"\")","v":0},{"$f":"IFERROR($G27*AV28,\"\")","v":0},{"$f":"IFERROR(IF('Vstupní data'!$R$22=\"MAX\",AX27/SMALL($H$27:$BO$27,COUNTIF($H$27:$BO$27,0)+1),MAX($H$27:$BO$27)/AX27),\"\")","v":0},{"$f":"IFERROR($G27*AX28,\"\")","v":0},{"$f":"IFERROR(IF('Vstupní data'!$R$22=\"MAX\",AZ27/SMALL($H$27:$BO$27,COUNTIF($H$27:$BO$27,0)+1),MAX($H$27:$BO$27)/AZ27),\"\")","v":0},{"$f":"IFERROR($G27*AZ28,\"\")","v":0},{"$f":"IFERROR(IF('Vstupní data'!$R$22=\"MAX\",BB27/SMALL($H$27:$BO$27,COUNTIF($H$27:$BO$27,0)+1),MAX($H$27:$BO$27)/BB27),\"\")","v":0},{"$f":"IFERROR($G27*BB28,\"\")","v":0},{"$f":"IFERROR(IF('Vstupní data'!$R$22=\"MAX\",BD27/SMALL($H$27:$BO$27,COUNTIF($H$27:$BO$27,0)+1),MAX($H$27:$BO$27)/BD27),\"\")","v":0},{"$f":"IFERROR($G27*BD28,\"\")","v":0},{"$f":"IFERROR(IF('Vstupní data'!$R$22=\"MAX\",BF27/SMALL($H$27:$BO$27,COUNTIF($H$27:$BO$27,0)+1),MAX($H$27:$BO$27)/BF27),\"\")","v":0},{"$f":"IFERROR($G27*BF28,\"\")","v":0},{"$f":"IFERROR(IF('Vstupní data'!$R$22=\"MAX\",BH27/SMALL($H$27:$BO$27,COUNTIF($H$27:$BO$27,0)+1),MAX($H$27:$BO$27)/BH27),\"\")","v":0},{"$f":"IFERROR($G27*BH28,\"\")","v":0},{"$f":"IFERROR(IF('Vstupní data'!$R$22=\"MAX\",BJ27/SMALL($H$27:$BO$27,COUNTIF($H$27:$BO$27,0)+1),MAX($H$27:$BO$27)/BJ27),\"\")","v":0},{"$f":"IFERROR($G27*BJ28,\"\")","v":0},{"$f":"IFERROR(IF('Vstupní data'!$R$22=\"MAX\",BL27/SMALL($H$27:$BO$27,COUNTIF($H$27:$BO$27,0)+1),MAX($H$27:$BO$27)/BL27),\"\")","v":0},{"$f":"IFERROR($G27*BL28,\"\")","v":0},{"$f":"IFERROR(IF('Vstupní data'!$R$22=\"MAX\",BN27/SMALL($H$27:$BO$27,COUNTIF($H$27:$BO$27,0)+1),MAX($H$27:$BO$27)/BN27),\"\")","v":0},{"$f":"IFERROR($G27*BN28,\"\")","v":0},null,null,null,null,null,null,null,null,null,{"$f":"V21","v":""},{"$f":"V53","v":0},null,null,null,null,null,null,"Celkový součet",9.8047707670665929]
[null,null,null,{"$f":"'Vstupní data'!S19","v":"K4"},{"$f":"'Vstupní data'!S20","v":"Opakovatelnost"},{"$f":"'Vstupní data'!S21","v":"mm"},{"$f":"IFERROR(GETPIVOTDATA(\"[Measures].[Míra 1]\",'Porovnání v trojúhelníku párů'!$W$8,\"[Tabulka1].[Kritéria]\",\"[Tabulka1].[Kritéria].&[4]\"),0)","v":0.28888888888888886},{"$f":"'Vstupní data'!S23","v":0.02},null,{"$f":"'Vstupní data'!S24","v":0.05},null,{"$f":"'Vstupní data'!S25","v":0.04},null,{"$f":"'Vstupní data'!S26","v":0.04},null,{"$f":"'Vstupní data'!S27","v":0.06},null,{"$f":"'Vstupní data'!S28","v":0.03},null,{"$f":"'Vstupní data'!S29","v":0.03},null,{"$f":"'Vstupní data'!S30","v":0},null,{"$f":"'Vstupní data'!S31","v":0},null,{"$f":"'Vstupní data'!S32","v":0},null,{"$f":"'Vstupní data'!S33","v":0},null,{"$f":"'Vstupní data'!S34","v":0},null,{"$f":"'Vstupní data'!S35","v":0},null,{"$f":"'Vstupní data'!S36","v":0},null,{"$f":"'Vstupní data'!S37","v":0},null,{"$f":"'Vstupní data'!S38","v":0},null,{"$f":"'Vstupní data'!S39","v":0},null,{"$f":"'Vstupní data'!S40","v":0},null,{"$f":"'Vstupní data'!S41","v":0},null,{"$f":"'Vstupní data'!S42","v":0},null,{"$f":"'Vstupní data'!S43","v":0},null,{"$f":"'Vstupní data'!S44","v":0},null,{"$f":"'Vstupní data'!S45","v":0},null,{"$f":"'Vstupní data'!S46","v":0},null,{"$f":"'Vstupní data'!S47","v":0},null,{"$f":"'Vstupní data'!S48","v":0},null,{"$f":"'Vstupní data'!S49","v":0},null,{"$f":"'Vstupní data'!S50","v":0},null,{"$f":"'Vstupní data'!S51","v":0},null,{"$f":"'Vstupní data'!S52","v":0},null,null,null,null,null,null,null,null,null,null,{"$f":"X21","v":""},{"$f":"X53","v":0}]
[null,null,null,null,null,null,null,{"$f":"IFERROR(IF('Vstupní data'!$S$22=\"MAX\",H29/SMALL($H$29:$BO$29,COUNTIF($H$29:$BO$29,0)+1),MAX($H$29:$BO$29)/H29),\"\")","v":3},{"$f":"IFERROR($G29*H30,\"\")","v":0.86666666666666659},{"$f":"IFERROR(IF('Vstupní data'!$S$22=\"MAX\",J29/SMALL($H$29:$BO$29,COUNTIF($H$29:$BO$29,0)+1),MAX($H$29:$BO$29)/J29),\"\")","v":1.2},{"$f":"IFERROR($G29*J30,\"\")","v":0.34666666666666662},{"$f":"IFERROR(IF('Vstupní data'!$S$22=\"MAX\",L29/SMALL($H$29:$BO$29,COUNTIF($H$29:$BO$29,0)+1),MAX($H$29:$BO$29)/L29),\"\")","v":1.5},{"$f":"IFERROR($G29*L30,\"\")","v":0.43333333333333329},{"$f":"IFERROR(IF('Vstupní data'!$S$22=\"MAX\",N29/SMALL($H$29:$BO$29,COUNTIF($H$29:$BO$29,0)+1),MAX($H$29:$BO$29)/N29),\"\")","v":1.5},{"$f":"IFERROR($G29*N30,\"\")","v":0.43333333333333329},{"$f":"IFERROR(IF('Vstupní data'!$S$22=\"MAX\",P29/SMALL($H$29:$BO$29,COUNTIF($H$29:$BO$29,0)+1),MAX($H$29:$BO$29)/P29),\"\")","v":1},{"$f":"IFERROR($G29*P30,\"\")","v":0.28888888888888886},{"$f":"IFERROR(IF('Vstupní data'!$S$22=\"MAX\",R29/SMALL($H$29:$BO$29,COUNTIF($H$29:$BO$29,0)+1),MAX($H$29:$BO$29)/R29),\"\")","v":2},{"$f":"IFERROR($G29*R30,\"\")","v":0.57777777777777772},{"$f":"IFERROR(IF('Vstupní data'!$S$22=\"MAX\",T29/SMALL($H$29:$BO$29,COUNTIF($H$29:$BO$29,0)+1),MAX($H$29:$BO$29)/T29),\"\")","v":2},{"$f":"IFERROR($G29*T30,\"\")","v":0.57777777777777772},{"$f":"IFERROR(IF('Vstupní data'!$S$22=\"MAX\",V29/SMALL($H$29:$BO$29,COUNTIF($H$29:$BO$29,0)+1),MAX($H$29:$BO$29)/V29),\"\")","v":""},{"$f":"IFERROR($G29*V30,\"\")","v":""},{"$f":"IFERROR(IF('Vstupní data'!$S$22=\"MAX\",X29/SMALL($H$29:$BO$29,COUNTIF($H$29:$BO$29,0)+1),MAX($H$29:$BO$29)/X29),\"\")","v":""},{"$f":"IFERROR($G29*X30,\"\")","v":""},{"$f":"IFERROR(IF('Vstupní data'!$S$22=\"MAX\",Z29/SMALL($H$29:$BO$29,COUNTIF($H$29:$BO$29,0)+1),MAX($H$29:$BO$29)/Z29),\"\")","v":""},{"$f":"IFERROR($G29*Z30,\"\")","v":""},{"$f":"IFERROR(IF('Vstupní data'!$S$22=\"MAX\",AB29/SMALL($H$29:$BO$29,COUNTIF($H$29:$BO$29,0)+1),MAX($H$29:$BO$29)/AB29),\"\")","v":""},{"$f":"IFERROR($G29*AB30,\"\")","v":""},{"$f":"IFERROR(IF('Vstupní data'!$S$22=\"MAX\",AD29/SMALL($H$29:$BO$29,COUNTIF($H$29:$BO$29,0)+1),MAX($H$29:$BO$29)/AD29),\"\")","v":""},{"$f":"IFERROR($G29*AD30,\"\")","v":""},{"$f":"IFERROR(IF('Vstupní data'!$S$22=\"MAX\",AF29/SMALL($H$29:$BO$29,COUNTIF($H$29:$BO$29,0)+1),MAX($H$29:$BO$29)/AF29),\"\")","v":""},{"$f":"IFERROR($G29*AF30,\"\")","v":""},{"$f":"IFERROR(IF('Vstupní data'!$S$22=\"MAX\",AH29/SMALL($H$29:$BO$29,COUNTIF($H$29:$BO$29,0)+1),MAX($H$29:$BO$29)/AH29),\"\")","v":""},{"$f":"IFERROR($G29*AH30,\"\")","v":""},{"$f":"IFERROR(IF('Vstupní data'!$S$22=\"MAX\",AJ29/SMALL($H$29:$BO$29,COUNTIF($H$29:$BO$29,0)+1),MAX($H$29:$BO$29)/AJ29),\"\")","v":""},{"$f":"IFERROR($G29*AJ30,\"\")","v":""},{"$f":"IFERROR(IF('Vstupní data'!$S$22=\"MAX\",AL29/SMALL($H$29:$BO$29,COUNTIF($H$29:$BO$29,0)+1),MAX($H$29:$BO$29)/AL29),\"\")","v":""},{"$f":"IFERROR($G29*AL30,\"\")","v":""},{"$f":"IFERROR(IF('Vstupní data'!$S$22=\"MAX\",AN29/SMALL($H$29:$BO$29,COUNTIF($H$29:$BO$29,0)+1),MAX($H$29:$BO$29)/AN29),\"\")","v":""},{"$f":"IFERROR($G29*AN30,\"\")","v":""},{"$f":"IFERROR(IF('Vstupní data'!$S$22=\"MAX\",AP29/SMALL($H$29:$BO$29,COUNTIF($H$29:$BO$29,0)+1),MAX($H$29:$BO$29)/AP29),\"\")","v":""},{"$f":"IFERROR($G29*AP30,\"\")","v":""},{"$f":"IFERROR(IF('Vstupní data'!$S$22=\"MAX\",AR29/SMALL($H$29:$BO$29,COUNTIF($H$29:$BO$29,0)+1),MAX($H$29:$BO$29)/AR29),\"\")","v":""},{"$f":"IFERROR($G29*AR30,\"\")","v":""},{"$f":"IFERROR(IF('Vstupní data'!$S$22=\"MAX\",AT29/SMALL($H$29:$BO$29,COUNTIF($H$29:$BO$29,0)+1),MAX($H$29:$BO$29)/AT29),\"\")","v":""},{"$f":"IFERROR($G29*AT30,\"\")","v":""},{"$f":"IFERROR(IF('Vstupní data'!$S$22=\"MAX\",AV29/SMALL($H$29:$BO$29,COUNTIF($H$29:$BO$29,0)+1),MAX($H$29:$BO$29)/AV29),\"\")","v":""},{"$f":"IFERROR($G29*AV30,\"\")","v":""},{"$f":"IFERROR(IF('Vstupní data'!$S$22=\"MAX\",AX29/SMALL($H$29:$BO$29,COUNTIF($H$29:$BO$29,0)+1),MAX($H$29:$BO$29)/AX29),\"\")","v":""},{"$f":"IFERROR($G29*AX30,\"\")","v":""},{"$f":"IFERROR(IF('Vstupní data'!$S$22=\"MAX\",AZ29/SMALL($H$29:$BO$29,COUNTIF($H$29:$BO$29,0)+1),MAX($H$29:$BO$29)/AZ29),\"\")","v":""},{"$f":"IFERROR($G29*AZ30,\"\")","v":""},{"$f":"IFERROR(IF('Vstupní data'!$S$22=\"MAX\",BB29/SMALL($H$29:$BO$29,COUNTIF($H$29:$BO$29,0)+1),MAX($H$29:$BO$29)/BB29),\"\")","v":""},{"$f":"IFERROR($G29*BB30,\"\")","v":""},{"$f":"IFERROR(IF('Vstupní data'!$S$22=\"MAX\",BD29/SMALL($H$29:$BO$29,COUNTIF($H$29:$BO$29,0)+1),MAX($H$29:$BO$29)/BD29),\"\")","v":""},{"$f":"IFERROR($G29*BD30,\"\")","v":""},{"$f":"IFERROR(IF('Vstupní data'!$S$22=\"MAX\",BF29/SMALL($H$29:$BO$29,COUNTIF($H$29:$BO$29,0)+1),MAX($H$29:$BO$29)/BF29),\"\")","v":""},{"$f":"IFERROR($G29*BF30,\"\")","v":""},{"$f":"IFERROR(IF('Vstupní data'!$S$22=\"MAX\",BH29/SMALL($H$29:$BO$29,COUNTIF($H$29:$BO$29,0)+1),MAX($H$29:$BO$29)/BH29),\"\")","v":""},{"$f":"IFERROR($G29*BH30,\"\")","v":""},{"$f":"IFERROR(IF('Vstupní data'!$S$22=\"MAX\",BJ29/SMALL($H$29:$BO$29,COUNTIF($H$29:$BO$29,0)+1),MAX($H$29:$BO$29)/BJ29),\"\")","v":""},{"$f":"IFERROR($G29*BJ30,\"\")","v":""},{"$f":"IFERROR(IF('Vstupní data'!$S$22=\"MAX\",BL29/SMALL($H$29:$BO$29,COUNTIF($H$29:$BO$29,0)+1),MAX($H$29:$BO$29)/BL29),\"\")","v":""},{"$f":"IFERROR($G29*BL30,\"\")","v":""},{"$f":"IFERROR(IF('Vstupní data'!$S$22=\"MAX\",BN29/SMALL($H$29:$BO$29,COUNTIF($H$29:$BO$29,0)+1),MAX($H$29:$BO$29)/BN29),\"\")","v":""},{"$f":"IFERROR($G29*BN30,\"\")","v":""},null,null,null,null,null,null,null,null,null,{"$f":"Z21","v":""},{"$f":"Z53","v":0}]
[null,null,null,{"$f":"'Vstupní data'!T19","v":"K5"},{"$f":"'Vstupní data'!T20","v":"M-M interface"},{"$f":"'Vstupní data'!T21","v":"-"},{"$f":"IFERROR(GETPIVOTDATA(\"[Measures].[Míra 1]\",'Porovnání v trojúhelníku párů'!$W$8,\"[Tabulka1].[Kritéria]\",\"[Tabulka1].[Kritéria].&[5]\"),0)","v":6.6666666666666666E-2},{"$f":"'Vstupní data'!T23","v":0.77270000000000005},null,{"$f":"'Vstupní data'!T24","v":0.77270000000000005},null,{"$f":"'Vstupní data'!T25","v":0.68179999999999996},null,{"$f":"'Vstupní data'!T26","v":0.68179999999999996},null,{"$f":"'Vstupní data'!T27","v":0.5},null,{"$f":"'Vstupní data'!T28","v":0.59089999999999998},null,{"$f":"'Vstupní data'!T29","v":0.59089999999999998},null,{"$f":"'Vstupní data'!T30","v":0},null,{"$f":"'Vstupní data'!T31","v":0},null,{"$f":"'Vstupní data'!T32","v":0},null,{"$f":"'Vstupní data'!T33","v":0},null,{"$f":"'Vstupní data'!T34","v":0},null,{"$f":"'Vstupní data'!T35","v":0},null,{"$f":"'Vstupní data'!T36","v":0},null,{"$f":"'Vstupní data'!T37","v":0},null,{"$f":"'Vstupní data'!T38","v":0},null,{"$f":"'Vstupní data'!T39","v":0},null,{"$f":"'Vstupní data'!T40","v":0},null,{"$f":"'Vstupní data'!T41","v":0},null,{"$f":"'Vstupní data'!T42","v":0},null,{"$f":"'Vstupní data'!T43","v":0},null,{"$f":"'Vstupní data'!T44","v":0},null,{"$f":"'Vstupní data'!T45","v":0},null,{"$f":"'Vstupní data'!T46","v":0},null,{"$f":"'Vstupní data'!T47","v":0},null,{"$f":"'Vstupní data'!T48","v":0},null,{"$f":"'Vstupní data'!T49","v":0},null,{"$f":"'Vstupní data'!T50","v":0},null,{"$f":"'Vstupní data'!T51","v":0},null,{"$f":"'Vstupní data'!T52","v":0},null,null,null,null,null,null,null,null,null,null,{"$f":"AB21","v":""},{"$f":"AB53","v":0}]
[null,null,null,null,null,null,null,{"$f":"IFERROR(IF('Vstupní data'!$T$22=\"MAX\",H31/SMALL($H$31:$BO$31,COUNTIF($H$31:$BO$31,0)+1),MAX($H$31:$BO$31)/H31),\"\")","v":1.5454000000000001},{"$f":"IFERROR($G31*H32,\"\")","v":0.10302666666666667},{"$f":"IFERROR(IF('Vstupní data'!$T$22=\"MAX\",J31/SMALL($H$31:$BO$31,COUNTIF($H$31:$BO$31,0)+1),MAX($H$31:$BO$31)/J31),\"\")","v":1.5454000000000001},{"$f":"IFERROR($G31*J32,\"\")","v":0.10302666666666667},{"$f":"IFERROR(IF('Vstupní data'!$T$22=\"MAX\",L31/SMALL($H$31:$BO$31,COUNTIF($H$31:$BO$31,0)+1),MAX($H$31:$BO$31)/L31),\"\")","v":1.3635999999999999},{"$f":"IFERROR($G31*L32,\"\")","v":9.0906666666666663E-2},{"$f":"IFERROR(IF('Vstupní data'!$T$22=\"MAX\",N31/SMALL($H$31:$BO$31,COUNTIF($H$31:$BO$31,0)+1),MAX($H$31:$BO$31)/N31),\"\")","v":1.3635999999999999},{"$f":"IFERROR($G31*N32,\"\")","v":9.0906666666666663E-2},{"$f":"IFERROR(IF('Vstupní data'!$T$22=\"MAX\",P31/SMALL($H$31:$BO$31,COUNTIF($H$31:$BO$31,0)+1),MAX($H$31:$BO$31)/P31),\"\")","v":1},{"$f":"IFERROR($G31*P32,\"\")","v":6.6666666666666666E-2},{"$f":"IFERROR(IF('Vstupní data'!$T$22=\"MAX\",R31/SMALL($H$31:$BO$31,COUNTIF($H$31:$BO$31,0)+1),MAX($H$31:$BO$31)/R31),\"\")","v":1.1818},{"$f":"IFERROR($G31*R32,\"\")","v":7.8786666666666658E-2},{"$f":"IFERROR(IF('Vstupní data'!$T$22=\"MAX\",T31/SMALL($H$31:$BO$31,COUNTIF($H$31:$BO$31,0)+1),MAX($H$31:$BO$31)/T31),\"\")","v":1.1818},{"$f":"IFERROR($G31*T32,\"\")","v":7.8786666666666658E-2},{"$f":"IFERROR(IF('Vstupní data'!$T$22=\"MAX\",V31/SMALL($H$31:$BO$31,COUNTIF($H$31:$BO$31,0)+1),MAX($H$31:$BO$31)/V31),\"\")","v":0},{"$f":"IFERROR($G31*V32,\"\")","v":0},{"$f":"IFERROR(IF('Vstupní data'!$T$22=\"MAX\",X31/SMALL($H$31:$BO$31,COUNTIF($H$31:$BO$31,0)+1),MAX($H$31:$BO$31)/X31),\"\")","v":0},{"$f":"IFERROR($G31*X32,\"\")","v":0},{"$f":"IFERROR(IF('Vstupní data'!$T$22=\"MAX\",Z31/SMALL($H$31:$BO$31,COUNTIF($H$31:$BO$31,0)+1),MAX($H$31:$BO$31)/Z31),\"\")","v":0},{"$f":"IFERROR($G31*Z32,\"\")","v":0},{"$f":"IFERROR(IF('Vstupní data'!$T$22=\"MAX\",AB31/SMALL($H$31:$BO$31,COUNTIF($H$31:$BO$31,0)+1),MAX($H$31:$BO$31)/AB31),\"\")","v":0},{"$f":"IFERROR($G31*AB32,\"\")","v":0},{"$f":"IFERROR(IF('Vstupní data'!$T$22=\"MAX\",AD31/SMALL($H$31:$BO$31,COUNTIF($H$31:$BO$31,0)+1),MAX($H$31:$BO$31)/AD31),\"\")","v":0},{"$f":"IFERROR($G31*AD32,\"\")","v":0},{"$f":"IFERROR(IF('Vstupní data'!$T$22=\"MAX\",AF31/SMALL($H$31:$BO$31,COUNTIF($H$31:$BO$31,0)+1),MAX($H$31:$BO$31)/AF31),\"\")","v":0},{"$f":"IFERROR($G31*AF32,\"\")","v":0},{"$f":"IFERROR(IF('Vstupní data'!$T$22=\"MAX\",AH31/SMALL($H$31:$BO$31,COUNTIF($H$31:$BO$31,0)+1),MAX($H$31:$BO$31)/AH31),\"\")","v":0},{"$f":"IFERROR($G31*AH32,\"\")","v":0},{"$f":"IFERROR(IF('Vstupní data'!$T$22=\"MAX\",AJ31/SMALL($H$31:$BO$31,COUNTIF($H$31:$BO$31,0)+1),MAX($H$31:$BO$31)/AJ31),\"\")","v":0},{"$f":"IFERROR($G31*AJ32,\"\")","v":0},{"$f":"IFERROR(IF('Vstupní data'!$T$22=\"MAX\",AL31/SMALL($H$31:$BO$31,COUNTIF($H$31:$BO$31,0)+1),MAX($H$31:$BO$31)/AL31),\"\")","v":0},{"$f":"IFERROR($G31*AL32,\"\")","v":0},{"$f":"IFERROR(IF('Vstupní data'!$T$22=\"MAX\",AN31/SMALL($H$31:$BO$31,COUNTIF($H$31:$BO$31,0)+1),MAX($H$31:$BO$31)/AN31),\"\")","v":0},{"$f":"IFERROR($G31*AN32,\"\")","v":0},{"$f":"IFERROR(IF('Vstupní data'!$T$22=\"MAX\",AP31/SMALL($H$31:$BO$31,COUNTIF($H$31:$BO$31,0)+1),MAX($H$31:$BO$31)/AP31),\"\")","v":0},{"$f":"IFERROR($G31*AP32,\"\")","v":0},{"$f":"IFERROR(IF('Vstupní data'!$T$22=\"MAX\",AR31/SMALL($H$31:$BO$31,COUNTIF($H$31:$BO$31,0)+1),MAX($H$31:$BO$31)/AR31),\"\")","v":0},{"$f":"IFERROR($G31*AR32,\"\")","v":0},{"$f":"IFERROR(IF('Vstupní data'!$T$22=\"MAX\",AT31/SMALL($H$31:$BO$31,COUNTIF($H$31:$BO$31,0)+1),MAX($H$31:$BO$31)/AT31),\"\")","v":0},{"$f":"IFERROR($G31*AT32,\"\")","v":0},{"$f":"IFERROR(IF('Vstupní data'!$T$22=\"MAX\",AV31/SMALL($H$31:$BO$31,COUNTIF($H$31:$BO$31,0)+1),MAX($H$31:$BO$31)/AV31),\"\")","v":0},{"$f":"IFERROR($G31*AV32,\"\")","v":0},{"$f":"IFERROR(IF('Vstupní data'!$T$22=\"MAX\",AX31/SMALL($H$31:$BO$31,COUNTIF($H$31:$BO$31,0)+1),MAX($H$31:$BO$31)/AX31),\"\")","v":0},{"$f":"IFERROR($G31*AX32,\"\")","v":0},{"$f":"IFERROR(IF('Vstupní data'!$T$22=\"MAX\",AZ31/SMALL($H$31:$BO$31,COUNTIF($H$31:$BO$31,0)+1),MAX($H$31:$BO$31)/AZ31),\"\")","v":0},{"$f":"IFERROR($G31*AZ32,\"\")","v":0},{"$f":"IFERROR(IF('Vstupní data'!$T$22=\"MAX\",BB31/SMALL($H$31:$BO$31,COUNTIF($H$31:$BO$31,0)+1),MAX($H$31:$BO$31)/BB31),\"\")","v":0},{"$f":"IFERROR($G31*BB32,\"\")","v":0},{"$f":"IFERROR(IF('Vstupní data'!$T$22=\"MAX\",BD31/SMALL($H$31:$BO$31,COUNTIF($H$31:$BO$31,0)+1),MAX($H$31:$BO$31)/BD31),\"\")","v":0},{"$f":"IFERROR($G31*BD32,\"\")","v":0},{"$f":"IFERROR(IF('Vstupní data'!$T$22=\"MAX\",BF31/SMALL($H$31:$BO$31,COUNTIF($H$31:$BO$31,0)+1),MAX($H$31:$BO$31)/BF31),\"\")","v":0},{"$f":"IFERROR($G31*BF32,\"\")","v":0},{"$f":"IFERROR(IF('Vstupní data'!$T$22=\"MAX\",BH31/SMALL($H$31:$BO$31,COUNTIF($H$31:$BO$31,0)+1),MAX($H$31:$BO$31)/BH31),\"\")","v":0},{"$f":"IFERROR($G31*BH32,\"\")","v":0},{"$f":"IFERROR(IF('Vstupní data'!$T$22=\"MAX\",BJ31/SMALL($H$31:$BO$31,COUNTIF($H$31:$BO$31,0)+1),MAX($H$31:$BO$31)/BJ31),\"\")","v":0},{"$f":"IFERROR($G31*BJ32,\"\")","v":0},{"$f":"IFERROR(IF('Vstupní data'!$T$22=\"MAX\",BL31/SMALL($H$31:$BO$31,COUNTIF($H$31:$BO$31,0)+1),MAX($H$31:$BO$31)/BL31),\"\")","v":0},{"$f":"IFERROR($G31*BL32,\"\")","v":0},{"$f":"IFERROR(IF('Vstupní data'!$T$22=\"MAX\",BN31/SMALL($H$31:$BO$31,COUNTIF($H$31:$BO$31,0)+1),MAX($H$31:$BO$31)/BN31),\"\")","v":0},{"$f":"IFERROR($G31*BN32,\"\")","v":0},null,null,null,null,null,null,null,null,null,{"$f":"AD21","v":""},{"$f":"AD53","v":0}]
[null,null,null,{"$f":"'Vstupní data'!U19","v":"K6"},{"$f":"'Vstupní data'!U20","v":"Flexibilita prog."},{"$f":"'Vstupní data'!U21","v":"-"},{"$f":"IFERROR(GETPIVOTDATA(\"[Measures].[Míra 1]\",'Porovnání v trojúhelníku párů'!$W$8,\"[Tabulka1].[Kritéria]\",\"[Tabulka1].[Kritéria].&[6]\"),0)","v":0.1111111111111111},{"$f":"'Vstupní data'!U23","v":0.59089999999999998},null,{"$f":"'Vstupní data'!U24","v":0.59089999999999998},null,{"$f":"'Vstupní data'!U25","v":0.77270000000000005},null,{"$f":"'Vstupní data'!U26","v":0.77270000000000005},null,{"$f":"'Vstupní data'!U27","v":0.59089999999999998},null,{"$f":"'Vstupní data'!U28","v":0.68179999999999996},null,{"$f":"'Vstupní data'!U29","v":0.68179999999999996},null,{"$f":"'Vstupní data'!U30","v":0},null,{"$f":"'Vstupní data'!U31","v":0},null,{"$f":"'Vstupní data'!U32","v":0},null,{"$f":"'Vstupní data'!U33","v":0},null,{"$f":"'Vstupní data'!U34","v":0},null,{"$f":"'Vstupní data'!U35","v":0},null,{"$f":"'Vstupní data'!U36","v":0},null,{"$f":"'Vstupní data'!U37","v":0},null,{"$f":"'Vstupní data'!U38","v":0},null,{"$f":"'Vstupní data'!U39","v":0},null,{"$f":"'Vstupní data'!U40","v":0},null,{"$f":"'Vstupní data'!U41","v":0},null,{"$f":"'Vstupní data'!U42","v":0},null,{"$f":"'Vstupní data'!U43","v":0},null,{"$f":"'Vstupní data'!U44","v":0},null,{"$f":"'Vstupní data'!U45","v":0},null,{"$f":"'Vstupní data'!U46","v":0},null,{"$f":"'Vstupní data'!U47","v":0},null,{"$f":"'Vstupní data'!U48","v":0},null,{"$f":"'Vstupní data'!U49","v":0},null,{"$f":"'Vstupní data'!U50","v":0},null,{"$f":"'Vstupní data'!U51","v":0},null,{"$f":"'Vstupní data'!U52","v":0},null,null,null,null,null,null,null,null,null,null,{"$f":"AF21","v":""},{"$f":"AF53","v":0}]
[null,null,null,null,null,null,null,{"$f":"IFERROR(IF('Vstupní data'!$U$22=\"MAX\",H33/SMALL($H$33:$BO$33,COUNTIF($H$33:$BO$33,0)+1),MAX($H$33:$BO$33)/H33),\"\")","v":1},{"$f":"IFERROR($G33*H34,\"\")","v":0.1111111111111111},{"$f":"IFERROR(IF('Vstupní data'!$U$22=\"MAX\",J33/SMALL($H$33:$BO$33,COUNTIF($H$33:$BO$33,0)+1),MAX($H$33:$BO$33)/J33),\"\")","v":1},{"$f":"IFERROR($G33*J34,\"\")","v":0.1111111111111111},{"$f":"IFERROR(IF('Vstupní data'!$U$22=\"MAX\",L33/SMALL($H$33:$BO$33,COUNTIF($H$33:$BO$33,0)+1),MAX($H$33:$BO$33)/L33),\"\")","v":1.3076662717887968},{"$f":"IFERROR($G33*L34,\"\")","v":0.14529625242097741},{"$f":"IFERROR(IF('Vstupní data'!$U$22=\"MAX\",N33/SMALL($H$33:$BO$33,COUNTIF($H$33:$BO$33,0)+1),MAX($H$33:$BO$33)/N33),\"\")","v":1.3076662717887968},{"$f":"IFERROR($G33*N34,\"\")","v":0.14529625242097741},{"$f":"IFERROR(IF('Vstupní data'!$U$22=\"MAX\",P33/SMALL($H$33:$BO$33,COUNTIF($H$33:$BO$33,0)+1),MAX($H$33:$BO$33)/P33),\"\")","v":1},{"$f":"IFERROR($G33*P34,\"\")","v":0.1111111111111111},{"$f":"IFERROR(IF('Vstupní data'!$U$22=\"MAX\",R33/SMALL($H$33:$BO$33,COUNTIF($H$33:$BO$33,0)+1),MAX($H$33:$BO$33)/R33),\"\")","v":1.1538331358943983},{"$f":"IFERROR($G33*R34,\"\")","v":0.12820368176604424},{"$f":"IFERROR(IF('Vstupní data'!$U$22=\"MAX\",T33/SMALL($H$33:$BO$33,COUNTIF($H$33:$BO$33,0)+1),MAX($H$33:$BO$33)/T33),\"\")","v":1.1538331358943983},{"$f":"IFERROR($G33*T34,\"\")","v":0.12820368176604424},{"$f":"IFERROR(IF('Vstupní data'!$U$22=\"MAX\",V33/SMALL($H$33:$BO$33,COUNTIF($H$33:$BO$33,0)+1),MAX($H$33:$BO$33)/V33),\"\")","v":0},{"$f":"IFERROR($G33*V34,\"\")","v":0},{"$f":"IFERROR(IF('Vstupní data'!$U$22=\"MAX\",X33/SMALL($H$33:$BO$33,COUNTIF($H$33:$BO$33,0)+1),MAX($H$33:$BO$33)/X33),\"\")","v":0},{"$f":"IFERROR($G33*X34,\"\")","v":0},{"$f":"IFERROR(IF('Vstupní data'!$U$22=\"MAX\",Z33/SMALL($H$33:$BO$33,COUNTIF($H$33:$BO$33,0)+1),MAX($H$33:$BO$33)/Z33),\"\")","v":0},{"$f":"IFERROR($G33*Z34,\"\")","v":0},{"$f":"IFERROR(IF('Vstupní data'!$U$22=\"MAX\",AB33/SMALL($H$33:$BO$33,COUNTIF($H$33:$BO$33,0)+1),MAX($H$33:$BO$33)/AB33),\"\")","v":0},{"$f":"IFERROR($G33*AB34,\"\")","v":0},{"$f":"IFERROR(IF('Vstupní data'!$U$22=\"MAX\",AD33/SMALL($H$33:$BO$33,COUNTIF($H$33:$BO$33,0)+1),MAX($H$33:$BO$33)/AD33),\"\")","v":0},{"$f":"IFERROR($G33*AD34,\"\")","v":0},{"$f":"IFERROR(IF('Vstupní data'!$U$22=\"MAX\",AF33/SMALL($H$33:$BO$33,COUNTIF($H$33:$BO$33,0)+1),MAX($H$33:$BO$33)/AF33),\"\")","v":0},{"$f":"IFERROR($G33*AF34,\"\")","v":0},{"$f":"IFERROR(IF('Vstupní data'!$U$22=\"MAX\",AH33/SMALL($H$33:$BO$33,COUNTIF($H$33:$BO$33,0)+1),MAX($H$33:$BO$33)/AH33),\"\")","v":0},{"$f":"IFERROR($G33*AH34,\"\")","v":0},{"$f":"IFERROR(IF('Vstupní data'!$U$22=\"MAX\",AJ33/SMALL($H$33:$BO$33,COUNTIF($H$33:$BO$33,0)+1),MAX($H$33:$BO$33)/AJ33),\"\")","v":0},{"$f":"IFERROR($G33*AJ34,\"\")","v":0},{"$f":"IFERROR(IF('Vstupní data'!$U$22=\"MAX\",AL33/SMALL($H$33:$BO$33,COUNTIF($H$33:$BO$33,0)+1),MAX($H$33:$BO$33)/AL33),\"\")","v":0},{"$f":"IFERROR($G33*AL34,\"\")","v":0},{"$f":"IFERROR(IF('Vstupní data'!$U$22=\"MAX\",AN33/SMALL($H$33:$BO$33,COUNTIF($H$33:$BO$33,0)+1),MAX($H$33:$BO$33)/AN33),\"\")","v":0},{"$f":"IFERROR($G33*AN34,\"\")","v":0},{"$f":"IFERROR(IF('Vstupní data'!$U$22=\"MAX\",AP33/SMALL($H$33:$BO$33,COUNTIF($H$33:$BO$33,0)+1),MAX($H$33:$BO$33)/AP33),\"\")","v":0},{"$f":"IFERROR($G33*AP34,\"\")","v":0},{"$f":"IFERROR(IF('Vstupní data'!$U$22=\"MAX\",AR33/SMALL($H$33:$BO$33,COUNTIF($H$33:$BO$33,0)+1),MAX($H$33:$BO$33)/AR33),\"\")","v":0},{"$f":"IFERROR($G33*AR34,\"\")","v":0},{"$f":"IFERROR(IF('Vstupní data'!$U$22=\"MAX\",AT33/SMALL($H$33:$BO$33,COUNTIF($H$33:$BO$33,0)+1),MAX($H$33:$BO$33)/AT33),\"\")","v":0},{"$f":"IFERROR($G33*AT34,\"\")","v":0},{"$f":"IFERROR(IF('Vstupní data'!$U$22=\"MAX\",AV33/SMALL($H$33:$BO$33,COUNTIF($H$33:$BO$33,0)+1),MAX($H$33:$BO$33)/AV33),\"\")","v":0},{"$f":"IFERROR($G33*AV34,\"\")","v":0},{"$f":"IFERROR(IF('Vstupní data'!$U$22=\"MAX\",AX33/SMALL($H$33:$BO$33,COUNTIF($H$33:$BO$33,0)+1),MAX($H$33:$BO$33)/AX33),\"\")","v":0},{"$f":"IFERROR($G33*AX34,\"\")","v":0},{"$f":"IFERROR(IF('Vstupní data'!$U$22=\"MAX\",AZ33/SMALL($H$33:$BO$33,COUNTIF($H$33:$BO$33,0)+1),MAX($H$33:$BO$33)/AZ33),\"\")","v":0},{"$f":"IFERROR($G33*AZ34,\"\")","v":0},{"$f":"IFERROR(IF('Vstupní data'!$U$22=\"MAX\",BB33/SMALL($H$33:$BO$33,COUNTIF($H$33:$BO$33,0)+1),MAX($H$33:$BO$33)/BB33),\"\")","v":0},{"$f":"IFERROR($G33*BB34,\"\")","v":0},{"$f":"IFERROR(IF('Vstupní data'!$U$22=\"MAX\",BD33/SMALL($H$33:$BO$33,COUNTIF($H$33:$BO$33,0)+1),MAX($H$33:$BO$33)/BD33),\"\")","v":0},{"$f":"IFERROR($G33*BD34,\"\")","v":0},{"$f":"IFERROR(IF('Vstupní data'!$U$22=\"MAX\",BF33/SMALL($H$33:$BO$33,COUNTIF($H$33:$BO$33,0)+1),MAX($H$33:$BO$33)/BF33),\"\")","v":0},{"$f":"IFERROR($G33*BF34,\"\")","v":0},{"$f":"IFERROR(IF('Vstupní data'!$U$22=\"MAX\",BH33/SMALL($H$33:$BO$33,COUNTIF($H$33:$BO$33,0)+1),MAX($H$33:$BO$33)/BH33),\"\")","v":0},{"$f":"IFERROR($G33*BH34,\"\")","v":0},{"$f":"IFERROR(IF('Vstupní data'!$U$22=\"MAX\",BJ33/SMALL($H$33:$BO$33,COUNTIF($H$33:$BO$33,0)+1),MAX($H$33:$BO$33)/BJ33),\"\")","v":0},{"$f":"IFERROR($G33*BJ34,\"\")","v":0},{"$f":"IFERROR(IF('Vstupní data'!$U$22=\"MAX\",BL33/SMALL($H$33:$BO$33,COUNTIF($H$33:$BO$33,0)+1),MAX($H$33:$BO$33)/BL33),\"\")","v":0},{"$f":"IFERROR($G33*BL34,\"\")","v":0},{"$f":"IFERROR(IF('Vstupní data'!$U$22=\"MAX\",BN33/SMALL($H$33:$BO$33,COUNTIF($H$33:$BO$33,0)+1),MAX($H$33:$BO$33)/BN33),\"\")","v":0},{"$f":"IFERROR($G33*BN34,\"\")","v":0},null,null,null,null,null,null,null,null,null,{"$f":"AH21","v":""},{"$f":"AH53","v":0}]
[null,null,null,{"$f":"'Vstupní data'!V19","v":0},{"$f":"'Vstupní data'!V20","v":0},{"$f":"'Vstupní data'!V21","v":0},{"$f":"IFERROR(GETPIVOTDATA(\"[Measures].[Míra 1]\",'Porovnání v trojúhelníku párů'!$W$8,\"[Tabulka1].[Kritéria]\",\"[Tabulka1].[Kritéria].&[7]\"),0)","v":0},{"$f":"'Vstupní data'!V23","v":0},null,{"$f":"'Vstupní data'!V24","v":0},null,{"$f":"'Vstupní data'!V25","v":0},null,{"$f":"'Vstupní data'!V26","v":0},null,{"$f":"'Vstupní data'!V27","v":0},null,{"$f":"'Vstupní data'!V28","v":0},null,{"$f":"'Vstupní data'!V29","v":0},null,{"$f":"'Vstupní data'!V30","v":0},null,{"$f":"'Vstupní data'!V31","v":0},null,{"$f":"'Vstupní data'!V32","v":0},null,{"$f":"'Vstupní data'!V33","v":0},null,{"$f":"'Vstupní data'!V34","v":0},null,{"$f":"'Vstupní data'!V35","v":0},null,{"$f":"'Vstupní data'!V36","v":0},null,{"$f":"'Vstupní data'!V37","v":0},null,{"$f":"'Vstupní data'!V38","v":0},null,{"$f":"'Vstupní data'!V39","v":0},null,{"$f":"'Vstupní data'!V40","v":0},null,{"$f":"'Vstupní data'!V41","v":0},null,{"$f":"'Vstupní data'!V42","v":0},null,{"$f":"'Vstupní data'!V43","v":0},null,{"$f":"'Vstupní data'!V44","v":0},null,{"$f":"'Vstupní data'!V45","v":0},null,{"$f":"'Vstupní data'!V46","v":0},null,{"$f":"'Vstupní data'!V47","v":0},null,{"$f":"'Vstupní data'!V48","v":0},null,{"$f":"'Vstupní data'!V49","v":0},null,{"$f":"'Vstupní data'!V50","v":0},null,{"$f":"'Vstupní data'!V51","v":0},null,{"$f":"'Vstupní data'!V52","v":0},null,null,null,null,null,null,null,null,null,null,{"$f":"AJ21","v":""},{"$f":"AJ53","v":0}]
[null,null,null,null,null,null,null,{"$f":"IFERROR(IF('Vstupní data'!$V$22=\"MAX\",H35/SMALL($H$35:$BO$35,COUNTIF($H$35:$BO$35,0)+1),MAX($H$35:$BO$35)/H35),\"\")","v":""},{"$f":"IFERROR($G35*H36,\"\")","v":""},{"$f":"IFERROR(IF('Vstupní data'!$V$22=\"MAX\",J35/SMALL($H$35:$BO$35,COUNTIF($H$35:$BO$35,0)+1),MAX($H$35:$BO$35)/J35),\"\")","v":""},{"$f":"IFERROR($G35*J36,\"\")","v":""},{"$f":"IFERROR(IF('Vstupní data'!$V$22=\"MAX\",L35/SMALL($H$35:$BO$35,COUNTIF($H$35:$BO$35,0)+1),MAX($H$35:$BO$35)/L35),\"\")","v":""},{"$f":"IFERROR($G35*L36,\"\")","v":""},{"$f":"IFERROR(IF('Vstupní data'!$V$22=\"MAX\",N35/SMALL($H$35:$BO$35,COUNTIF($H$35:$BO$35,0)+1),MAX($H$35:$BO$35)/N35),\"\")","v":""},{"$f":"IFERROR($G35*N36,\"\")","v":""},{"$f":"IFERROR(IF('Vstupní data'!$V$22=\"MAX\",P35/SMALL($H$35:$BO$35,COUNTIF($H$35:$BO$35,0)+1),MAX($H$35:$BO$35)/P35),\"\")","v":""},{"$f":"IFERROR($G35*P36,\"\")","v":""},{"$f":"IFERROR(IF('Vstupní data'!$V$22=\"MAX\",R35/SMALL($H$35:$BO$35,COUNTIF($H$35:$BO$35,0)+1),MAX($H$35:$BO$35)/R35),\"\")","v":""},{"$f":"IFERROR($G35*R36,\"\")","v":""},{"$f":"IFERROR(IF('Vstupní data'!$V$22=\"MAX\",T35/SMALL($H$35:$BO$35,COUNTIF($H$35:$BO$35,0)+1),MAX($H$35:$BO$35)/T35),\"\")","v":""},{"$f":"IFERROR($G35*T36,\"\")","v":""},{"$f":"IFERROR(IF('Vstupní data'!$V$22=\"MAX\",V35/SMALL($H$35:$BO$35,COUNTIF($H$35:$BO$35,0)+1),MAX($H$35:$BO$35)/V35),\"\")","v":""},{"$f":"IFERROR($G35*V36,\"\")","v":""},{"$f":"IFERROR(IF('Vstupní data'!$V$22=\"MAX\",X35/SMALL($H$35:$BO$35,COUNTIF($H$35:$BO$35,0)+1),MAX($H$35:$BO$35)/X35),\"\")","v":""},{"$f":"IFERROR($G35*X36,\"\")","v":""},{"$f":"IFERROR(IF('Vstupní data'!$V$22=\"MAX\",Z35/SMALL($H$35:$BO$35,COUNTIF($H$35:$BO$35,0)+1),MAX($H$35:$BO$35)/Z35),\"\")","v":""},{"$f":"IFERROR($G35*Z36,\"\")","v":""},{"$f":"IFERROR(IF('Vstupní data'!$V$22=\"MAX\",AB35/SMALL($H$35:$BO$35,COUNTIF($H$35:$BO$35,0)+1),MAX($H$35:$BO$35)/AB35),\"\")","v":""},{"$f":"IFERROR($G35*AB36,\"\")","v":""},{"$f":"IFERROR(IF('Vstupní data'!$V$22=\"MAX\",AD35/SMALL($H$35:$BO$35,COUNTIF($H$35:$BO$35,0)+1),MAX($H$35:$BO$35)/AD35),\"\")","v":""},{"$f":"IFERROR($G35*AD36,\"\")","v":""},{"$f":"IFERROR(IF('Vstupní data'!$V$22=\"MAX\",AF35/SMALL($H$35:$BO$35,COUNTIF($H$35:$BO$35,0)+1),MAX($H$35:$BO$35)/AF35),\"\")","v":""},{"$f":"IFERROR($G35*AF36,\"\")","v":""},{"$f":"IFERROR(IF('Vstupní data'!$V$22=\"MAX\",AH35/SMALL($H$35:$BO$35,COUNTIF($H$35:$BO$35,0)+1),MAX($H$35:$BO$35)/AH35),\"\")","v":""},{"$f":"IFERROR($G35*AH36,\"\")","v":""},{"$f":"IFERROR(IF('Vstupní data'!$V$22=\"MAX\",AJ35/SMALL($H$35:$BO$35,COUNTIF($H$35:$BO$35,0)+1),MAX($H$35:$BO$35)/AJ35),\"\")","v":""},{"$f":"IFERROR($G35*AJ36,\"\")","v":""},{"$f":"IFERROR(IF('Vstupní data'!$V$22=\"MAX\",AL35/SMALL($H$35:$BO$35,COUNTIF($H$35:$BO$35,0)+1),MAX($H$35:$BO$35)/AL35),\"\")","v":""},{"$f":"IFERROR($G35*AL36,\"\")","v":""},{"$f":"IFERROR(IF('Vstupní data'!$V$22=\"MAX\",AN35/SMALL($H$35:$BO$35,COUNTIF($H$35:$BO$35,0)+1),MAX($H$35:$BO$35)/AN35),\"\")","v":""},{"$f":"IFERROR($G35*AN36,\"\")","v":""},{"$f":"IFERROR(IF('Vstupní data'!$V$22=\"MAX\",AP35/SMALL($H$35:$BO$35,COUNTIF($H$35:$BO$35,0)+1),MAX($H$35:$BO$35)/AP35),\"\")","v":""},{"$f":"IFERROR($G35*AP36,\"\")","v":""},{"$f":"IFERROR(IF('Vstupní data'!$V$22=\"MAX\",AR35/SMALL($H$35:$BO$35,COUNTIF($H$35:$BO$35,0)+1),MAX($H$35:$BO$35)/AR35),\"\")","v":""},{"$f":"IFERROR($G35*AR36,\"\")","v":""},{"$f":"IFERROR(IF('Vstupní data'!$V$22=\"MAX\",AT35/SMALL($H$35:$BO$35,COUNTIF($H$35:$BO$35,0)+1),MAX($H$35:$BO$35)/AT35),\"\")","v":""},{"$f":"IFERROR($G35*AT36,\"\")","v":""},{"$f":"IFERROR(IF('Vstupní data'!$V$22=\"MAX\",AV35/SMALL($H$35:$BO$35,COUNTIF($H$35:$BO$35,0)+1),MAX($H$35:$BO$35)/AV35),\"\")","v":""},{"$f":"IFERROR($G35*AV36,\"\")","v":""},{"$f":"IFERROR(IF('Vstupní data'!$V$22=\"MAX\",AX35/SMALL($H$35:$BO$35,COUNTIF($H$35:$BO$35,0)+1),MAX($H$35:$BO$35)/AX35),\"\")","v":""},{"$f":"IFERROR($G35*AX36,\"\")","v":""},{"$f":"IFERROR(IF('Vstupní data'!$V$22=\"MAX\",AZ35/SMALL($H$35:$BO$35,COUNTIF($H$35:$BO$35,0)+1),MAX($H$35:$BO$35)/AZ35),\"\")","v":""},{"$f":"IFERROR($G35*AZ36,\"\")","v":""},{"$f":"IFERROR(IF('Vstupní data'!$V$22=\"MAX\",BB35/SMALL($H$35:$BO$35,COUNTIF($H$35:$BO$35,0)+1),MAX($H$35:$BO$35)/BB35),\"\")","v":""},{"$f":"IFERROR($G35*BB36,\"\")","v":""},{"$f":"IFERROR(IF('Vstupní data'!$V$22=\"MAX\",BD35/SMALL($H$35:$BO$35,COUNTIF($H$35:$BO$35,0)+1),MAX($H$35:$BO$35)/BD35),\"\")","v":""},{"$f":"IFERROR($G35*BD36,\"\")","v":""},{"$f":"IFERROR(IF('Vstupní data'!$V$22=\"MAX\",BF35/SMALL($H$35:$BO$35,COUNTIF($H$35:$BO$35,0)+1),MAX($H$35:$BO$35)/BF35),\"\")","v":""},{"$f":"IFERROR($G35*BF36,\"\")","v":""},{"$f":"IFERROR(IF('Vstupní data'!$V$22=\"MAX\",BH35/SMALL($H$35:$BO$35,COUNTIF($H$35:$BO$35,0)+1),MAX($H$35:$BO$35)/BH35),\"\")","v":""},{"$f":"IFERROR($G35*BH36,\"\")","v":""},{"$f":"IFERROR(IF('Vstupní data'!$V$22=\"MAX\",BJ35/SMALL($H$35:$BO$35,COUNTIF($H$35:$BO$35,0)+1),MAX($H$35:$BO$35)/BJ35),\"\")","v":""},{"$f":"IFERROR($G35*BJ36,\"\")","v":""},{"$f":"IFERROR(IF('Vstupní data'!$V$22=\"MAX\",BL35/SMALL($H$35:$BO$35,COUNTIF($H$35:$BO$35,0)+1),MAX($H$35:$BO$35)/BL35),\"\")","v":""},{"$f":"IFERROR($G35*BL36,\"\")","v":""},{"$f":"IFERROR(IF('Vstupní data'!$V$22=\"MAX\",BN35/SMALL($H$35:$BO$35,COUNTIF($H$35:$BO$35,0)+1),MAX($H$35:$BO$35)/BN35),\"\")","v":""},{"$f":"IFERROR($G35*BN36,\"\")","v":""},null,null,null,null,null,null,null,null,null,{"$f":"AL21","v":""},{"$f":"AL53","v":0}]
[null,null,null,{"$f":"'Vstupní data'!W19","v":0},{"$f":"'Vstupní data'!W20","v":0},{"$f":"'Vstupní data'!W21","v":0},{"$f":"IFERROR(GETPIVOTDATA(\"[Measures].[Míra 1]\",'Porovnání v trojúhelníku párů'!$W$8,\"[Tabulka1].[Kritéria]\",\"[Tabulka1].[Kritéria].&[8]\"),0)","v":0},{"$f":"'Vstupní data'!W23","v":0},null,{"$f":"'Vstupní data'!W24","v":0},null,{"$f":"'Vstupní data'!W25","v":0},null,{"$f":"'Vstupní data'!W26","v":0},null,{"$f":"'Vstupní data'!W27","v":0},null,{"$f":"'Vstupní data'!W28","v":0},null,{"$f":"'Vstupní data'!W29","v":0},null,{"$f":"'Vstupní data'!W30","v":0},null,{"$f":"'Vstupní data'!W31","v":0},null,{"$f":"'Vstupní data'!W32","v":0},null,{"$f":"'Vstupní data'!W33","v":0},null,{"$f":"'Vstupní data'!W34","v":0},null,{"$f":"'Vstupní data'!W35","v":0},null,{"$f":"'Vstupní data'!W36","v":0},null,{"$f":"'Vstupní data'!W37","v":0},null,{"$f":"'Vstupní data'!W38","v":0},null,{"$f":"'Vstupní data'!W39","v":0},null,{"$f":"'Vstupní data'!W40","v":0},null,{"$f":"'Vstupní data'!W41","v":0},null,{"$f":"'Vstupní data'!W42","v":0},null,{"$f":"'Vstupní data'!W43","v":0},null,{"$f":"'Vstupní data'!W44","v":0},null,{"$f":"'Vstupní data'!W45","v":0},null,{"$f":"'Vstupní data'!W46","v":0},null,{"$f":"'Vstupní data'!W47","v":0},null,{"$f":"'Vstupní data'!W48","v":0},null,{"$f":"'Vstupní data'!W49","v":0},null,{"$f":"'Vstupní data'!W50","v":0},null,{"$f":"'Vstupní data'!W51","v":0},null,{"$f":"'Vstupní data'!W52","v":0},null,null,null,null,null,null,null,null,null,null,{"$f":"AN21","v":""},{"$f":"AN53","v":0}]
[null,null,null,null,null,null,null,{"$f":"IFERROR(IF('Vstupní data'!$W$22=\"MAX\",H37/SMALL($H$37:$BO$37,COUNTIF($H$37:$BO$37,0)+1),MAX($H$37:$BO$37)/H37),\"\")","v":""},{"$f":"IFERROR($G37*H38,\"\")","v":""},{"$f":"IFERROR(IF('Vstupní data'!$W$22=\"MAX\",J37/SMALL($H$37:$BO$37,COUNTIF($H$37:$BO$37,0)+1),MAX($H$37:$BO$37)/J37),\"\")","v":""},{"$f":"IFERROR($G37*J38,\"\")","v":""},{"$f":"IFERROR(IF('Vstupní data'!$W$22=\"MAX\",L37/SMALL($H$37:$BO$37,COUNTIF($H$37:$BO$37,0)+1),MAX($H$37:$BO$37)/L37),\"\")","v":""},{"$f":"IFERROR($G37*L38,\"\")","v":""},{"$f":"IFERROR(IF('Vstupní data'!$W$22=\"MAX\",N37/SMALL($H$37:$BO$37,COUNTIF($H$37:$BO$37,0)+1),MAX($H$37:$BO$37)/N37),\"\")","v":""},{"$f":"IFERROR($G37*N38,\"\")","v":""},{"$f":"IFERROR(IF('Vstupní data'!$W$22=\"MAX\",P37/SMALL($H$37:$BO$37,COUNTIF($H$37:$BO$37,0)+1),MAX($H$37:$BO$37)/P37),\"\")","v":""},{"$f":"IFERROR($G37*P38,\"\")","v":""},{"$f":"IFERROR(IF('Vstupní data'!$W$22=\"MAX\",R37/SMALL($H$37:$BO$37,COUNTIF($H$37:$BO$37,0)+1),MAX($H$37:$BO$37)/R37),\"\")","v":""},{"$f":"IFERROR($G37*R38,\"\")","v":""},{"$f":"IFERROR(IF('Vstupní data'!$W$22=\"MAX\",T37/SMALL($H$37:$BO$37,COUNTIF($H$37:$BO$37,0)+1),MAX($H$37:$BO$37)/T37),\"\")","v":""},{"$f":"IFERROR($G37*T38,\"\")","v":""},{"$f":"IFERROR(IF('Vstupní data'!$W$22=\"MAX\",V37/SMALL($H$37:$BO$37,COUNTIF($H$37:$BO$37,0)+1),MAX($H$37:$BO$37)/V37),\"\")","v":""},{"$f":"IFERROR($G37*V38,\"\")","v":""},{"$f":"IFERROR(IF('Vstupní data'!$W$22=\"MAX\",X37/SMALL($H$37:$BO$37,COUNTIF($H$37:$BO$37,0)+1),MAX($H$37:$BO$37)/X37),\"\")","v":""},{"$f":"IFERROR($G37*X38,\"\")","v":""},{"$f":"IFERROR(IF('Vstupní data'!$W$22=\"MAX\",Z37/SMALL($H$37:$BO$37,COUNTIF($H$37:$BO$37,0)+1),MAX($H$37:$BO$37)/Z37),\"\")","v":""},{"$f":"IFERROR($G37*Z38,\"\")","v":""},{"$f":"IFERROR(IF('Vstupní data'!$W$22=\"MAX\",AB37/SMALL($H$37:$BO$37,COUNTIF($H$37:$BO$37,0)+1),MAX($H$37:$BO$37)/AB37),\"\")","v":""},{"$f":"IFERROR($G37*AB38,\"\")","v":""},{"$f":"IFERROR(IF('Vstupní data'!$W$22=\"MAX\",AD37/SMALL($H$37:$BO$37,COUNTIF($H$37:$BO$37,0)+1),MAX($H$37:$BO$37)/AD37),\"\")","v":""},{"$f":"IFERROR($G37*AD38,\"\")","v":""},{"$f":"IFERROR(IF('Vstupní data'!$W$22=\"MAX\",AF37/SMALL($H$37:$BO$37,COUNTIF($H$37:$BO$37,0)+1),MAX($H$37:$BO$37)/AF37),\"\")","v":""},{"$f":"IFERROR($G37*AF38,\"\")","v":""},{"$f":"IFERROR(IF('Vstupní data'!$W$22=\"MAX\",AH37/SMALL($H$37:$BO$37,COUNTIF($H$37:$BO$37,0)+1),MAX($H$37:$BO$37)/AH37),\"\")","v":""},{"$f":"IFERROR($G37*AH38,\"\")","v":""},{"$f":"IFERROR(IF('Vstupní data'!$W$22=\"MAX\",AJ37/SMALL($H$37:$BO$37,COUNTIF($H$37:$BO$37,0)+1),MAX($H$37:$BO$37)/AJ37),\"\")","v":""},{"$f":"IFERROR($G37*AJ38,\"\")","v":""},{"$f":"IFERROR(IF('Vstupní data'!$W$22=\"MAX\",AL37/SMALL($H$37:$BO$37,COUNTIF($H$37:$BO$37,0)+1),MAX($H$37:$BO$37)/AL37),\"\")","v":""},{"$f":"IFERROR($G37*AL38,\"\")","v":""},{"$f":"IFERROR(IF('Vstupní data'!$W$22=\"MAX\",AN37/SMALL($H$37:$BO$37,COUNTIF($H$37:$BO$37,0)+1),MAX($H$37:$BO$37)/AN37),\"\")","v":""},{"$f":"IFERROR($G37*AN38,\"\")","v":""},{"$f":"IFERROR(IF('Vstupní data'!$W$22=\"MAX\",AP37/SMALL($H$37:$BO$37,COUNTIF($H$37:$BO$37,0)+1),MAX($H$37:$BO$37)/AP37),\"\")","v":""},{"$f":"IFERROR($G37*AP38,\"\")","v":""},{"$f":"IFERROR(IF('Vstupní data'!$W$22=\"MAX\",AR37/SMALL($H$37:$BO$37,COUNTIF($H$37:$BO$37,0)+1),MAX($H$37:$BO$37)/AR37),\"\")","v":""},{"$f":"IFERROR($G37*AR38,\"\")","v":""},{"$f":"IFERROR(IF('Vstupní data'!$W$22=\"MAX\",AT37/SMALL($H$37:$BO$37,COUNTIF($H$37:$BO$37,0)+1),MAX($H$37:$BO$37)/AT37),\"\")","v":""},{"$f":"IFERROR($G37*AT38,\"\")","v":""},{"$f":"IFERROR(IF('Vstupní data'!$W$22=\"MAX\",AV37/SMALL($H$37:$BO$37,COUNTIF($H$37:$BO$37,0)+1),MAX($H$37:$BO$37)/AV37),\"\")","v":""},{"$f":"IFERROR($G37*AV38,\"\")","v":""},{"$f":"IFERROR(IF('Vstupní data'!$W$22=\"MAX\",AX37/SMALL($H$37:$BO$37,COUNTIF($H$37:$BO$37,0)+1),MAX($H$37:$BO$37)/AX37),\"\")","v":""},{"$f":"IFERROR($G37*AX38,\"\")","v":""},{"$f":"IFERROR(IF('Vstupní data'!$W$22=\"MAX\",AZ37/SMALL($H$37:$BO$37,COUNTIF($H$37:$BO$37,0)+1),MAX($H$37:$BO$37)/AZ37),\"\")","v":""},{"$f":"IFERROR($G37*AZ38,\"\")","v":""},{"$f":"IFERROR(IF('Vstupní data'!$W$22=\"MAX\",BB37/SMALL($H$37:$BO$37,COUNTIF($H$37:$BO$37,0)+1),MAX($H$37:$BO$37)/BB37),\"\")","v":""},{"$f":"IFERROR($G37*BB38,\"\")","v":""},{"$f":"IFERROR(IF('Vstupní data'!$W$22=\"MAX\",BD37/SMALL($H$37:$BO$37,COUNTIF($H$37:$BO$37,0)+1),MAX($H$37:$BO$37)/BD37),\"\")","v":""},{"$f":"IFERROR($G37*BD38,\"\")","v":""},{"$f":"IFERROR(IF('Vstupní data'!$W$22=\"MAX\",BF37/SMALL($H$37:$BO$37,COUNTIF($H$37:$BO$37,0)+1),MAX($H$37:$BO$37)/BF37),\"\")","v":""},{"$f":"IFERROR($G37*BF38,\"\")","v":""},{"$f":"IFERROR(IF('Vstupní data'!$W$22=\"MAX\",BH37/SMALL($H$37:$BO$37,COUNTIF($H$37:$BO$37,0)+1),MAX($H$37:$BO$37)/BH37),\"\")","v":""},{"$f":"IFERROR($G37*BH38,\"\")","v":""},{"$f":"IFERROR(IF('Vstupní data'!$W$22=\"MAX\",BJ37/SMALL($H$37:$BO$37,COUNTIF($H$37:$BO$37,0)+1),MAX($H$37:$BO$37)/BJ37),\"\")","v":""},{"$f":"IFERROR($G37*BJ38,\"\")","v":""},{"$f":"IFERROR(IF('Vstupní data'!$W$22=\"MAX\",BL37/SMALL($H$37:$BO$37,COUNTIF($H$37:$BO$37,0)+1),MAX($H$37:$BO$37)/BL37),\"\")","v":""},{"$f":"IFERROR($G37*BL38,\"\")","v":""},{"$f":"IFERROR(IF('Vstupní data'!$W$22=\"MAX\",BN37/SMALL($H$37:$BO$37,COUNTIF($H$37:$BO$37,0)+1),MAX($H$37:$BO$37)/BN37),\"\")","v":""},{"$f":"IFERROR($G37*BN38,\"\")","v":""},null,null,null,null,null,null,null,null,null,{"$f":"AP21","v":""},{"$f":"AP53","v":0}]
[null,null,null,{"$f":"'Vstupní data'!X19","v":0},{"$f":"'Vstupní data'!X20","v":0},{"$f":"'Vstupní data'!X21","v":0},{"$f":"IFERROR(GETPIVOTDATA(\"[Measures].[Míra 1]\",'Porovnání v trojúhelníku párů'!$W$8,\"[Tabulka1].[Kritéria]\",\"[Tabulka1].[Kritéria].&[9]\"),0)","v":0},{"$f":"'Vstupní data'!X23","v":0},null,{"$f":"'Vstupní data'!X24","v":0},null,{"$f":"'Vstupní data'!X25","v":0},null,{"$f":"'Vstupní data'!X26","v":0},null,{"$f":"'Vstupní data'!X27","v":0},null,{"$f":"'Vstupní data'!X28","v":0},null,{"$f":"'Vstupní data'!X29","v":0},null,{"$f":"'Vstupní data'!X30","v":0},null,{"$f":"'Vstupní data'!X31","v":0},null,{"$f":"'Vstupní data'!X32","v":0},null,{"$f":"'Vstupní data'!X33","v":0},null,{"$f":"'Vstupní data'!X34","v":0},null,{"$f":"'Vstupní data'!X35","v":0},null,{"$f":"'Vstupní data'!X36","v":0},null,{"$f":"'Vstupní data'!X37","v":0},null,{"$f":"'Vstupní data'!X38","v":0},null,{"$f":"'Vstupní data'!X39","v":0},null,{"$f":"'Vstupní data'!X40","v":0},null,{"$f":"'Vstupní data'!X41","v":0},null,{"$f":"'Vstupní data'!X42","v":0},null,{"$f":"'Vstupní data'!X43","v":0},null,{"$f":"'Vstupní data'!X44","v":0},null,{"$f":"'Vstupní data'!X45","v":0},null,{"$f":"'Vstupní data'!X46","v":0},null,{"$f":"'Vstupní data'!X47","v":0},null,{"$f":"'Vstupní data'!X48","v":0},null,{"$f":"'Vstupní data'!X49","v":0},null,{"$f":"'Vstupní data'!X50","v":0},null,{"$f":"'Vstupní data'!X51","v":0},null,{"$f":"'Vstupní data'!X52","v":0},null,null,null,null,null,null,null,null,null,null,{"$f":"AR21","v":""},{"$f":"AR53","v":0}]
[null,null,null,null,null,null,null,{"$f":"IFERROR(IF('Vstupní data'!$X$22=\"MAX\",H39/SMALL($H$39:$BO$39,COUNTIF($H$39:$BO$39,0)+1),MAX($H$39:$BO$39)/H39),\"\")","v":""},{"$f":"IFERROR($G39*H40,\"\")","v":""},{"$f":"IFERROR(IF('Vstupní data'!$X$22=\"MAX\",J39/SMALL($H$39:$BO$39,COUNTIF($H$39:$BO$39,0)+1),MAX($H$39:$BO$39)/J39),\"\")","v":""},{"$f":"IFERROR($G39*J40,\"\")","v":""},{"$f":"IFERROR(IF('Vstupní data'!$X$22=\"MAX\",L39/SMALL($H$39:$BO$39,COUNTIF($H$39:$BO$39,0)+1),MAX($H$39:$BO$39)/L39),\"\")","v":""},{"$f":"IFERROR($G39*L40,\"\")","v":""},{"$f":"IFERROR(IF('Vstupní data'!$X$22=\"MAX\",N39/SMALL($H$39:$BO$39,COUNTIF($H$39:$BO$39,0)+1),MAX($H$39:$BO$39)/N39),\"\")","v":""},{"$f":"IFERROR($G39*N40,\"\")","v":""},{"$f":"IFERROR(IF('Vstupní data'!$X$22=\"MAX\",P39/SMALL($H$39:$BO$39,COUNTIF($H$39:$BO$39,0)+1),MAX($H$39:$BO$39)/P39),\"\")","v":""},{"$f":"IFERROR($G39*P40,\"\")","v":""},{"$f":"IFERROR(IF('Vstupní data'!$X$22=\"MAX\",R39/SMALL($H$39:$BO$39,COUNTIF($H$39:$BO$39,0)+1),MAX($H$39:$BO$39)/R39),\"\")","v":""},{"$f":"IFERROR($G39*R40,\"\")","v":""},{"$f":"IFERROR(IF('Vstupní data'!$X$22=\"MAX\",T39/SMALL($H$39:$BO$39,COUNTIF($H$39:$BO$39,0)+1),MAX($H$39:$BO$39)/T39),\"\")","v":""},{"$f":"IFERROR($G39*T40,\"\")","v":""},{"$f":"IFERROR(IF('Vstupní data'!$X$22=\"MAX\",V39/SMALL($H$39:$BO$39,COUNTIF($H$39:$BO$39,0)+1),MAX($H$39:$BO$39)/V39),\"\")","v":""},{"$f":"IFERROR($G39*V40,\"\")","v":""},{"$f":"IFERROR(IF('Vstupní data'!$X$22=\"MAX\",X39/SMALL($H$39:$BO$39,COUNTIF($H$39:$BO$39,0)+1),MAX($H$39:$BO$39)/X39),\"\")","v":""},{"$f":"IFERROR($G39*X40,\"\")","v":""},{"$f":"IFERROR(IF('Vstupní data'!$X$22=\"MAX\",Z39/SMALL($H$39:$BO$39,COUNTIF($H$39:$BO$39,0)+1),MAX($H$39:$BO$39)/Z39),\"\")","v":""},{"$f":"IFERROR($G39*Z40,\"\")","v":""},{"$f":"IFERROR(IF('Vstupní data'!$X$22=\"MAX\",AB39/SMALL($H$39:$BO$39,COUNTIF($H$39:$BO$39,0)+1),MAX($H$39:$BO$39)/AB39),\"\")","v":""},{"$f":"IFERROR($G39*AB40,\"\")","v":""},{"$f":"IFERROR(IF('Vstupní data'!$X$22=\"MAX\",AD39/SMALL($H$39:$BO$39,COUNTIF($H$39:$BO$39,0)+1),MAX($H$39:$BO$39)/AD39),\"\")","v":""},{"$f":"IFERROR($G39*AD40,\"\")","v":""},{"$f":"IFERROR(IF('Vstupní data'!$X$22=\"MAX\",AF39/SMALL($H$39:$BO$39,COUNTIF($H$39:$BO$39,0)+1),MAX($H$39:$BO$39)/AF39),\"\")","v":""},{"$f":"IFERROR($G39*AF40,\"\")","v":""},{"$f":"IFERROR(IF('Vstupní data'!$X$22=\"MAX\",AH39/SMALL($H$39:$BO$39,COUNTIF($H$39:$BO$39,0)+1),MAX($H$39:$BO$39)/AH39),\"\")","v":""},{"$f":"IFERROR($G39*AH40,\"\")","v":""},{"$f":"IFERROR(IF('Vstupní data'!$X$22=\"MAX\",AJ39/SMALL($H$39:$BO$39,COUNTIF($H$39:$BO$39,0)+1),MAX($H$39:$BO$39)/AJ39),\"\")","v":""},{"$f":"IFERROR($G39*AJ40,\"\")","v":""},{"$f":"IFERROR(IF('Vstupní data'!$X$22=\"MAX\",AL39/SMALL($H$39:$BO$39,COUNTIF($H$39:$BO$39,0)+1),MAX($H$39:$BO$39)/AL39),\"\")","v":""},{"$f":"IFERROR($G39*AL40,\"\")","v":""},{"$f":"IFERROR(IF('Vstupní data'!$X$22=\"MAX\",AN39/SMALL($H$39:$BO$39,COUNTIF($H$39:$BO$39,0)+1),MAX($H$39:$BO$39)/AN39),\"\")","v":""},{"$f":"IFERROR($G39*AN40,\"\")","v":""},{"$f":"IFERROR(IF('Vstupní data'!$X$22=\"MAX\",AP39/SMALL($H$39:$BO$39,COUNTIF($H$39:$BO$39,0)+1),MAX($H$39:$BO$39)/AP39),\"\")","v":""},{"$f":"IFERROR($G39*AP40,\"\")","v":""},{"$f":"IFERROR(IF('Vstupní data'!$X$22=\"MAX\",AR39/SMALL($H$39:$BO$39,COUNTIF($H$39:$BO$39,0)+1),MAX($H$39:$BO$39)/AR39),\"\")","v":""},{"$f":"IFERROR($G39*AR40,\"\")","v":""},{"$f":"IFERROR(IF('Vstupní data'!$X$22=\"MAX\",AT39/SMALL($H$39:$BO$39,COUNTIF($H$39:$BO$39,0)+1),MAX($H$39:$BO$39)/AT39),\"\")","v":""},{"$f":"IFERROR($G39*AT40,\"\")","v":""},{"$f":"IFERROR(IF('Vstupní data'!$X$22=\"MAX\",AV39/SMALL($H$39:$BO$39,COUNTIF($H$39:$BO$39,0)+1),MAX($H$39:$BO$39)/AV39),\"\")","v":""},{"$f":"IFERROR($G39*AV40,\"\")","v":""},{"$f":"IFERROR(IF('Vstupní data'!$X$22=\"MAX\",AX39/SMALL($H$39:$BO$39,COUNTIF($H$39:$BO$39,0)+1),MAX($H$39:$BO$39)/AX39),\"\")","v":""},{"$f":"IFERROR($G39*AX40,\"\")","v":""},{"$f":"IFERROR(IF('Vstupní data'!$X$22=\"MAX\",AZ39/SMALL($H$39:$BO$39,COUNTIF($H$39:$BO$39,0)+1),MAX($H$39:$BO$39)/AZ39),\"\")","v":""},{"$f":"IFERROR($G39*AZ40,\"\")","v":""},{"$f":"IFERROR(IF('Vstupní data'!$X$22=\"MAX\",BB39/SMALL($H$39:$BO$39,COUNTIF($H$39:$BO$39,0)+1),MAX($H$39:$BO$39)/BB39),\"\")","v":""},{"$f":"IFERROR($G39*BB40,\"\")","v":""},{"$f":"IFERROR(IF('Vstupní data'!$X$22=\"MAX\",BD39/SMALL($H$39:$BO$39,COUNTIF($H$39:$BO$39,0)+1),MAX($H$39:$BO$39)/BD39),\"\")","v":""},{"$f":"IFERROR($G39*BD40,\"\")","v":""},{"$f":"IFERROR(IF('Vstupní data'!$X$22=\"MAX\",BF39/SMALL($H$39:$BO$39,COUNTIF($H$39:$BO$39,0)+1),MAX($H$39:$BO$39)/BF39),\"\")","v":""},{"$f":"IFERROR($G39*BF40,\"\")","v":""},{"$f":"IFERROR(IF('Vstupní data'!$X$22=\"MAX\",BH39/SMALL($H$39:$BO$39,COUNTIF($H$39:$BO$39,0)+1),MAX($H$39:$BO$39)/BH39),\"\")","v":""},{"$f":"IFERROR($G39*BH40,\"\")","v":""},{"$f":"IFERROR(IF('Vstupní data'!$X$22=\"MAX\",BJ39/SMALL($H$39:$BO$39,COUNTIF($H$39:$BO$39,0)+1),MAX($H$39:$BO$39)/BJ39),\"\")","v":""},{"$f":"IFERROR($G39*BJ40,\"\")","v":""},{"$f":"IFERROR(IF('Vstupní data'!$X$22=\"MAX\",BL39/SMALL($H$39:$BO$39,COUNTIF($H$39:$BO$39,0)+1),MAX($H$39:$BO$39)/BL39),\"\")","v":""},{"$f":"IFERROR($G39*BL40,\"\")","v":""},{"$f":"IFERROR(IF('Vstupní data'!$X$22=\"MAX\",BN39/SMALL($H$39:$BO$39,COUNTIF($H$39:$BO$39,0)+1),MAX($H$39:$BO$39)/BN39),\"\")","v":""},{"$f":"IFERROR($G39*BN40,\"\")","v":""},null,null,null,null,null,null,null,null,null,{"$f":"AT21","v":""},{"$f":"AT53","v":0}]
[null,null,null,{"$f":"'Vstupní data'!Y19","v":0},{"$f":"'Vstupní data'!Y20","v":0},{"$f":"'Vstupní data'!Y21","v":0},{"$f":"IFERROR(GETPIVOTDATA(\"[Measures].[Míra 1]\",'Porovnání v trojúhelníku párů'!$W$8,\"[Tabulka1].[Kritéria]\",\"[Tabulka1].[Kritéria].&[10]\"),0)","v":0},{"$f":"'Vstupní data'!Y23","v":0},null,{"$f":"'Vstupní data'!Y24","v":0},null,{"$f":"'Vstupní data'!Y25","v":0},null,{"$f":"'Vstupní data'!Y26","v":0},null,{"$f":"'Vstupní data'!Y27","v":0},null,{"$f":"'Vstupní data'!Y28","v":0},null,{"$f":"'Vstupní data'!Y29","v":0},null,{"$f":"'Vstupní data'!Y30","v":0},null,{"$f":"'Vstupní data'!Y31","v":0},null,{"$f":"'Vstupní data'!Y32","v":0},null,{"$f":"'Vstupní data'!Y33","v":0},null,{"$f":"'Vstupní data'!Y34","v":0},null,{"$f":"'Vstupní data'!Y35","v":0},null,{"$f":"'Vstupní data'!Y36","v":0},null,{"$f":"'Vstupní data'!Y37","v":0},null,{"$f":"'Vstupní data'!Y38","v":0},null,{"$f":"'Vstupní data'!Y39","v":0},null,{"$f":"'Vstupní data'!Y40","v":0},null,{"$f":"'Vstupní data'!Y41","v":0},null,{"$f":"'Vstupní data'!Y42","v":0},null,{"$f":"'Vstupní data'!Y43","v":0},null,{"$f":"'Vstupní data'!Y44","v":0},null,{"$f":"'Vstupní data'!Y45","v":0},null,{"$f":"'Vstupní data'!Y46","v":0},null,{"$f":"'Vstupní data'!Y47","v":0},null,{"$f":"'Vstupní data'!Y48","v":0},null,{"$f":"'Vstupní data'!Y49","v":0},null,{"$f":"'Vstupní data'!Y50","v":0},null,{"$f":"'Vstupní data'!Y51","v":0},null,{"$f":"'Vstupní data'!Y52","v":0},null,null,null,null,null,null,null,null,null,null,{"$f":"AV21","v":""},{"$f":"AV53","v":0}]
[null,null,null,null,null,null,null,{"$f":"IFERROR(IF('Vstupní data'!$Y$22=\"MAX\",H41/SMALL($H$41:$BO$41,COUNTIF($H$41:$BO$41,0)+1),MAX($H$41:$BO$41)/H41),\"\")","v":""},{"$f":"IFERROR($G41*H42,\"\")","v":""},{"$f":"IFERROR(IF('Vstupní data'!$Y$22=\"MAX\",J41/SMALL($H$41:$BO$41,COUNTIF($H$41:$BO$41,0)+1),MAX($H$41:$BO$41)/J41),\"\")","v":""},{"$f":"IFERROR($G41*J42,\"\")","v":""},{"$f":"IFERROR(IF('Vstupní data'!$Y$22=\"MAX\",L41/SMALL($H$41:$BO$41,COUNTIF($H$41:$BO$41,0)+1),MAX($H$41:$BO$41)/L41),\"\")","v":""},{"$f":"IFERROR($G41*L42,\"\")","v":""},{"$f":"IFERROR(IF('Vstupní data'!$Y$22=\"MAX\",N41/SMALL($H$41:$BO$41,COUNTIF($H$41:$BO$41,0)+1),MAX($H$41:$BO$41)/N41),\"\")","v":""},{"$f":"IFERROR($G41*N42,\"\")","v":""},{"$f":"IFERROR(IF('Vstupní data'!$Y$22=\"MAX\",P41/SMALL($H$41:$BO$41,COUNTIF($H$41:$BO$41,0)+1),MAX($H$41:$BO$41)/P41),\"\")","v":""},{"$f":"IFERROR($G41*P42,\"\")","v":""},{"$f":"IFERROR(IF('Vstupní data'!$Y$22=\"MAX\",R41/SMALL($H$41:$BO$41,COUNTIF($H$41:$BO$41,0)+1),MAX($H$41:$BO$41)/R41),\"\")","v":""},{"$f":"IFERROR($G41*R42,\"\")","v":""},{"$f":"IFERROR(IF('Vstupní data'!$Y$22=\"MAX\",T41/SMALL($H$41:$BO$41,COUNTIF($H$41:$BO$41,0)+1),MAX($H$41:$BO$41)/T41),\"\")","v":""},{"$f":"IFERROR($G41*T42,\"\")","v":""},{"$f":"IFERROR(IF('Vstupní data'!$Y$22=\"MAX\",V41/SMALL($H$41:$BO$41,COUNTIF($H$41:$BO$41,0)+1),MAX($H$41:$BO$41)/V41),\"\")","v":""},{"$f":"IFERROR($G41*V42,\"\")","v":""},{"$f":"IFERROR(IF('Vstupní data'!$Y$22=\"MAX\",X41/SMALL($H$41:$BO$41,COUNTIF($H$41:$BO$41,0)+1),MAX($H$41:$BO$41)/X41),\"\")","v":""},{"$f":"IFERROR($G41*X42,\"\")","v":""},{"$f":"IFERROR(IF('Vstupní data'!$Y$22=\"MAX\",Z41/SMALL($H$41:$BO$41,COUNTIF($H$41:$BO$41,0)+1),MAX($H$41:$BO$41)/Z41),\"\")","v":""},{"$f":"IFERROR($G41*Z42,\"\")","v":""},{"$f":"IFERROR(IF('Vstupní data'!$Y$22=\"MAX\",AB41/SMALL($H$41:$BO$41,COUNTIF($H$41:$BO$41,0)+1),MAX($H$41:$BO$41)/AB41),\"\")","v":""},{"$f":"IFERROR($G41*AB42,\"\")","v":""},{"$f":"IFERROR(IF('Vstupní data'!$Y$22=\"MAX\",AD41/SMALL($H$41:$BO$41,COUNTIF($H$41:$BO$41,0)+1),MAX($H$41:$BO$41)/AD41),\"\")","v":""},{"$f":"IFERROR($G41*AD42,\"\")","v":""},{"$f":"IFERROR(IF('Vstupní data'!$Y$22=\"MAX\",AF41/SMALL($H$41:$BO$41,COUNTIF($H$41:$BO$41,0)+1),MAX($H$41:$BO$41)/AF41),\"\")","v":""},{"$f":"IFERROR($G41*AF42,\"\")","v":""},{"$f":"IFERROR(IF('Vstupní data'!$Y$22=\"MAX\",AH41/SMALL($H$41:$BO$41,COUNTIF($H$41:$BO$41,0)+1),MAX($H$41:$BO$41)/AH41),\"\")","v":""},{"$f":"IFERROR($G41*AH42,\"\")","v":""},{"$f":"IFERROR(IF('Vstupní data'!$Y$22=\"MAX\",AJ41/SMALL($H$41:$BO$41,COUNTIF($H$41:$BO$41,0)+1),MAX($H$41:$BO$41)/AJ41),\"\")","v":""},{"$f":"IFERROR($G41*AJ42,\"\")","v":""},{"$f":"IFERROR(IF('Vstupní data'!$Y$22=\"MAX\",AL41/SMALL($H$41:$BO$41,COUNTIF($H$41:$BO$41,0)+1),MAX($H$41:$BO$41)/AL41),\"\")","v":""},{"$f":"IFERROR($G41*AL42,\"\")","v":""},{"$f":"IFERROR(IF('Vstupní data'!$Y$22=\"MAX\",AN41/SMALL($H$41:$BO$41,COUNTIF($H$41:$BO$41,0)+1),MAX($H$41:$BO$41)/AN41),\"\")","v":""},{"$f":"IFERROR($G41*AN42,\"\")","v":""},{"$f":"IFERROR(IF('Vstupní data'!$Y$22=\"MAX\",AP41/SMALL($H$41:$BO$41,COUNTIF($H$41:$BO$41,0)+1),MAX($H$41:$BO$41)/AP41),\"\")","v":""},{"$f":"IFERROR($G41*AP42,\"\")","v":""},{"$f":"IFERROR(IF('Vstupní data'!$Y$22=\"MAX\",AR41/SMALL($H$41:$BO$41,COUNTIF($H$41:$BO$41,0)+1),MAX($H$41:$BO$41)/AR41),\"\")","v":""},{"$f":"IFERROR($G41*AR42,\"\")","v":""},{"$f":"IFERROR(IF('Vstupní data'!$Y$22=\"MAX\",AT41/SMALL($H$41:$BO$41,COUNTIF($H$41:$BO$41,0)+1),MAX($H$41:$BO$41)/AT41),\"\")","v":""},{"$f":"IFERROR($G41*AT42,\"\")","v":""},{"$f":"IFERROR(IF('Vstupní data'!$Y$22=\"MAX\",AV41/SMALL($H$41:$BO$41,COUNTIF($H$41:$BO$41,0)+1),MAX($H$41:$BO$41)/AV41),\"\")","v":""},{"$f":"IFERROR($G41*AV42,\"\")","v":""},{"$f":"IFERROR(IF('Vstupní data'!$Y$22=\"MAX\",AX41/SMALL($H$41:$BO$41,COUNTIF($H$41:$BO$41,0)+1),MAX($H$41:$BO$41)/AX41),\"\")","v":""},{"$f":"IFERROR($G41*AX42,\"\")","v":""},{"$f":"IFERROR(IF('Vstupní data'!$Y$22=\"MAX\",AZ41/SMALL($H$41:$BO$41,COUNTIF($H$41:$BO$41,0)+1),MAX($H$41:$BO$41)/AZ41),\"\")","v":""},{"$f":"IFERROR($G41*AZ42,\"\")","v":""},{"$f":"IFERROR(IF('Vstupní data'!$Y$22=\"MAX\",BB41/SMALL($H$41:$BO$41,COUNTIF($H$41:$BO$41,0)+1),MAX($H$41:$BO$41)/BB41),\"\")","v":""},{"$f":"IFERROR($G41*BB42,\"\")","v":""},{"$f":"IFERROR(IF('Vstupní data'!$Y$22=\"MAX\",BD41/SMALL($H$41:$BO$41,COUNTIF($H$41:$BO$41,0)+1),MAX($H$41:$BO$41)/BD41),\"\")","v":""},{"$f":"IFERROR($G41*BD42,\"\")","v":""},{"$f":"IFERROR(IF('Vstupní data'!$Y$22=\"MAX\",BF41/SMALL($H$41:$BO$41,COUNTIF($H$41:$BO$41,0)+1),MAX($H$41:$BO$41)/BF41),\"\")","v":""},{"$f":"IFERROR($G41*BF42,\"\")","v":""},{"$f":"IFERROR(IF('Vstupní data'!$Y$22=\"MAX\",BH41/SMALL($H$41:$BO$41,COUNTIF($H$41:$BO$41,0)+1),MAX($H$41:$BO$41)/BH41),\"\")","v":""},{"$f":"IFERROR($G41*BH42,\"\")","v":""},{"$f":"IFERROR(IF('Vstupní data'!$Y$22=\"MAX\",BJ41/SMALL($H$41:$BO$41,COUNTIF($H$41:$BO$41,0)+1),MAX($H$41:$BO$41)/BJ41),\"\")","v":""},{"$f":"IFERROR($G41*BJ42,\"\")","v":""},{"$f":"IFERROR(IF('Vstupní data'!$Y$22=\"MAX\",BL41/SMALL($H$41:$BO$41,COUNTIF($H$41:$BO$41,0)+1),MAX($H$41:$BO$41)/BL41),\"\")","v":""},{"$f":"IFERROR($G41*BL42,\"\")","v":""},{"$f":"IFERROR(IF('Vstupní data'!$Y$22=\"MAX\",BN41/SMALL($H$41:$BO$41,COUNTIF($H$41:$BO$41,0)+1),MAX($H$41:$BO$41)/BN41),\"\")","v":""},{"$f":"IFERROR($G41*BN42,\"\")","v":""},null,null,null,null,null,null,null,null,null,{"$f":"AX21","v":""},{"$f":"AX53","v":0}]
[null,null,null,{"$f":"'Vstupní data'!Z19","v":0},{"$f":"'Vstupní data'!Z20","v":0},{"$f":"'Vstupní data'!Z21","v":0},{"$f":"IFERROR(GETPIVOTDATA(\"[Measures].[Míra 1]\",'Porovnání v trojúhelníku párů'!$W$8,\"[Tabulka1].[Kritéria]\",\"[Tabulka1].[Kritéria].&[11]\"),0)","v":0},{"$f":"'Vstupní data'!Z23","v":0},null,{"$f":"'Vstupní data'!Z24","v":0},null,{"$f":"'Vstupní data'!Z25","v":0},null,{"$f":"'Vstupní data'!Z26","v":0},null,{"$f":"'Vstupní data'!Z27","v":0},null,{"$f":"'Vstupní data'!Z28","v":0},null,{"$f":"'Vstupní data'!Z29","v":0},null,{"$f":"'Vstupní data'!Z30","v":0},null,{"$f":"'Vstupní data'!Z31","v":0},null,{"$f":"'Vstupní data'!Z32","v":0},null,{"$f":"'Vstupní data'!Z33","v":0},null,{"$f":"'Vstupní data'!Z34","v":0},null,{"$f":"'Vstupní data'!Z35","v":0},null,{"$f":"'Vstupní data'!Z36","v":0},null,{"$f":"'Vstupní data'!Z37","v":0},null,{"$f":"'Vstupní data'!Z38","v":0},null,{"$f":"'Vstupní data'!Z39","v":0},null,{"$f":"'Vstupní data'!Z40","v":0},null,{"$f":"'Vstupní data'!Z41","v":0},null,{"$f":"'Vstupní data'!Z42","v":0},null,{"$f":"'Vstupní data'!Z43","v":0},null,{"$f":"'Vstupní data'!Z44","v":0},null,{"$f":"'Vstupní data'!Z45","v":0},null,{"$f":"'Vstupní data'!Z46","v":0},null,{"$f":"'Vstupní data'!Z47","v":0},null,{"$f":"'Vstupní data'!Z48","v":0},null,{"$f":"'Vstupní data'!Z49","v":0},null,{"$f":"'Vstupní data'!Z50","v":0},null,{"$f":"'Vstupní data'!Z51","v":0},null,{"$f":"'Vstupní data'!Z52","v":0},null,null,null,null,null,null,null,null,null,null,{"$f":"AZ21","v":""},{"$f":"AZ53","v":0}]
[null,null,null,null,null,null,null,{"$f":"IFERROR(IF('Vstupní data'!$Z$22=\"MAX\",H43/SMALL($H$43:$BO$43,COUNTIF($H$43:$BO$43,0)+1),MAX($H$43:$BO$43)/H43),\"\")","v":""},{"$f":"IFERROR($G43*H44,\"\")","v":""},{"$f":"IFERROR(IF('Vstupní data'!$Z$22=\"MAX\",J43/SMALL($H$43:$BO$43,COUNTIF($H$43:$BO$43,0)+1),MAX($H$43:$BO$43)/J43),\"\")","v":""},{"$f":"IFERROR($G43*J44,\"\")","v":""},{"$f":"IFERROR(IF('Vstupní data'!$Z$22=\"MAX\",L43/SMALL($H$43:$BO$43,COUNTIF($H$43:$BO$43,0)+1),MAX($H$43:$BO$43)/L43),\"\")","v":""},{"$f":"IFERROR($G43*L44,\"\")","v":""},{"$f":"IFERROR(IF('Vstupní data'!$Z$22=\"MAX\",N43/SMALL($H$43:$BO$43,COUNTIF($H$43:$BO$43,0)+1),MAX($H$43:$BO$43)/N43),\"\")","v":""},{"$f":"IFERROR($G43*N44,\"\")","v":""},{"$f":"IFERROR(IF('Vstupní data'!$Z$22=\"MAX\",P43/SMALL($H$43:$BO$43,COUNTIF($H$43:$BO$43,0)+1),MAX($H$43:$BO$43)/P43),\"\")","v":""},{"$f":"IFERROR($G43*P44,\"\")","v":""},{"$f":"IFERROR(IF('Vstupní data'!$Z$22=\"MAX\",R43/SMALL($H$43:$BO$43,COUNTIF($H$43:$BO$43,0)+1),MAX($H$43:$BO$43)/R43),\"\")","v":""},{"$f":"IFERROR($G43*R44,\"\")","v":""},{"$f":"IFERROR(IF('Vstupní data'!$Z$22=\"MAX\",T43/SMALL($H$43:$BO$43,COUNTIF($H$43:$BO$43,0)+1),MAX($H$43:$BO$43)/T43),\"\")","v":""},{"$f":"IFERROR($G43*T44,\"\")","v":""},{"$f":"IFERROR(IF('Vstupní data'!$Z$22=\"MAX\",V43/SMALL($H$43:$BO$43,COUNTIF($H$43:$BO$43,0)+1),MAX($H$43:$BO$43)/V43),\"\")","v":""},{"$f":"IFERROR($G43*V44,\"\")","v":""},{"$f":"IFERROR(IF('Vstupní data'!$Z$22=\"MAX\",X43/SMALL($H$43:$BO$43,COUNTIF($H$43:$BO$43,0)+1),MAX($H$43:$BO$43)/X43),\"\")","v":""},{"$f":"IFERROR($G43*X44,\"\")","v":""},{"$f":"IFERROR(IF('Vstupní data'!$Z$22=\"MAX\",Z43/SMALL($H$43:$BO$43,COUNTIF($H$43:$BO$43,0)+1),MAX($H$43:$BO$43)/Z43),\"\")","v":""},{"$f":"IFERROR($G43*Z44,\"\")","v":""},{"$f":"IFERROR(IF('Vstupní data'!$Z$22=\"MAX\",AB43/SMALL($H$43:$BO$43,COUNTIF($H$43:$BO$43,0)+1),MAX($H$43:$BO$43)/AB43),\"\")","v":""},{"$f":"IFERROR($G43*AB44,\"\")","v":""},{"$f":"IFERROR(IF('Vstupní data'!$Z$22=\"MAX\",AD43/SMALL($H$43:$BO$43,COUNTIF($H$43:$BO$43,0)+1),MAX($H$43:$BO$43)/AD43),\"\")","v":""},{"$f":"IFERROR($G43*AD44,\"\")","v":""},{"$f":"IFERROR(IF('Vstupní data'!$Z$22=\"MAX\",AF43/SMALL($H$43:$BO$43,COUNTIF($H$43:$BO$43,0)+1),MAX($H$43:$BO$43)/AF43),\"\")","v":""},{"$f":"IFERROR($G43*AF44,\"\")","v":""},{"$f":"IFERROR(IF('Vstupní data'!$Z$22=\"MAX\",AH43/SMALL($H$43:$BO$43,COUNTIF($H$43:$BO$43,0)+1),MAX($H$43:$BO$43)/AH43),\"\")","v":""},{"$f":"IFERROR($G43*AH44,\"\")","v":""},{"$f":"IFERROR(IF('Vstupní data'!$Z$22=\"MAX\",AJ43/SMALL($H$43:$BO$43,COUNTIF($H$43:$BO$43,0)+1),MAX($H$43:$BO$43)/AJ43),\"\")","v":""},{"$f":"IFERROR($G43*AJ44,\"\")","v":""},{"$f":"IFERROR(IF('Vstupní data'!$Z$22=\"MAX\",AL43/SMALL($H$43:$BO$43,COUNTIF($H$43:$BO$43,0)+1),MAX($H$43:$BO$43)/AL43),\"\")","v":""},{"$f":"IFERROR($G43*AL44,\"\")","v":""},{"$f":"IFERROR(IF('Vstupní data'!$Z$22=\"MAX\",AN43/SMALL($H$43:$BO$43,COUNTIF($H$43:$BO$43,0)+1),MAX($H$43:$BO$43)/AN43),\"\")","v":""},{"$f":"IFERROR($G43*AN44,\"\")","v":""},{"$f":"IFERROR(IF('Vstupní data'!$Z$22=\"MAX\",AP43/SMALL($H$43:$BO$43,COUNTIF($H$43:$BO$43,0)+1),MAX($H$43:$BO$43)/AP43),\"\")","v":""},{"$f":"IFERROR($G43*AP44,\"\")","v":""},{"$f":"IFERROR(IF('Vstupní data'!$Z$22=\"MAX\",AR43/SMALL($H$43:$BO$43,COUNTIF($H$43:$BO$43,0)+1),MAX($H$43:$BO$43)/AR43),\"\")","v":""},{"$f":"IFERROR($G43*AR44,\"\")","v":""},{"$f":"IFERROR(IF('Vstupní data'!$Z$22=\"MAX\",AT43/SMALL($H$43:$BO$43,COUNTIF($H$43:$BO$43,0)+1),MAX($H$43:$BO$43)/AT43),\"\")","v":""},{"$f":"IFERROR($G43*AT44,\"\")","v":""},{"$f":"IFERROR(IF('Vstupní data'!$Z$22=\"MAX\",AV43/SMALL($H$43:$BO$43,COUNTIF($H$43:$BO$43,0)+1),MAX($H$43:$BO$43)/AV43),\"\")","v":""},{"$f":"IFERROR($G43*AV44,\"\")","v":""},{"$f":"IFERROR(IF('Vstupní data'!$Z$22=\"MAX\",AX43/SMALL($H$43:$BO$43,COUNTIF($H$43:$BO$43,0)+1),MAX($H$43:$BO$43)/AX43),\"\")","v":""},{"$f":"IFERROR($G43*AX44,\"\")","v":""},{"$f":"IFERROR(IF('Vstupní data'!$Z$22=\"MAX\",AZ43/SMALL($H$43:$BO$43,COUNTIF($H$43:$BO$43,0)+1),MAX($H$43:$BO$43)/AZ43),\"\")","v":""},{"$f":"IFERROR($G43*AZ44,\"\")","v":""},{"$f":"IFERROR(IF('Vstupní data'!$Z$22=\"MAX\",BB43/SMALL($H$43:$BO$43,COUNTIF($H$43:$BO$43,0)+1),MAX($H$43:$BO$43)/BB43),\"\")","v":""},{"$f":"IFERROR($G43*BB44,\"\")","v":""},{"$f":"IFERROR(IF('Vstupní data'!$Z$22=\"MAX\",BD43/SMALL($H$43:$BO$43,COUNTIF($H$43:$BO$43,0)+1),MAX($H$43:$BO$43)/BD43),\"\")","v":""},{"$f":"IFERROR($G43*BD44,\"\")","v":""},{"$f":"IFERROR(IF('Vstupní data'!$Z$22=\"MAX\",BF43/SMALL($H$43:$BO$43,COUNTIF($H$43:$BO$43,0)+1),MAX($H$43:$BO$43)/BF43),\"\")","v":""},{"$f":"IFERROR($G43*BF44,\"\")","v":""},{"$f":"IFERROR(IF('Vstupní data'!$Z$22=\"MAX\",BH43/SMALL($H$43:$BO$43,COUNTIF($H$43:$BO$43,0)+1),MAX($H$43:$BO$43)/BH43),\"\")","v":""},{"$f":"IFERROR($G43*BH44,\"\")","v":""},{"$f":"IFERROR(IF('Vstupní data'!$Z$22=\"MAX\",BJ43/SMALL($H$43:$BO$43,COUNTIF($H$43:$BO$43,0)+1),MAX($H$43:$BO$43)/BJ43),\"\")","v":""},{"$f":"IFERROR($G43*BJ44,\"\")","v":""},{"$f":"IFERROR(IF('Vstupní data'!$Z$22=\"MAX\",BL43/SMALL($H$43:$BO$43,COUNTIF($H$43:$BO$43,0)+1),MAX($H$43:$BO$43)/BL43),\"\")","v":""},{"$f":"IFERROR($G43*BL44,\"\")","v":""},{"$f":"IFERROR(IF('Vstupní data'!$Z$22=\"MAX\",BN43/SMALL($H$43:$BO$43,COUNTIF($H$43:$BO$43,0)+1),MAX($H$43:$BO$43)/BN43),\"\")","v":""},{"$f":"IFERROR($G43*BN44,\"\")","v":""},null,null,null,null,null,null,null,null,null,{"$f":"BB21","v":""},{"$f":"BB53","v":0}]
[null,null,null,{"$f":"'Vstupní data'!AA19","v":0},{"$f":"'Vstupní data'!AA20","v":0},{"$f":"'Vstupní data'!AA21","v":0},{"$f":"IFERROR(GETPIVOTDATA(\"[Measures].[Míra 1]\",'Porovnání v trojúhelníku párů'!$W$8,\"[Tabulka1].[Kritéria]\",\"[Tabulka1].[Kritéria].&[12]\"),0)","v":0},{"$f":"'Vstupní data'!AA23","v":0},null,{"$f":"'Vstupní data'!AA24","v":0},null,{"$f":"'Vstupní data'!AA25","v":0},null,{"$f":"'Vstupní data'!AA26","v":0},null,{"$f":"'Vstupní data'!AA27","v":0},null,{"$f":"'Vstupní data'!AA28","v":0},null,{"$f":"'Vstupní data'!AA29","v":0},null,{"$f":"'Vstupní data'!AA30","v":0},null,{"$f":"'Vstupní data'!AA31","v":0},null,{"$f":"'Vstupní data'!AA32","v":0},null,{"$f":"'Vstupní data'!AA33","v":0},null,{"$f":"'Vstupní data'!AA34","v":0},null,{"$f":"'Vstupní data'!AA35","v":0},null,{"$f":"'Vstupní data'!AA36","v":0},null,{"$f":"'Vstupní data'!AA37","v":0},null,{"$f":"'Vstupní data'!AA38","v":0},null,{"$f":"'Vstupní data'!AA39","v":0},null,{"$f":"'Vstupní data'!AA40","v":0},null,{"$f":"'Vstupní data'!AA41","v":0},null,{"$f":"'Vstupní data'!AA42","v":0},null,{"$f":"'Vstupní data'!AA43","v":0},null,{"$f":"'Vstupní data'!AA44","v":0},null,{"$f":"'Vstupní data'!AA45","v":0},null,{"$f":"'Vstupní data'!AA46","v":0},null,{"$f":"'Vstupní data'!AA47","v":0},null,{"$f":"'Vstupní data'!AA48","v":0},null,{"$f":"'Vstupní data'!AA49","v":0},null,{"$f":"'Vstupní data'!AA50","v":0},null,{"$f":"'Vstupní data'!AA51","v":0},null,{"$f":"'Vstupní data'!AA52","v":0},null,null,null,null,null,null,null,null,null,null,{"$f":"BD21","v":""},{"$f":"BD53","v":0}]
[null,null,null,null,null,null,null,{"$f":"IFERROR(IF('Vstupní data'!$AA$22=\"MAX\",H45/SMALL($H$45:$BO$45,COUNTIF($H$45:$BO$45,0)+1),MAX($H$45:$BO$45)/H45),\"\")","v":""},{"$f":"IFERROR($G45*H46,\"\")","v":""},{"$f":"IFERROR(IF('Vstupní data'!$AA$22=\"MAX\",J45/SMALL($H$45:$BO$45,COUNTIF($H$45:$BO$45,0)+1),MAX($H$45:$BO$45)/J45),\"\")","v":""},{"$f":"IFERROR($G45*J46,\"\")","v":""},{"$f":"IFERROR(IF('Vstupní data'!$AA$22=\"MAX\",L45/SMALL($H$45:$BO$45,COUNTIF($H$45:$BO$45,0)+1),MAX($H$45:$BO$45)/L45),\"\")","v":""},{"$f":"IFERROR($G45*L46,\"\")","v":""},{"$f":"IFERROR(IF('Vstupní data'!$AA$22=\"MAX\",N45/SMALL($H$45:$BO$45,COUNTIF($H$45:$BO$45,0)+1),MAX($H$45:$BO$45)/N45),\"\")","v":""},{"$f":"IFERROR($G45*N46,\"\")","v":""},{"$f":"IFERROR(IF('Vstupní data'!$AA$22=\"MAX\",P45/SMALL($H$45:$BO$45,COUNTIF($H$45:$BO$45,0)+1),MAX($H$45:$BO$45)/P45),\"\")","v":""},{"$f":"IFERROR($G45*P46,\"\")","v":""},{"$f":"IFERROR(IF('Vstupní data'!$AA$22=\"MAX\",R45/SMALL($H$45:$BO$45,COUNTIF($H$45:$BO$45,0)+1),MAX($H$45:$BO$45)/R45),\"\")","v":""},{"$f":"IFERROR($G45*R46,\"\")","v":""},{"$f":"IFERROR(IF('Vstupní data'!$AA$22=\"MAX\",T45/SMALL($H$45:$BO$45,COUNTIF($H$45:$BO$45,0)+1),MAX($H$45:$BO$45)/T45),\"\")","v":""},{"$f":"IFERROR($G45*T46,\"\")","v":""},{"$f":"IFERROR(IF('Vstupní data'!$AA$22=\"MAX\",V45/SMALL($H$45:$BO$45,COUNTIF($H$45:$BO$45,0)+1),MAX($H$45:$BO$45)/V45),\"\")","v":""},{"$f":"IFERROR($G45*V46,\"\")","v":""},{"$f":"IFERROR(IF('Vstupní data'!$AA$22=\"MAX\",X45/SMALL($H$45:$BO$45,COUNTIF($H$45:$BO$45,0)+1),MAX($H$45:$BO$45)/X45),\"\")","v":""},{"$f":"IFERROR($G45*X46,\"\")","v":""},{"$f":"IFERROR(IF('Vstupní data'!$AA$22=\"MAX\",Z45/SMALL($H$45:$BO$45,COUNTIF($H$45:$BO$45,0)+1),MAX($H$45:$BO$45)/Z45),\"\")","v":""},{"$f":"IFERROR($G45*Z46,\"\")","v":""},{"$f":"IFERROR(IF('Vstupní data'!$AA$22=\"MAX\",AB45/SMALL($H$45:$BO$45,COUNTIF($H$45:$BO$45,0)+1),MAX($H$45:$BO$45)/AB45),\"\")","v":""},{"$f":"IFERROR($G45*AB46,\"\")","v":""},{"$f":"IFERROR(IF('Vstupní data'!$AA$22=\"MAX\",AD45/SMALL($H$45:$BO$45,COUNTIF($H$45:$BO$45,0)+1),MAX($H$45:$BO$45)/AD45),\"\")","v":""},{"$f":"IFERROR($G45*AD46,\"\")","v":""},{"$f":"IFERROR(IF('Vstupní data'!$AA$22=\"MAX\",AF45/SMALL($H$45:$BO$45,COUNTIF($H$45:$BO$45,0)+1),MAX($H$45:$BO$45)/AF45),\"\")","v":""},{"$f":"IFERROR($G45*AF46,\"\")","v":""},{"$f":"IFERROR(IF('Vstupní data'!$AA$22=\"MAX\",AH45/SMALL($H$45:$BO$45,COUNTIF($H$45:$BO$45,0)+1),MAX($H$45:$BO$45)/AH45),\"\")","v":""},{"$f":"IFERROR($G45*AH46,\"\")","v":""},{"$f":"IFERROR(IF('Vstupní data'!$AA$22=\"MAX\",AJ45/SMALL($H$45:$BO$45,COUNTIF($H$45:$BO$45,0)+1),MAX($H$45:$BO$45)/AJ45),\"\")","v":""},{"$f":"IFERROR($G45*AJ46,\"\")","v":""},{"$f":"IFERROR(IF('Vstupní data'!$AA$22=\"MAX\",AL45/SMALL($H$45:$BO$45,COUNTIF($H$45:$BO$45,0)+1),MAX($H$45:$BO$45)/AL45),\"\")","v":""},{"$f":"IFERROR($G45*AL46,\"\")","v":""},{"$f":"IFERROR(IF('Vstupní data'!$AA$22=\"MAX\",AN45/SMALL($H$45:$BO$45,COUNTIF($H$45:$BO$45,0)+1),MAX($H$45:$BO$45)/AN45),\"\")","v":""},{"$f":"IFERROR($G45*AN46,\"\")","v":""},{"$f":"IFERROR(IF('Vstupní data'!$AA$22=\"MAX\",AP45/SMALL($H$45:$BO$45,COUNTIF($H$45:$BO$45,0)+1),MAX($H$45:$BO$45)/AP45),\"\")","v":""},{"$f":"IFERROR($G45*AP46,\"\")","v":""},{"$f":"IFERROR(IF('Vstupní data'!$AA$22=\"MAX\",AR45/SMALL($H$45:$BO$45,COUNTIF($H$45:$BO$45,0)+1),MAX($H$45:$BO$45)/AR45),\"\")","v":""},{"$f":"IFERROR($G45*AR46,\"\")","v":""},{"$f":"IFERROR(IF('Vstupní data'!$AA$22=\"MAX\",AT45/SMALL($H$45:$BO$45,COUNTIF($H$45:$BO$45,0)+1),MAX($H$45:$BO$45)/AT45),\"\")","v":""},{"$f":"IFERROR($G45*AT46,\"\")","v":""},{"$f":"IFERROR(IF('Vstupní data'!$AA$22=\"MAX\",AV45/SMALL($H$45:$BO$45,COUNTIF($H$45:$BO$45,0)+1),MAX($H$45:$BO$45)/AV45),\"\")","v":""},{"$f":"IFERROR($G45*AV46,\"\")","v":""},{"$f":"IFERROR(IF('Vstupní data'!$AA$22=\"MAX\",AX45/SMALL($H$45:$BO$45,COUNTIF($H$45:$BO$45,0)+1),MAX($H$45:$BO$45)/AX45),\"\")","v":""},{"$f":"IFERROR($G45*AX46,\"\")","v":""},{"$f":"IFERROR(IF('Vstupní data'!$AA$22=\"MAX\",AZ45/SMALL($H$45:$BO$45,COUNTIF($H$45:$BO$45,0)+1),MAX($H$45:$BO$45)/AZ45),\"\")","v":""},{"$f":"IFERROR($G45*AZ46,\"\")","v":""},{"$f":"IFERROR(IF('Vstupní data'!$AA$22=\"MAX\",BB45/SMALL($H$45:$BO$45,COUNTIF($H$45:$BO$45,0)+1),MAX($H$45:$BO$45)/BB45),\"\")","v":""},{"$f":"IFERROR($G45*BB46,\"\")","v":""},{"$f":"IFERROR(IF('Vstupní data'!$AA$22=\"MAX\",BD45/SMALL($H$45:$BO$45,COUNTIF($H$45:$BO$45,0)+1),MAX($H$45:$BO$45)/BD45),\"\")","v":""},{"$f":"IFERROR($G45*BD46,\"\")","v":""},{"$f":"IFERROR(IF('Vstupní data'!$AA$22=\"MAX\",BF45/SMALL($H$45:$BO$45,COUNTIF($H$45:$BO$45,0)+1),MAX($H$45:$BO$45)/BF45),\"\")","v":""},{"$f":"IFERROR($G45*BF46,\"\")","v":""},{"$f":"IFERROR(IF('Vstupní data'!$AA$22=\"MAX\",BH45/SMALL($H$45:$BO$45,COUNTIF($H$45:$BO$45,0)+1),MAX($H$45:$BO$45)/BH45),\"\")","v":""},{"$f":"IFERROR($G45*BH46,\"\")","v":""},{"$f":"IFERROR(IF('Vstupní data'!$AA$22=\"MAX\",BJ45/SMALL($H$45:$BO$45,COUNTIF($H$45:$BO$45,0)+1),MAX($H$45:$BO$45)/BJ45),\"\")","v":""},{"$f":"IFERROR($G45*BJ46,\"\")","v":""},{"$f":"IFERROR(IF('Vstupní data'!$AA$22=\"MAX\",BL45/SMALL($H$45:$BO$45,COUNTIF($H$45:$BO$45,0)+1),MAX($H$45:$BO$45)/BL45),\"\")","v":""},{"$f":"IFERROR($G45*BL46,\"\")","v":""},{"$f":"IFERROR(IF('Vstupní data'!$AA$22=\"MAX\",BN45/SMALL($H$45:$BO$45,COUNTIF($H$45:$BO$45,0)+1),MAX($H$45:$BO$45)/BN45),\"\")","v":""},{"$f":"IFERROR($G45*BN46,\"\")","v":""},null,null,null,null,null,null,null,null,null,{"$f":"BF21","v":""},{"$f":"BF53","v":0}]
[null,null,null,{"$f":"'Vstupní data'!AB19","v":0},{"$f":"'Vstupní data'!AB20","v":0},{"$f":"'Vstupní data'!AB21","v":0},{"$f":"IFERROR(GETPIVOTDATA(\"[Measures].[Míra 1]\",'Porovnání v trojúhelníku párů'!$W$8,\"[Tabulka1].[Kritéria]\",\"[Tabulka1].[Kritéria].&[13]\"),0)","v":0},{"$f":"'Vstupní data'!AB23","v":0},null,{"$f":"'Vstupní data'!AB24","v":0},null,{"$f":"'Vstupní data'!AB25","v":0},null,{"$f":"'Vstupní data'!AB26","v":0},null,{"$f":"'Vstupní data'!AB27","v":0},null,{"$f":"'Vstupní data'!AB28","v":0},null,{"$f":"'Vstupní data'!AB29","v":0},null,{"$f":"'Vstupní data'!AB30","v":0},null,{"$f":"'Vstupní data'!AB31","v":0},null,{"$f":"'Vstupní data'!AB32","v":0},null,{"$f":"'Vstupní data'!AB33","v":0},null,{"$f":"'Vstupní data'!AB34","v":0},null,{"$f":"'Vstupní data'!AB35","v":0},null,{"$f":"'Vstupní data'!AB36","v":0},null,{"$f":"'Vstupní data'!AB37","v":0},null,{"$f":"'Vstupní data'!AB38","v":0},null,{"$f":"'Vstupní data'!AB39","v":0},null,{"$f":"'Vstupní data'!AB40","v":0},null,{"$f":"'Vstupní data'!AB41","v":0},null,{"$f":"'Vstupní data'!AB42","v":0},null,{"$f":"'Vstupní data'!AB43","v":0},null,{"$f":"'Vstupní data'!AB44","v":0},null,{"$f":"'Vstupní data'!AB45","v":0},null,{"$f":"'Vstupní data'!AB46","v":0},null,{"$f":"'Vstupní data'!AB47","v":0},null,{"$f":"'Vstupní data'!AB48","v":0},null,{"$f":"'Vstupní data'!AB49","v":0},null,{"$f":"'Vstupní data'!AB50","v":0},null,{"$f":"'Vstupní data'!AB51","v":0},null,{"$f":"'Vstupní data'!AB52","v":0},null,null,null,null,null,null,null,null,null,null,{"$f":"BH21","v":""},{"$f":"BH53","v":0}]
[null,null,null,null,null,null,null,{"$f":"IFERROR(IF('Vstupní data'!$AB$22=\"MAX\",H47/SMALL($H$47:$BO$47,COUNTIF($H$47:$BO$47,0)+1),MAX($H$47:$BO$47)/H47),\"\")","v":""},{"$f":"IFERROR($G47*H48,\"\")","v":""},{"$f":"IFERROR(IF('Vstupní data'!$AB$22=\"MAX\",J47/SMALL($H$47:$BO$47,COUNTIF($H$47:$BO$47,0)+1),MAX($H$47:$BO$47)/J47),\"\")","v":""},{"$f":"IFERROR($G47*J48,\"\")","v":""},{"$f":"IFERROR(IF('Vstupní data'!$AB$22=\"MAX\",L47/SMALL($H$47:$BO$47,COUNTIF($H$47:$BO$47,0)+1),MAX($H$47:$BO$47)/L47),\"\")","v":""},{"$f":"IFERROR($G47*L48,\"\")","v":""},{"$f":"IFERROR(IF('Vstupní data'!$AB$22=\"MAX\",N47/SMALL($H$47:$BO$47,COUNTIF($H$47:$BO$47,0)+1),MAX($H$47:$BO$47)/N47),\"\")","v":""},{"$f":"IFERROR($G47*N48,\"\")","v":""},{"$f":"IFERROR(IF('Vstupní data'!$AB$22=\"MAX\",P47/SMALL($H$47:$BO$47,COUNTIF($H$47:$BO$47,0)+1),MAX($H$47:$BO$47)/P47),\"\")","v":""},{"$f":"IFERROR($G47*P48,\"\")","v":""},{"$f":"IFERROR(IF('Vstupní data'!$AB$22=\"MAX\",R47/SMALL($H$47:$BO$47,COUNTIF($H$47:$BO$47,0)+1),MAX($H$47:$BO$47)/R47),\"\")","v":""},{"$f":"IFERROR($G47*R48,\"\")","v":""},{"$f":"IFERROR(IF('Vstupní data'!$AB$22=\"MAX\",T47/SMALL($H$47:$BO$47,COUNTIF($H$47:$BO$47,0)+1),MAX($H$47:$BO$47)/T47),\"\")","v":""},{"$f":"IFERROR($G47*T48,\"\")","v":""},{"$f":"IFERROR(IF('Vstupní data'!$AB$22=\"MAX\",V47/SMALL($H$47:$BO$47,COUNTIF($H$47:$BO$47,0)+1),MAX($H$47:$BO$47)/V47),\"\")","v":""},{"$f":"IFERROR($G47*V48,\"\")","v":""},{"$f":"IFERROR(IF('Vstupní data'!$AB$22=\"MAX\",X47/SMALL($H$47:$BO$47,COUNTIF($H$47:$BO$47,0)+1),MAX($H$47:$BO$47)/X47),\"\")","v":""},{"$f":"IFERROR($G47*X48,\"\")","v":""},{"$f":"IFERROR(IF('Vstupní data'!$AB$22=\"MAX\",Z47/SMALL($H$47:$BO$47,COUNTIF($H$47:$BO$47,0)+1),MAX($H$47:$BO$47)/Z47),\"\")","v":""},{"$f":"IFERROR($G47*Z48,\"\")","v":""},{"$f":"IFERROR(IF('Vstupní data'!$AB$22=\"MAX\",AB47/SMALL($H$47:$BO$47,COUNTIF($H$47:$BO$47,0)+1),MAX($H$47:$BO$47)/AB47),\"\")","v":""},{"$f":"IFERROR($G47*AB48,\"\")","v":""},{"$f":"IFERROR(IF('Vstupní data'!$AB$22=\"MAX\",AD47/SMALL($H$47:$BO$47,COUNTIF($H$47:$BO$47,0)+1),MAX($H$47:$BO$47)/AD47),\"\")","v":""},{"$f":"IFERROR($G47*AD48,\"\")","v":""},{"$f":"IFERROR(IF('Vstupní data'!$AB$22=\"MAX\",AF47/SMALL($H$47:$BO$47,COUNTIF($H$47:$BO$47,0)+1),MAX($H$47:$BO$47)/AF47),\"\")","v":""},{"$f":"IFERROR($G47*AF48,\"\")","v":""},{"$f":"IFERROR(IF('Vstupní data'!$AB$22=\"MAX\",AH47/SMALL($H$47:$BO$47,COUNTIF($H$47:$BO$47,0)+1),MAX($H$47:$BO$47)/AH47),\"\")","v":""},{"$f":"IFERROR($G47*AH48,\"\")","v":""},{"$f":"IFERROR(IF('Vstupní data'!$AB$22=\"MAX\",AJ47/SMALL($H$47:$BO$47,COUNTIF($H$47:$BO$47,0)+1),MAX($H$47:$BO$47)/AJ47),\"\")","v":""},{"$f":"IFERROR($G47*AJ48,\"\")","v":""},{"$f":"IFERROR(IF('Vstupní data'!$AB$22=\"MAX\",AL47/SMALL($H$47:$BO$47,COUNTIF($H$47:$BO$47,0)+1),MAX($H$47:$BO$47)/AL47),\"\")","v":""},{"$f":"IFERROR($G47*AL48,\"\")","v":""},{"$f":"IFERROR(IF('Vstupní data'!$AB$22=\"MAX\",AN47/SMALL($H$47:$BO$47,COUNTIF($H$47:$BO$47,0)+1),MAX($H$47:$BO$47)/AN47),\"\")","v":""},{"$f":"IFERROR($G47*AN48,\"\")","v":""},{"$f":"IFERROR(IF('Vstupní data'!$AB$22=\"MAX\",AP47/SMALL($H$47:$BO$47,COUNTIF($H$47:$BO$47,0)+1),MAX($H$47:$BO$47)/AP47),\"\")","v":""},{"$f":"IFERROR($G47*AP48,\"\")","v":""},{"$f":"IFERROR(IF('Vstupní data'!$AB$22=\"MAX\",AR47/SMALL($H$47:$BO$47,COUNTIF($H$47:$BO$47,0)+1),MAX($H$47:$BO$47)/AR47),\"\")","v":""},{"$f":"IFERROR($G47*AR48,\"\")","v":""},{"$f":"IFERROR(IF('Vstupní data'!$AB$22=\"MAX\",AT47/SMALL($H$47:$BO$47,COUNTIF($H$47:$BO$47,0)+1),MAX($H$47:$BO$47)/AT47),\"\")","v":""},{"$f":"IFERROR($G47*AT48,\"\")","v":""},{"$f":"IFERROR(IF('Vstupní data'!$AB$22=\"MAX\",AV47/SMALL($H$47:$BO$47,COUNTIF($H$47:$BO$47,0)+1),MAX($H$47:$BO$47)/AV47),\"\")","v":""},{"$f":"IFERROR($G47*AV48,\"\")","v":""},{"$f":"IFERROR(IF('Vstupní data'!$AB$22=\"MAX\",AX47/SMALL($H$47:$BO$47,COUNTIF($H$47:$BO$47,0)+1),MAX($H$47:$BO$47)/AX47),\"\")","v":""},{"$f":"IFERROR($G47*AX48,\"\")","v":""},{"$f":"IFERROR(IF('Vstupní data'!$AB$22=\"MAX\",AZ47/SMALL($H$47:$BO$47,COUNTIF($H$47:$BO$47,0)+1),MAX($H$47:$BO$47)/AZ47),\"\")","v":""},{"$f":"IFERROR($G47*AZ48,\"\")","v":""},{"$f":"IFERROR(IF('Vstupní data'!$AB$22=\"MAX\",BB47/SMALL($H$47:$BO$47,COUNTIF($H$47:$BO$47,0)+1),MAX($H$47:$BO$47)/BB47),\"\")","v":""},{"$f":"IFERROR($G47*BB48,\"\")","v":""},{"$f":"IFERROR(IF('Vstupní data'!$AB$22=\"MAX\",BD47/SMALL($H$47:$BO$47,COUNTIF($H$47:$BO$47,0)+1),MAX($H$47:$BO$47)/BD47),\"\")","v":""},{"$f":"IFERROR($G47*BD48,\"\")","v":""},{"$f":"IFERROR(IF('Vstupní data'!$AB$22=\"MAX\",BF47/SMALL($H$47:$BO$47,COUNTIF($H$47:$BO$47,0)+1),MAX($H$47:$BO$47)/BF47),\"\")","v":""},{"$f":"IFERROR($G47*BF48,\"\")","v":""},{"$f":"IFERROR(IF('Vstupní data'!$AB$22=\"MAX\",BH47/SMALL($H$47:$BO$47,COUNTIF($H$47:$BO$47,0)+1),MAX($H$47:$BO$47)/BH47),\"\")","v":""},{"$f":"IFERROR($G47*BH48,\"\")","v":""},{"$f":"IFERROR(IF('Vstupní data'!$AB$22=\"MAX\",BJ47/SMALL($H$47:$BO$47,COUNTIF($H$47:$BO$47,0)+1),MAX($H$47:$BO$47)/BJ47),\"\")","v":""},{"$f":"IFERROR($G47*BJ48,\"\")","v":""},{"$f":"IFERROR(IF('Vstupní data'!$AB$22=\"MAX\",BL47/SMALL($H$47:$BO$47,COUNTIF($H$47:$BO$47,0)+1),MAX($H$47:$BO$47)/BL47),\"\")","v":""},{"$f":"IFERROR($G47*BL48,\"\")","v":""},{"$f":"IFERROR(IF('Vstupní data'!$AB$22=\"MAX\",BN47/SMALL($H$47:$BO$47,COUNTIF($H$47:$BO$47,0)+1),MAX($H$47:$BO$47)/BN47),\"\")","v":""},{"$f":"IFERROR($G47*BN48,\"\")","v":""},null,null,null,null,null,null,null,null,null,{"$f":"BJ21","v":""},{"$f":"BJ53","v":0}]
[null,null,null,{"$f":"'Vstupní data'!AC19","v":0},{"$f":"'Vstupní data'!AC20","v":0},{"$f":"'Vstupní data'!AC21","v":0},{"$f":"IFERROR(GETPIVOTDATA(\"[Measures].[Míra 1]\",'Porovnání v trojúhelníku párů'!$W$8,\"[Tabulka1].[Kritéria]\",\"[Tabulka1].[Kritéria].&[14]\"),0)","v":0},{"$f":"'Vstupní data'!AC23","v":0},null,{"$f":"'Vstupní data'!AC24","v":0},null,{"$f":"'Vstupní data'!AC25","v":0},null,{"$f":"'Vstupní data'!AC26","v":0},null,{"$f":"'Vstupní data'!AC27","v":0},null,{"$f":"'Vstupní data'!AC28","v":0},null,{"$f":"'Vstupní data'!AC29","v":0},null,{"$f":"'Vstupní data'!AC30","v":0},null,{"$f":"'Vstupní data'!AC31","v":0},null,{"$f":"'Vstupní data'!AC32","v":0},null,{"$f":"'Vstupní data'!AC33","v":0},null,{"$f":"'Vstupní data'!AC34","v":0},null,{"$f":"'Vstupní data'!AC35","v":0},null,{"$f":"'Vstupní data'!AC36","v":0},null,{"$f":"'Vstupní data'!AC37","v":0},null,{"$f":"'Vstupní data'!AC38","v":0},null,{"$f":"'Vstupní data'!AC39","v":0},null,{"$f":"'Vstupní data'!AC40","v":0},null,{"$f":"'Vstupní data'!AC41","v":0},null,{"$f":"'Vstupní data'!AC42","v":0},null,{"$f":"'Vstupní data'!AC43","v":0},null,{"$f":"'Vstupní data'!AC44","v":0},null,{"$f":"'Vstupní data'!AC45","v":0},null,{"$f":"'Vstupní data'!AC46","v":0},null,{"$f":"'Vstupní data'!AC47","v":0},null,{"$f":"'Vstupní data'!AC48","v":0},null,{"$f":"'Vstupní data'!AC49","v":0},null,{"$f":"'Vstupní data'!AC50","v":0},null,{"$f":"'Vstupní data'!AC51","v":0},null,{"$f":"'Vstupní data'!AC52","v":0},null,null,null,null,null,null,null,null,null,null,{"$f":"BL21","v":""},{"$f":"BL53","v":0}]
[null,null,null,null,null,null,null,{"$f":"IFERROR(IF('Vstupní data'!$AC$22=\"MAX\",H49/SMALL($H$49:$BO$49,COUNTIF($H$49:$BO$49,0)+1),MAX($H$49:$BO$49)/H49),\"\")","v":""},{"$f":"IFERROR($G49*H50,\"\")","v":""},{"$f":"IFERROR(IF('Vstupní data'!$AC$22=\"MAX\",J49/SMALL($H$49:$BO$49,COUNTIF($H$49:$BO$49,0)+1),MAX($H$49:$BO$49)/J49),\"\")","v":""},{"$f":"IFERROR($G49*J50,\"\")","v":""},{"$f":"IFERROR(IF('Vstupní data'!$AC$22=\"MAX\",L49/SMALL($H$49:$BO$49,COUNTIF($H$49:$BO$49,0)+1),MAX($H$49:$BO$49)/L49),\"\")","v":""},{"$f":"IFERROR($G49*L50,\"\")","v":""},{"$f":"IFERROR(IF('Vstupní data'!$AC$22=\"MAX\",N49/SMALL($H$49:$BO$49,COUNTIF($H$49:$BO$49,0)+1),MAX($H$49:$BO$49)/N49),\"\")","v":""},{"$f":"IFERROR($G49*N50,\"\")","v":""},{"$f":"IFERROR(IF('Vstupní data'!$AC$22=\"MAX\",P49/SMALL($H$49:$BO$49,COUNTIF($H$49:$BO$49,0)+1),MAX($H$49:$BO$49)/P49),\"\")","v":""},{"$f":"IFERROR($G49*P50,\"\")","v":""},{"$f":"IFERROR(IF('Vstupní data'!$AC$22=\"MAX\",R49/SMALL($H$49:$BO$49,COUNTIF($H$49:$BO$49,0)+1),MAX($H$49:$BO$49)/R49),\"\")","v":""},{"$f":"IFERROR($G49*R50,\"\")","v":""},{"$f":"IFERROR(IF('Vstupní data'!$AC$22=\"MAX\",T49/SMALL($H$49:$BO$49,COUNTIF($H$49:$BO$49,0)+1),MAX($H$49:$BO$49)/T49),\"\")","v":""},{"$f":"IFERROR($G49*T50,\"\")","v":""},{"$f":"IFERROR(IF('Vstupní data'!$AC$22=\"MAX\",V49/SMALL($H$49:$BO$49,COUNTIF($H$49:$BO$49,0)+1),MAX($H$49:$BO$49)/V49),\"\")","v":""},{"$f":"IFERROR($G49*V50,\"\")","v":""},{"$f":"IFERROR(IF('Vstupní data'!$AC$22=\"MAX\",X49/SMALL($H$49:$BO$49,COUNTIF($H$49:$BO$49,0)+1),MAX($H$49:$BO$49)/X49),\"\")","v":""},{"$f":"IFERROR($G49*X50,\"\")","v":""},{"$f":"IFERROR(IF('Vstupní data'!$AC$22=\"MAX\",Z49/SMALL($H$49:$BO$49,COUNTIF($H$49:$BO$49,0)+1),MAX($H$49:$BO$49)/Z49),\"\")","v":""},{"$f":"IFERROR($G49*Z50,\"\")","v":""},{"$f":"IFERROR(IF('Vstupní data'!$AC$22=\"MAX\",AB49/SMALL($H$49:$BO$49,COUNTIF($H$49:$BO$49,0)+1),MAX($H$49:$BO$49)/AB49),\"\")","v":""},{"$f":"IFERROR($G49*AB50,\"\")","v":""},{"$f":"IFERROR(IF('Vstupní data'!$AC$22=\"MAX\",AD49/SMALL($H$49:$BO$49,COUNTIF($H$49:$BO$49,0)+1),MAX($H$49:$BO$49)/AD49),\"\")","v":""},{"$f":"IFERROR($G49*AD50,\"\")","v":""},{"$f":"IFERROR(IF('Vstupní data'!$AC$22=\"MAX\",AF49/SMALL($H$49:$BO$49,COUNTIF($H$49:$BO$49,0)+1),MAX($H$49:$BO$49)/AF49),\"\")","v":""},{"$f":"IFERROR($G49*AF50,\"\")","v":""},{"$f":"IFERROR(IF('Vstupní data'!$AC$22=\"MAX\",AH49/SMALL($H$49:$BO$49,COUNTIF($H$49:$BO$49,0)+1),MAX($H$49:$BO$49)/AH49),\"\")","v":""},{"$f":"IFERROR($G49*AH50,\"\")","v":""},{"$f":"IFERROR(IF('Vstupní data'!$AC$22=\"MAX\",AJ49/SMALL($H$49:$BO$49,COUNTIF($H$49:$BO$49,0)+1),MAX($H$49:$BO$49)/AJ49),\"\")","v":""},{"$f":"IFERROR($G49*AJ50,\"\")","v":""},{"$f":"IFERROR(IF('Vstupní data'!$AC$22=\"MAX\",AL49/SMALL($H$49:$BO$49,COUNTIF($H$49:$BO$49,0)+1),MAX($H$49:$BO$49)/AL49),\"\")","v":""},{"$f":"IFERROR($G49*AL50,\"\")","v":""},{"$f":"IFERROR(IF('Vstupní data'!$AC$22=\"MAX\",AN49/SMALL($H$49:$BO$49,COUNTIF($H$49:$BO$49,0)+1),MAX($H$49:$BO$49)/AN49),\"\")","v":""},{"$f":"IFERROR($G49*AN50,\"\")","v":""},{"$f":"IFERROR(IF('Vstupní data'!$AC$22=\"MAX\",AP49/SMALL($H$49:$BO$49,COUNTIF($H$49:$BO$49,0)+1),MAX($H$49:$BO$49)/AP49),\"\")","v":""},{"$f":"IFERROR($G49*AP50,\"\")","v":""},{"$f":"IFERROR(IF('Vstupní data'!$AC$22=\"MAX\",AR49/SMALL($H$49:$BO$49,COUNTIF($H$49:$BO$49,0)+1),MAX($H$49:$BO$49)/AR49),\"\")","v":""},{"$f":"IFERROR($G49*AR50,\"\")","v":""},{"$f":"IFERROR(IF('Vstupní data'!$AC$22=\"MAX\",AT49/SMALL($H$49:$BO$49,COUNTIF($H$49:$BO$49,0)+1),MAX($H$49:$BO$49)/AT49),\"\")","v":""},{"$f":"IFERROR($G49*AT50,\"\")","v":""},{"$f":"IFERROR(IF('Vstupní data'!$AC$22=\"MAX\",AV49/SMALL($H$49:$BO$49,COUNTIF($H$49:$BO$49,0)+1),MAX($H$49:$BO$49)/AV49),\"\")","v":""},{"$f":"IFERROR($G49*AV50,\"\")","v":""},{"$f":"IFERROR(IF('Vstupní data'!$AC$22=\"MAX\",AX49/SMALL($H$49:$BO$49,COUNTIF($H$49:$BO$49,0)+1),MAX($H$49:$BO$49)/AX49),\"\")","v":""},{"$f":"IFERROR($G49*AX50,\"\")","v":""},{"$f":"IFERROR(IF('Vstupní data'!$AC$22=\"MAX\",AZ49/SMALL($H$49:$BO$49,COUNTIF($H$49:$BO$49,0)+1),MAX($H$49:$BO$49)/AZ49),\"\")","v":""},{"$f":"IFERROR($G49*AZ50,\"\")","v":""},{"$f":"IFERROR(IF('Vstupní data'!$AC$22=\"MAX\",BB49/SMALL($H$49:$BO$49,COUNTIF($H$49:$BO$49,0)+1),MAX($H$49:$BO$49)/BB49),\"\")","v":""},{"$f":"IFERROR($G49*BB50,\"\")","v":""},{"$f":"IFERROR(IF('Vstupní data'!$AC$22=\"MAX\",BD49/SMALL($H$49:$BO$49,COUNTIF($H$49:$BO$49,0)+1),MAX($H$49:$BO$49)/BD49),\"\")","v":""},{"$f":"IFERROR($G49*BD50,\"\")","v":""},{"$f":"IFERROR(IF('Vstupní data'!$AC$22=\"MAX\",BF49/SMALL($H$49:$BO$49,COUNTIF($H$49:$BO$49,0)+1),MAX($H$49:$BO$49)/BF49),\"\")","v":""},{"$f":"IFERROR($G49*BF50,\"\")","v":""},{"$f":"IFERROR(IF('Vstupní data'!$AC$22=\"MAX\",BH49/SMALL($H$49:$BO$49,COUNTIF($H$49:$BO$49,0)+1),MAX($H$49:$BO$49)/BH49),\"\")","v":""},{"$f":"IFERROR($G49*BH50,\"\")","v":""},{"$f":"IFERROR(IF('Vstupní data'!$AC$22=\"MAX\",BJ49/SMALL($H$49:$BO$49,COUNTIF($H$49:$BO$49,0)+1),MAX($H$49:$BO$49)/BJ49),\"\")","v":""},{"$f":"IFERROR($G49*BJ50,\"\")","v":""},{"$f":"IFERROR(IF('Vstupní data'!$AC$22=\"MAX\",BL49/SMALL($H$49:$BO$49,COUNTIF($H$49:$BO$49,0)+1),MAX($H$49:$BO$49)/BL49),\"\")","v":""},{"$f":"IFERROR($G49*BL50,\"\")","v":""},{"$f":"IFERROR(IF('Vstupní data'!$AC$22=\"MAX\",BN49/SMALL($H$49:$BO$49,COUNTIF($H$49:$BO$49,0)+1),MAX($H$49:$BO$49)/BN49),\"\")","v":""},{"$f":"IFERROR($G49*BN50,\"\")","v":""},null,null,null,null,null,null,null,null,null,{"$f":"BN21","v":""},{"$f":"BN53","v":0}]
[null,null,null,{"$f":"'Vstupní data'!AD19","v":0},{"$f":"'Vstupní data'!AD20","v":0},{"$f":"'Vstupní data'!AD21","v":0},{"$f":"IFERROR(GETPIVOTDATA(\"[Measures].[Míra 1]\",'Porovnání v trojúhelníku párů'!$W$8,\"[Tabulka1].[Kritéria]\",\"[Tabulka1].[Kritéria].&[15]\"),0)","v":0},{"$f":"'Vstupní data'!AD23","v":0},null,{"$f":"'Vstupní data'!AD24","v":0},null,{"$f":"'Vstupní data'!AD25","v":0},null,{"$f":"'Vstupní data'!AD26","v":0},null,{"$f":"'Vstupní data'!AD27","v":0},null,{"$f":"'Vstupní data'!AD28","v":0},null,{"$f":"'Vstupní data'!AD29","v":0},null,{"$f":"'Vstupní data'!AD30","v":0},null,{"$f":"'Vstupní data'!AD31","v":0},null,{"$f":"'Vstupní data'!AD32","v":0},null,{"$f":"'Vstupní data'!AD33","v":0},null,{"$f":"'Vstupní data'!AD34","v":0},null,{"$f":"'Vstupní data'!AD35","v":0},null,{"$f":"'Vstupní data'!AD36","v":0},null,{"$f":"'Vstupní data'!AD37","v":0},null,{"$f":"'Vstupní data'!AD38","v":0},null,{"$f":"'Vstupní data'!AD39","v":0},null,{"$f":"'Vstupní data'!AD40","v":0},null,{"$f":"'Vstupní data'!AD41","v":0},null,{"$f":"'Vstupní data'!AD42","v":0},null,{"$f":"'Vstupní data'!AD43","v":0},null,{"$f":"'Vstupní data'!AD44","v":0},null,{"$f":"'Vstupní data'!AD45","v":0},null,{"$f":"'Vstupní data'!AD46","v":0},null,{"$f":"'Vstupní data'!AD47","v":0},null,{"$f":"'Vstupní data'!AD48","v":0},null,{"$f":"'Vstupní data'!AD49","v":0},null,{"$f":"'Vstupní data'!AD50","v":0},null,{"$f":"'Vstupní data'!AD51","v":0},null,{"$f":"'Vstupní data'!AD52","v":0}]
[null,null,null,null,null,null,null,{"$f":"IFERROR(IF('Vstupní data'!$AD$22=\"MAX\",H51/SMALL($H$51:$BO$51,COUNTIF($H$51:$BO$51,0)+1),MAX($H$51:$BO$51)/H51),\"\")","v":""},{"$f":"IFERROR($G51*H52,\"\")","v":""},{"$f":"IFERROR(IF('Vstupní data'!$AD$22=\"MAX\",J51/SMALL($H$51:$BO$51,COUNTIF($H$51:$BO$51,0)+1),MAX($H$51:$BO$51)/J51),\"\")","v":""},{"$f":"IFERROR($G51*J52,\"\")","v":""},{"$f":"IFERROR(IF('Vstupní data'!$AD$22=\"MAX\",L51/SMALL($H$51:$BO$51,COUNTIF($H$51:$BO$51,0)+1),MAX($H$51:$BO$51)/L51),\"\")","v":""},{"$f":"IFERROR($G51*L52,\"\")","v":""},{"$f":"IFERROR(IF('Vstupní data'!$AD$22=\"MAX\",N51/SMALL($H$51:$BO$51,COUNTIF($H$51:$BO$51,0)+1),MAX($H$51:$BO$51)/N51),\"\")","v":""},{"$f":"IFERROR($G51*N52,\"\")","v":""},{"$f":"IFERROR(IF('Vstupní data'!$AD$22=\"MAX\",P51/SMALL($H$51:$BO$51,COUNTIF($H$51:$BO$51,0)+1),MAX($H$51:$BO$51)/P51),\"\")","v":""},{"$f":"IFERROR($G51*P52,\"\")","v":""},{"$f":"IFERROR(IF('Vstupní data'!$AD$22=\"MAX\",R51/SMALL($H$51:$BO$51,COUNTIF($H$51:$BO$51,0)+1),MAX($H$51:$BO$51)/R51),\"\")","v":""},{"$f":"IFERROR($G51*R52,\"\")","v":""},{"$f":"IFERROR(IF('Vstupní data'!$AD$22=\"MAX\",T51/SMALL($H$51:$BO$51,COUNTIF($H$51:$BO$51,0)+1),MAX($H$51:$BO$51)/T51),\"\")","v":""},{"$f":"IFERROR($G51*T52,\"\")","v":""},{"$f":"IFERROR(IF('Vstupní data'!$AD$22=\"MAX\",V51/SMALL($H$51:$BO$51,COUNTIF($H$51:$BO$51,0)+1),MAX($H$51:$BO$51)/V51),\"\")","v":""},{"$f":"IFERROR($G51*V52,\"\")","v":""},{"$f":"IFERROR(IF('Vstupní data'!$AD$22=\"MAX\",X51/SMALL($H$51:$BO$51,COUNTIF($H$51:$BO$51,0)+1),MAX($H$51:$BO$51)/X51),\"\")","v":""},{"$f":"IFERROR($G51*X52,\"\")","v":""},{"$f":"IFERROR(IF('Vstupní data'!$AD$22=\"MAX\",Z51/SMALL($H$51:$BO$51,COUNTIF($H$51:$BO$51,0)+1),MAX($H$51:$BO$51)/Z51),\"\")","v":""},{"$f":"IFERROR($G51*Z52,\"\")","v":""},{"$f":"IFERROR(IF('Vstupní data'!$AD$22=\"MAX\",AB51/SMALL($H$51:$BO$51,COUNTIF($H$51:$BO$51,0)+1),MAX($H$51:$BO$51)/AB51),\"\")","v":""},{"$f":"IFERROR($G51*AB52,\"\")","v":""},{"$f":"IFERROR(IF('Vstupní data'!$AD$22=\"MAX\",AD51/SMALL($H$51:$BO$51,COUNTIF($H$51:$BO$51,0)+1),MAX($H$51:$BO$51)/AD51),\"\")","v":""},{"$f":"IFERROR($G51*AD52,\"\")","v":""},{"$f":"IFERROR(IF('Vstupní data'!$AD$22=\"MAX\",AF51/SMALL($H$51:$BO$51,COUNTIF($H$51:$BO$51,0)+1),MAX($H$51:$BO$51)/AF51),\"\")","v":""},{"$f":"IFERROR($G51*AF52,\"\")","v":""},{"$f":"IFERROR(IF('Vstupní data'!$AD$22=\"MAX\",AH51/SMALL($H$51:$BO$51,COUNTIF($H$51:$BO$51,0)+1),MAX($H$51:$BO$51)/AH51),\"\")","v":""},{"$f":"IFERROR($G51*AH52,\"\")","v":""},{"$f":"IFERROR(IF('Vstupní data'!$AD$22=\"MAX\",AJ51/SMALL($H$51:$BO$51,COUNTIF($H$51:$BO$51,0)+1),MAX($H$51:$BO$51)/AJ51),\"\")","v":""},{"$f":"IFERROR($G51*AJ52,\"\")","v":""},{"$f":"IFERROR(IF('Vstupní data'!$AD$22=\"MAX\",AL51/SMALL($H$51:$BO$51,COUNTIF($H$51:$BO$51,0)+1),MAX($H$51:$BO$51)/AL51),\"\")","v":""},{"$f":"IFERROR($G51*AL52,\"\")","v":""},{"$f":"IFERROR(IF('Vstupní data'!$AD$22=\"MAX\",AN51/SMALL($H$51:$BO$51,COUNTIF($H$51:$BO$51,0)+1),MAX($H$51:$BO$51)/AN51),\"\")","v":""},{"$f":"IFERROR($G51*AN52,\"\")","v":""},{"$f":"IFERROR(IF('Vstupní data'!$AD$22=\"MAX\",AP51/SMALL($H$51:$BO$51,COUNTIF($H$51:$BO$51,0)+1),MAX($H$51:$BO$51)/AP51),\"\")","v":""},{"$f":"IFERROR($G51*AP52,\"\")","v":""},{"$f":"IFERROR(IF('Vstupní data'!$AD$22=\"MAX\",AR51/SMALL($H$51:$BO$51,COUNTIF($H$51:$BO$51,0)+1),MAX($H$51:$BO$51)/AR51),\"\")","v":""},{"$f":"IFERROR($G51*AR52,\"\")","v":""},{"$f":"IFERROR(IF('Vstupní data'!$AD$22=\"MAX\",AT51/SMALL($H$51:$BO$51,COUNTIF($H$51:$BO$51,0)+1),MAX($H$51:$BO$51)/AT51),\"\")","v":""},{"$f":"IFERROR($G51*AT52,\"\")","v":""},{"$f":"IFERROR(IF('Vstupní data'!$AD$22=\"MAX\",AV51/SMALL($H$51:$BO$51,COUNTIF($H$51:$BO$51,0)+1),MAX($H$51:$BO$51)/AV51),\"\")","v":""},{"$f":"IFERROR($G51*AV52,\"\")","v":""},{"$f":"IFERROR(IF('Vstupní data'!$AD$22=\"MAX\",AX51/SMALL($H$51:$BO$51,COUNTIF($H$51:$BO$51,0)+1),MAX($H$51:$BO$51)/AX51),\"\")","v":""},{"$f":"IFERROR($G51*AX52,\"\")","v":""},{"$f":"IFERROR(IF('Vstupní data'!$AD$22=\"MAX\",AZ51/SMALL($H$51:$BO$51,COUNTIF($H$51:$BO$51,0)+1),MAX($H$51:$BO$51)/AZ51),\"\")","v":""},{"$f":"IFERROR($G51*AZ52,\"\")","v":""},{"$f":"IFERROR(IF('Vstupní data'!$AD$22=\"MAX\",BB51/SMALL($H$51:$BO$51,COUNTIF($H$51:$BO$51,0)+1),MAX($H$51:$BO$51)/BB51),\"\")","v":""},{"$f":"IFERROR($G51*BB52,\"\")","v":""},{"$f":"IFERROR(IF('Vstupní data'!$AD$22=\"MAX\",BD51/SMALL($H$51:$BO$51,COUNTIF($H$51:$BO$51,0)+1),MAX($H$51:$BO$51)/BD51),\"\")","v":""},{"$f":"IFERROR($G51*BD52,\"\")","v":""},{"$f":"IFERROR(IF('Vstupní data'!$AD$22=\"MAX\",BF51/SMALL($H$51:$BO$51,COUNTIF($H$51:$BO$51,0)+1),MAX($H$51:$BO$51)/BF51),\"\")","v":""},{"$f":"IFERROR($G51*BF52,\"\")","v":""},{"$f":"IFERROR(IF('Vstupní data'!$AD$22=\"MAX\",BH51/SMALL($H$51:$BO$51,COUNTIF($H$51:$BO$51,0)+1),MAX($H$51:$BO$51)/BH51),\"\")","v":""},{"$f":"IFERROR($G51*BH52,\"\")","v":""},{"$f":"IFERROR(IF('Vstupní data'!$AD$22=\"MAX\",BJ51/SMALL($H$51:$BO$51,COUNTIF($H$51:$BO$51,0)+1),MAX($H$51:$BO$51)/BJ51),\"\")","v":""},{"$f":"IFERROR($G51*BJ52,\"\")","v":""},{"$f":"IFERROR(IF('Vstupní data'!$AD$22=\"MAX\",BL51/SMALL($H$51:$BO$51,COUNTIF($H$51:$BO$51,0)+1),MAX($H$51:$BO$51)/BL51),\"\")","v":""},{"$f":"IFERROR($G51*BL52,\"\")","v":""},{"$f":"IFERROR(IF('Vstupní data'!$AD$22=\"MAX\",BN51/SMALL($H$51:$BO$51,COUNTIF($H$51:$BO$51,0)+1),MAX($H$51:$BO$51)/BN51),\"\")","v":""},{"$f":"IFERROR($G51*BN52,\"\")","v":""}]
[null,null,null,"Celkem Sj",null,null,{"$f":"SUM(G23:G52)","v":1},{"$f":"SUM(I23:I52)","v":1.7455931768388107},null,{"$f":"SUM(K23:K52)","v":1.3279862389149713},null,{"$f":"SUM(M23:M52)","v":1.3062811663489899},null,{"$f":"SUM(O23:O52)","v":1.3751231952960559},null,{"$f":"SUM(Q23:Q52)","v":1.2851487412552434},null,{"$f":"SUM(S23:S52)","v":1.4054308942416776},null,1.3592073541708434,null,0,null,0,null,0,null,0,null,0,null,0,null,0,null,0,null,0,null,0,null,0,null,0,null,0,null,0,null,0,null,0,null,0,null,0,null,0,null,0,null,0,null,0,null,0]
[null,null,null,"Relativní technická úroveň",null,null,null,{"$f":"IFERROR(H53/SMALL($H$53:$BO$53,COUNTIF($H$53:$BO$53,0)+1),\"\")","v":1.3582810462342572},null,{"$f":"IFERROR(J53/SMALL($H$53:$BO$53,COUNTIF($H$53:$BO$53,0)+1),\"\")","v":1.0333327157274319},null,{"$f":"IFERROR(L53/SMALL($H$53:$BO$53,COUNTIF($H$53:$BO$53,0)+1),\"\")","v":1.0164435636244766},null,{"$f":"IFERROR(N53/SMALL($H$53:$BO$53,COUNTIF($H$53:$BO$53,0)+1),\"\")","v":1.0700109264807214},null,{"$f":"IFERROR(P53/SMALL($H$53:$BO$53,COUNTIF($H$53:$BO$53,0)+1),\"\")","v":1},null,{"$f":"IFERROR(R53/SMALL($H$53:$BO$53,COUNTIF($H$53:$BO$53,0)+1),\"\")","v":1.0935939546335711},null,{"$f":"IFERROR(T53/SMALL($H$53:$BO$53,COUNTIF($H$53:$BO$53,0)+1),\"\")","v":1.0576264914232922},null,{"$f":"IFERROR(V53/SMALL($H$53:$BO$53,COUNTIF($H$53:$BO$53,0)+1),\"\")","v":0},null,{"$f":"IFERROR(X53/SMALL($H$53:$BO$53,COUNTIF($H$53:$BO$53,0)+1),\"\")","v":0},null,{"$f":"IFERROR(Z53/SMALL($H$53:$BO$53,COUNTIF($H$53:$BO$53,0)+1),\"\")","v":0},null,{"$f":"IFERROR(AB53/SMALL($H$53:$BO$53,COUNTIF($H$53:$BO$53,0)+1),\"\")","v":0},null,{"$f":"IFERROR(AD53/SMALL($H$53:$BO$53,COUNTIF($H$53:$BO$53,0)+1),\"\")","v":0},null,{"$f":"IFERROR(AF53/SMALL($H$53:$BO$53,COUNTIF($H$53:$BO$53,0)+1),\"\")","v":0},null,{"$f":"IFERROR(AH53/SMALL($H$53:$BO$53,COUNTIF($H$53:$BO$53,0)+1),\"\")","v":0},null,{"$f":"IFERROR(AJ53/SMALL($H$53:$BO$53,COUNTIF($H$53:$BO$53,0)+1),\"\")","v":0},null,{"$f":"IFERROR(AL53/SMALL($H$53:$BO$53,COUNTIF($H$53:$BO$53,0)+1),\"\")","v":0},null,{"$f":"IFERROR(AN53/SMALL($H$53:$BO$53,COUNTIF($H$53:$BO$53,0)+1),\"\")","v":0},null,{"$f":"IFERROR(AP53/SMALL($H$53:$BO$53,COUNTIF($H$53:$BO$53,0)+1),\"\")","v":0},null,{"$f":"IFERROR(AR53/SMALL($H$53:$BO$53,COUNTIF($H$53:$BO$53,0)+1),\"\")","v":0},null,{"$f":"IFERROR(AT53/SMALL($H$53:$BO$53,COUNTIF($H$53:$BO$53,0)+1),\"\")","v":0},null,{"$f":"IFERROR(AV53/SMALL($H$53:$BO$53,COUNTIF($H$53:$BO$53,0)+1),\"\")","v":0},null,{"$f":"IFERROR(AX53/SMALL($H$53:$BO$53,COUNTIF($H$53:$BO$53,0)+1),\"\")","v":0},null,{"$f":"IFERROR(AZ53/SMALL($H$53:$BO$53,COUNTIF($H$53:$BO$53,0)+1),\"\")","v":0},null,{"$f":"IFERROR(BB53/SMALL($H$53:$BO$53,COUNTIF($H$53:$BO$53,0)+1),\"\")","v":0},null,{"$f":"IFERROR(BD53/SMALL($H$53:$BO$53,COUNTIF($H$53:$BO$53,0)+1),\"\")","v":0},null,{"$f":"IFERROR(BF53/SMALL($H$53:$BO$53,COUNTIF($H$53:$BO$53,0)+1),\"\")","v":0},null,{"$f":"IFERROR(BH53/SMALL($H$53:$BO$53,COUNTIF($H$53:$BO$53,0)+1),\"\")","v":0},null,{"$f":"IFERROR(BJ53/SMALL($H$53:$BO$53,COUNTIF($H$53:$BO$53,0)+1),\"\")","v":0},null,{"$f":"IFERROR(BL53/SMALL($H$53:$BO$53,COUNTIF($H$53:$BO$53,0)+1),\"\")","v":0},null,{"$f":"IFERROR(BN53/SMALL($H$53:$BO$53,COUNTIF($H$53:$BO$53,0)+1),\"\")","v":0}]
[null,null,null,"Pořadí",null,null,null,{"$f":"IF(H53=0,\"\",RANK(H53,IF($H$53:$BO$53>0,$H$53:$BO$53,0))+COUNTIF($H$53:$BO$53,H53)-1)","v":1},null,{"$f":"IF(J53=0,\"\",RANK(J53,IF($H$53:$BO$53>0,$H$53:$BO$53,0))+COUNTIF($H$53:$BO$53,J53)-1)","v":5},null,{"$f":"IF(L53=0,\"\",RANK(L53,IF($H$53:$BO$53>0,$H$53:$BO$53,0))+COUNTIF($H$53:$BO$53,L53)-1)","v":6},null,{"$f":"IF(N53=0,\"\",RANK(N53,IF($H$53:$BO$53>0,$H$53:$BO$53,0))+COUNTIF($H$53:$BO$53,N53)-1)","v":3},null,{"$f":"IF(P53=0,\"\",RANK(P53,IF($H$53:$BO$53>0,$H$53:$BO$53,0))+COUNTIF($H$53:$BO$53,P53)-1)","v":7},null,{"$f":"IF(R53=0,\"\",RANK(R53,IF($H$53:$BO$53>0,$H$53:$BO$53,0))+COUNTIF($H$53:$BO$53,R53)-1)","v":2},null,{"$f":"IF(T53=0,\"\",RANK(T53,IF($H$53:$BO$53>0,$H$53:$BO$53,0))+COUNTIF($H$53:$BO$53,T53)-1)","v":4},null,{"$f":"IF(V53=0,\"\",RANK(V53,IF($H$53:$BO$53>0,$H$53:$BO$53,0))+COUNTIF($H$53:$BO$53,V53)-1)","v":""},null,{"$f":"IF(X53=0,\"\",RANK(X53,IF($H$53:$BO$53>0,$H$53:$BO$53,0))+COUNTIF($H$53:$BO$53,X53)-1)","v":""},null,{"$f":"IF(Z53=0,\"\",RANK(Z53,IF($H$53:$BO$53>0,$H$53:$BO$53,0))+COUNTIF($H$53:$BO$53,Z53)-1)","v":""},null,{"$f":"IF(AB53=0,\"\",RANK(AB53,IF($H$53:$BO$53>0,$H$53:$BO$53,0))+COUNTIF($H$53:$BO$53,AB53)-1)","v":""},null,{"$f":"IF(AD53=0,\"\",RANK(AD53,IF($H$53:$BO$53>0,$H$53:$BO$53,0))+COUNTIF($H$53:$BO$53,AD53)-1)","v":""},null,{"$f":"IF(AF53=0,\"\",RANK(AF53,IF($H$53:$BO$53>0,$H$53:$BO$53,0))+COUNTIF($H$53:$BO$53,AF53)-1)","v":""},null,{"$f":"IF(AH53=0,\"\",RANK(AH53,IF($H$53:$BO$53>0,$H$53:$BO$53,0))+COUNTIF($H$53:$BO$53,AH53)-1)","v":""},null,{"$f":"IF(AJ53=0,\"\",RANK(AJ53,IF($H$53:$BO$53>0,$H$53:$BO$53,0))+COUNTIF($H$53:$BO$53,AJ53)-1)","v":""},null,{"$f":"IF(AL53=0,\"\",RANK(AL53,IF($H$53:$BO$53>0,$H$53:$BO$53,0))+COUNTIF($H$53:$BO$53,AL53)-1)","v":""},null,{"$f":"IF(AN53=0,\"\",RANK(AN53,IF($H$53:$BO$53>0,$H$53:$BO$53,0))+COUNTIF($H$53:$BO$53,AN53)-1)","v":""},null,{"$f":"IF(AP53=0,\"\",RANK(AP53,IF($H$53:$BO$53>0,$H$53:$BO$53,0))+COUNTIF($H$53:$BO$53,AP53)-1)","v":""},null,{"$f":"IF(AR53=0,\"\",RANK(AR53,IF($H$53:$BO$53>0,$H$53:$BO$53,0))+COUNTIF($H$53:$BO$53,AR53)-1)","v":""},null,{"$f":"IF(AT53=0,\"\",RANK(AT53,IF($H$53:$BO$53>0,$H$53:$BO$53,0))+COUNTIF($H$53:$BO$53,AT53)-1)","v":""},null,{"$f":"IF(AV53=0,\"\",RANK(AV53,IF($H$53:$BO$53>0,$H$53:$BO$53,0))+COUNTIF($H$53:$BO$53,AV53)-1)","v":""},null,{"$f":"IF(AX53=0,\"\",RANK(AX53,IF($H$53:$BO$53>0,$H$53:$BO$53,0))+COUNTIF($H$53:$BO$53,AX53)-1)","v":""},null,{"$f":"IF(AZ53=0,\"\",RANK(AZ53,IF($H$53:$BO$53>0,$H$53:$BO$53,0))+COUNTIF($H$53:$BO$53,AZ53)-1)","v":""},null,{"$f":"IF(BB53=0,\"\",RANK(BB53,IF($H$53:$BO$53>0,$H$53:$BO$53,0))+COUNTIF($H$53:$BO$53,BB53)-1)","v":""},null,{"$f":"IF(BD53=0,\"\",RANK(BD53,IF($H$53:$BO$53>0,$H$53:$BO$53,0))+COUNTIF($H$53:$BO$53,BD53)-1)","v":""},null,{"$f":"IF(BF53=0,\"\",RANK(BF53,IF($H$53:$BO$53>0,$H$53:$BO$53,0))+COUNTIF($H$53:$BO$53,BF53)-1)","v":""},null,{"$f":"IF(BH53=0,\"\",RANK(BH53,IF($H$53:$BO$53>0,$H$53:$BO$53,0))+COUNTIF($H$53:$BO$53,BH53)-1)","v":""},null,{"$f":"IF(BJ53=0,\"\",RANK(BJ53,IF($H$53:$BO$53>0,$H$53:$BO$53,0))+COUNTIF($H$53:$BO$53,BJ53)-1)","v":""},null,{"$f":"IF(BL53=0,\"\",RANK(BL53,IF($H$53:$BO$53>0,$H$53:$BO$53,0))+COUNTIF($H$53:$BO$53,BL53)-1)","v":""},null,{"$f":"IF(BN53=0,\"\",RANK(BN53,IF($H$53:$BO$53>0,$H$53:$BO$53,0))+COUNTIF($H$53:$BO$53,BN53)-1)","v":""}]

{"sheet":"Export do PDF","index":5,"n_rows":57,"n_cols":8,"rows_kept":57,"cut":false,"hidden":false,"merged":[]}
["Varianta","Název varianty","Hodnota významnosti"]
[{"$f":"'Vstupní data'!N23","v":"V1"},{"$f":"IF('Vstupní data'!O23=0,\"\",'Vstupní data'!O23)","v":"ABB 1600 - 6/1.45"},{"$f":"IF('Metoda PATTERN'!BZ21=0,\"\",'Metoda PATTERN'!BZ21)","v":1.7455931768388107}]
[{"$f":"'Vstupní data'!N24","v":"V2"},{"$f":"IF('Vstupní data'!O24=0,\"\",'Vstupní data'!O24)","v":"ABB 1600 - 10/1.45"},{"$f":"IF('Metoda PATTERN'!BZ22=0,\"\",'Metoda PATTERN'!BZ22)","v":1.3279862389149713}]
[{"$f":"'Vstupní data'!N25","v":"V3"},{"$f":"IF('Vstupní data'!O25=0,\"\",'Vstupní data'!O25)","v":"KUKA KR6 R1820"},{"$f":"IF('Metoda PATTERN'!BZ23=0,\"\",'Metoda PATTERN'!BZ23)","v":1.3062811663489899}]
[{"$f":"'Vstupní data'!N26","v":"V4"},{"$f":"IF('Vstupní data'!O26=0,\"\",'Vstupní data'!O26)","v":"KUKA KR10 R1420"},{"$f":"IF('Metoda PATTERN'!BZ24=0,\"\",'Metoda PATTERN'!BZ24)","v":1.3751231952960559}]
[{"$f":"'Vstupní data'!N27","v":"V5"},{"$f":"IF('Vstupní data'!O27=0,\"\",'Vstupní data'!O27)","v":"Yaskawa Motoman HP20F"},{"$f":"IF('Metoda PATTERN'!BZ25=0,\"\",'Metoda PATTERN'!BZ25)","v":1.2851487412552434}]
[{"$f":"'Vstupní data'!N28","v":"V6"},{"$f":"IF('Vstupní data'!O28=0,\"\",'Vstupní data'!O28)","v":"Fanuc M-10iA/10M"},{"$f":"IF('Metoda PATTERN'!BZ26=0,\"\",'Metoda PATTERN'!BZ26)","v":1.4054308942416776}]
[{"$f":"'Vstupní data'!N29","v":"V7"},{"$f":"IF('Vstupní data'!O29=0,\"\",'Vstupní data'!O29)","v":"Fanuc M-10iA/7L"},{"$f":"IF('Metoda PATTERN'!BZ27=0,\"\",'Metoda PATTERN'!BZ27)","v":1.3592073541708434},null,null,{"$f":"'Porovnání v trojúhelníku párů'!A8","v":""},{"$f":"'Porovnání v trojúhelníku párů'!B8","v":""},{"$f":"IFERROR(GETPIVOTDATA(\"[Measures].[Míra 1]\",'Porovnání v trojúhelníku párů'!$W$8,\"[Tabulka1].[Kritéria]\",\"[Tabulka1].[Kritéria].&[7]\"),\"\")","v":""}]
[{"$f":"'Vstupní data'!N30","v":""},{"$f":"IF('Vstupní data'!O30=0,\"\",'Vstupní data'!O30)","v":""},{"$f":"IF('Metoda PATTERN'!BZ28=0,\"\",'Metoda PATTERN'!BZ28)","v":""},null,null,{"$f":"'Porovnání v trojúhelníku párů'!A9","v":""},{"$f":"'Porovnání v trojúhelníku párů'!B9","v":""},{"$f":"IFERROR(GETPIVOTDATA(\"[Measures].[Míra 1]\",'Porovnání v trojúhelníku párů'!$W$8,\"[Tabulka1].[Kritéria]\",\"[Tabulka1].[Kritéria].&[8]\"),\"\")","v":""}]
[{"$f":"'Vstupní data'!N31","v":""},{"$f":"IF('Vstupní data'!O31=0,\"\",'Vstupní data'!O31)","v":""},{"$f":"IF('Metoda PATTERN'!BZ29=0,\"\",'Metoda PATTERN'!BZ29)","v":""},null,null,{"$f":"'Porovnání v trojúhelníku párů'!A10","v":""},{"$f":"'Porovnání v trojúhelníku párů'!B10","v":""},{"$f":"IFERROR(GETPIVOTDATA(\"[Measures].[Míra 1]\",'Porovnání v trojúhelníku párů'!$W$8,\"[Tabulka1].[Kritéria]\",\"[Tabulka1].[Kritéria].&[9]\"),\"\")","v":""}]
[{"$f":"'Vstupní data'!N32","v":""},{"$f":"IF('Vstupní data'!O32=0,\"\",'Vstupní data'!O32)","v":""},{"$f":"IF('Metoda PATTERN'!BZ30=0,\"\",'Metoda PATTERN'!BZ30)","v":""},null,null,{"$f":"'Porovnání v trojúhelníku párů'!A11","v":""},{"$f":"'Porovnání v trojúhelníku párů'!B11","v":""},{"$f":"IFERROR(GETPIVOTDATA(\"[Measures].[Míra 1]\",'Porovnání v trojúhelníku párů'!$W$8,\"[Tabulka1].[Kritéria]\",\"[Tabulka1].[Kritéria].&[10]\"),\"\")","v":""}]
[{"$f":"'Vstupní data'!N33","v":""},{"$f":"IF('Vstupní data'!O33=0,\"\",'Vstupní data'!O33)","v":""},{"$f":"IF('Metoda PATTERN'!BZ31=0,\"\",'Metoda PATTERN'!BZ31)","v":""},null,null,{"$f":"'Porovnání v trojúhelníku párů'!A12","v":""},{"$f":"'Porovnání v trojúhelníku párů'!B12","v":""},{"$f":"IFERROR(GETPIVOTDATA(\"[Measures].[Míra 1]\",'Porovnání v trojúhelníku párů'!$W$8,\"[Tabulka1].[Kritéria]\",\"[Tabulka1].[Kritéria].&[11]\"),\"\")","v":""}]
[{"$f":"'Vstupní data'!N34","v":""},{"$f":"IF('Vstupní data'!O34=0,\"\",'Vstupní data'!O34)","v":""},{"$f":"IF('Metoda PATTERN'!BZ32=0,\"\",'Metoda PATTERN'!BZ32)","v":""},null,null,{"$f":"'Porovnání v trojúhelníku párů'!A13","v":""},{"$f":"'Porovnání v trojúhelníku párů'!B13","v":""},{"$f":"IFERROR(GETPIVOTDATA(\"[Measures].[Míra 1]\",'Porovnání v trojúhelníku párů'!$W$8,\"[Tabulka1].[Kritéria]\",\"[Tabulka1].[Kritéria].&[12]\"),\"\")","v":""}]
[{"$f":"'Vstupní data'!N35","v":""},{"$f":"IF('Vstupní data'!O35=0,\"\",'Vstupní data'!O35)","v":""},{"$f":"IF('Metoda PATTERN'!BZ33=0,\"\",'Metoda PATTERN'!BZ33)","v":""},null,null,{"$f":"'Porovnání v trojúhelníku párů'!A14","v":""},{"$f":"'Porovnání v trojúhelníku párů'!B14","v":""},{"$f":"IFERROR(GETPIVOTDATA(\"[Measures].[Míra 1]\",'Porovnání v trojúhelníku párů'!$W$8,\"[Tabulka1].[Kritéria]\",\"[Tabulka1].[Kritéria].&[13]\"),\"\")","v":""}]
[{"$f":"'Vstupní data'!N36","v":""},{"$f":"IF('Vstupní data'!O36=0,\"\",'Vstupní data'!O36)","v":""},{"$f":"IF('Metoda PATTERN'!BZ34=0,\"\",'Metoda PATTERN'!BZ34)","v":""},null,null,{"$f":"'Porovnání v trojúhelníku párů'!A15","v":""},{"$f":"'Porovnání v trojúhelníku párů'!B15","v":""},{"$f":"IFERROR(GETPIVOTDATA(\"[Measures].[Míra 1]\",'Porovnání v trojúhelníku párů'!$W$8,\"[Tabulka1].[Kritéria]\",\"[Tabulka1].[Kritéria].&[14]\"),\"\")","v":""}]
[{"$f":"'Vstupní data'!N37","v":""},{"$f":"IF('Vstupní data'!O37=0,\"\",'Vstupní data'!O37)","v":""},{"$f":"IF('Metoda PATTERN'!BZ35=0,\"\",'Metoda PATTERN'!BZ35)","v":""},null,null,{"$f":"'Porovnání v trojúhelníku párů'!A16","v":""},{"$f":"'Porovnání v trojúhelníku párů'!B16","v":""},{"$f":"IFERROR(GETPIVOTDATA(\"[Measures].[Míra 1]\",'Porovnání v trojúhelníku párů'!$W$8,\"[Tabulka1].[Kritéria]\",\"[Tabulka1].[Kritéria].&[15]\"),\"\")","v":""}]
[]
[]
[]
[]
[]
[]
[]
[]
[]
[]
[]
[]
[]
[]
[]
[]
[]
[]
[]
[]
[]
[]
[]
[]
[]
["Kritérium","Název","Váha"]
[{"$f":"'Porovnání v trojúhelníku párů'!A2","v":"K1"},{"$f":"'Porovnání v trojúhelníku párů'!B2","v":"Cena"},{"$f":"IFERROR(GETPIVOTDATA(\"[Measures].[Míra 1]\",'Porovnání v trojúhelníku párů'!$W$8,\"[Tabulka1].[Kritéria]\",\"[Tabulka1].[Kritéria].&[1]\"),\"\")","v":0.26666666666666666}]
[{"$f":"'Porovnání v trojúhelníku párů'!A3","v":"K2"},{"$f":"'Porovnání v trojúhelníku párů'!B3","v":"Nosnost"},{"$f":"IFERROR(GETPIVOTDATA(\"[Measures].[Míra 1]\",'Porovnání v trojúhelníku párů'!$W$8,\"[Tabulka1].[Kritéria]\",\"[Tabulka1].[Kritéria].&[2]\"),\"\")","v":8.8888888888888892E-2}]
[{"$f":"'Porovnání v trojúhelníku párů'!A4","v":"K3"},{"$f":"'Porovnání v trojúhelníku párů'!B4","v":"Dosah (horinz.)"},{"$f":"IFERROR(GETPIVOTDATA(\"[Measures].[Míra 1]\",'Porovnání v trojúhelníku párů'!$W$8,\"[Tabulka1].[Kritéria]\",\"[Tabulka1].[Kritéria].&[3]\"),\"\")","v":0.17777777777777778}]
[{"$f":"'Porovnání v trojúhelníku párů'!A5","v":"K4"},{"$f":"'Porovnání v trojúhelníku párů'!B5","v":"Opakovatelnost"},{"$f":"IFERROR(GETPIVOTDATA(\"[Measures].[Míra 1]\",'Porovnání v trojúhelníku párů'!$W$8,\"[Tabulka1].[Kritéria]\",\"[Tabulka1].[Kritéria].&[4]\"),\"\")","v":0.28888888888888886}]
[{"$f":"'Porovnání v trojúhelníku párů'!A6","v":"K5"},{"$f":"'Porovnání v trojúhelníku párů'!B6","v":"M-M interface"},{"$f":"IFERROR(GETPIVOTDATA(\"[Measures].[Míra 1]\",'Porovnání v trojúhelníku párů'!$W$8,\"[Tabulka1].[Kritéria]\",\"[Tabulka1].[Kritéria].&[5]\"),\"\")","v":6.6666666666666666E-2}]
[{"$f":"'Porovnání v trojúhelníku párů'!A7","v":"K6"},{"$f":"'Porovnání v trojúhelníku párů'!B7","v":"Flexibilita prog."},{"$f":"IFERROR(GETPIVOTDATA(\"[Measures].[Míra 1]\",'Porovnání v trojúhelníku párů'!$W$8,\"[Tabulka1].[Kritéria]\",\"[Tabulka1].[Kritéria].&[6]\"),\"\")","v":0.1111111111111111}]
[{"$f":"'Porovnání v trojúhelníku párů'!A8","v":""},{"$f":"'Porovnání v trojúhelníku párů'!B8","v":""},{"$f":"IFERROR(GETPIVOTDATA(\"[Measures].[Míra 1]\",'Porovnání v trojúhelníku párů'!$W$8,\"[Tabulka1].[Kritéria]\",\"[Tabulka1].[Kritéria].&[7]\"),\"\")","v":""}]
[{"$f":"'Porovnání v trojúhelníku párů'!A9","v":""},{"$f":"'Porovnání v trojúhelníku párů'!B9","v":""},{"$f":"IFERROR(GETPIVOTDATA(\"[Measures].[Míra 1]\",'Porovnání v trojúhelníku párů'!$W$8,\"[Tabulka1].[Kritéria]\",\"[Tabulka1].[Kritéria].&[8]\"),\"\")","v":""}]
[{"$f":"'Porovnání v trojúhelníku párů'!A10","v":""},{"$f":"'Porovnání v trojúhelníku párů'!B10","v":""},{"$f":"IFERROR(GETPIVOTDATA(\"[Measures].[Míra 1]\",'Porovnání v trojúhelníku párů'!$W$8,\"[Tabulka1].[Kritéria]\",\"[Tabulka1].[Kritéria].&[9]\"),\"\")","v":""}]
[{"$f":"'Porovnání v trojúhelníku párů'!A11","v":""},{"$f":"'Porovnání v trojúhelníku párů'!B11","v":""},{"$f":"IFERROR(GETPIVOTDATA(\"[Measures].[Míra 1]\",'Porovnání v trojúhelníku párů'!$W$8,\"[Tabulka1].[Kritéria]\",\"[Tabulka1].[Kritéria].&[10]\"),\"\")","v":""}]
[{"$f":"'Porovnání v trojúhelníku párů'!A12","v":""},{"$f":"'Porovnání v trojúhelníku párů'!B12","v":""},{"$f":"IFERROR(GETPIVOTDATA(\"[Measures].[Míra 1]\",'Porovnání v trojúhelníku párů'!$W$8,\"[Tabulka1].[Kritéria]\",\"[Tabulka1].[Kritéria].&[11]\"),\"\")","v":""}]
[{"$f":"'Porovnání v trojúhelníku párů'!A13","v":""},{"$f":"'Porovnání v trojúhelníku párů'!B13","v":""},{"$f":"IFERROR(GETPIVOTDATA(\"[Measures].[Míra 1]\",'Porovnání v trojúhelníku párů'!$W$8,\"[Tabulka1].[Kritéria]\",\"[Tabulka1].[Kritéria].&[12]\"),\"\")","v":""}]
[{"$f":"'Porovnání v trojúhelníku párů'!A14","v":""},{"$f":"'Porovnání v trojúhelníku párů'!B14","v":""},{"$f":"IFERROR(GETPIVOTDATA(\"[Measures].[Míra 1]\",'Porovnání v trojúhelníku párů'!$W$8,\"[Tabulka1].[Kritéria]\",\"[Tabulka1].[Kritéria].&[13]\"),\"\")","v":""}]
[{"$f":"'Porovnání v trojúhelníku párů'!A15","v":""},{"$f":"'Porovnání v trojúhelníku párů'!B15","v":""},{"$f":"IFERROR(GETPIVOTDATA(\"[Measures].[Míra 1]\",'Porovnání v trojúhelníku párů'!$W$8,\"[Tabulka1].[Kritéria]\",\"[Tabulka1].[Kritéria].&[14]\"),\"\")","v":""}]
[{"$f":"'Porovnání v trojúhelníku párů'!A16","v":""},{"$f":"'Porovnání v trojúhelníku párů'!B16","v":""},{"$f":"IFERROR(GETPIVOTDATA(\"[Measures].[Míra 1]\",'Porovnání v trojúhelníku párů'!$W$8,\"[Tabulka1].[Kritéria]\",\"[Tabulka1].[Kritéria].&[15]\"),\"\")","v":""}]