{"text_format":"1","workbook":"xlsx","n_sheets":5,"sheets":["TEPELNÝ VÝPOČET BRZD","Detail zákazníka","Tisk","Program","Hodnoty Pohon"],"not_rendered":{"charts":0,"images":1,"macros":1,"external_links":0,"defined_names":1,"comments":0,"pivot_tables":0},"unopened":[],"bounds":{"document_bytes":16777216,"sheet_cells":100000,"rows_first":2000,"rows_last":500,"rows_between":2000,"halvings":0,"cell_chars":16384,"cell_head_chars":4096},"cells_cut":0,"cells_raw":0,"read":"whole","date_system":"1900"}

{"sheet":"TEPELNÝ VÝPOČET BRZD","index":0,"n_rows":44,"n_cols":16,"rows_kept":44,"cut":false,"hidden":false,"merged":[[3,1,4,16],[8,1,9,16],[19,1,20,16],[28,10,29,16],[28,1,29,8],[22,13,22,15]]}
[]
[null,null,null,null,null,null,null,"VÝPOČET KOTOUČOVÝCH BRZD"]
[]
[null,"Výběr brzdy"]
[]
[]
[]
[]
[null,"Typ brzdění"]
[]
[]
[]
[]
[null,null,null,null,null,null,null,null,null,null,null,null,null,null,null,1]
[null,null,null,null,null,null,null,null,null,null,null,null,null,null,null,0]
[null,null,null,null,null,null,null,null,null,null,null,null,null,null,null,0]
[]
[]
[]
[null,"Materiál kotouče"]
[]
[]
[null,null,null,null,null,null,null,null,null,null,null,"Název materiálu"]
[null,null,null,null,null,null,null,null,null,null,null,"Hustota",null,"ρ",null,"[kg/m3]"]
[null,null,null,null,null,null,null,null,null,null,null,"Měrná tepelná kapacita",null,"c",null,"[J/Kg.K]"]
[null,null,null,null,null,null,null,null,null,null,null,"Tepelná vodivost",null,"λ",null,"[W/m.K]"]
[]
[]
[null,"Vstupní parametry",null,null,null,null,null,null,null,null,"Výstupní parametry"]
[]
{"$rows_left_out":15}
{"sheet":"Detail zákazníka","index":1,"n_rows":13,"n_cols":3,"rows_kept":13,"cut":false,"hidden":false,"merged":[[12,5,12,9],[2,2,3,9],[4,5,4,9],[6,5,6,9],[8,5,8,9],[10,5,10,9]]}
[]
[]
[null,null,"Detail zákazníka"]
[]
[null,null,"Jméno zákazníka"]
[]
[null,null,"Reference zákazníka"]
[]
[null,null,"Reference PIVKO"]
[]
[null,null,"Typ stroje"]
[]
[null,null,"Jméno výpočtáře"]

{"sheet":"Tisk","index":2,"n_rows":35,"n_cols":9,"rows_kept":35,"cut":false,"hidden":false,"merged":[[27,1,29,3],[34,1,34,3],[10,5,10,9],[12,5,12,6],[15,5,15,7],[18,5,18,7],[20,5,20,7],[17,5,17,7],[16,5,16,7],[11,5,11,7],[13,5,13,7],[21,5,21,7],[22,5,22,7]]}
[]
[null,"Tepelný výpočet brzd PIVKO",null,null,{"$f":"Program!R40","v":" "},null,null,null,{"$f":"Program!V40","v":" "}]
[]
[null,"Jméno zákazníka",null,{"$f":"Program!K40","v":"---"}]
[null,"Reference zákazníka",null,{"$f":"Program!K41","v":"---"}]
[null,"Reference Pivko",null,{"$f":"Program!K42","v":"---"}]
[null,"Typ stroje",null,{"$f":"Program!K43","v":"---"}]
[null,"Jméno výpočtáře",null,{"$f":"Program!K44","v":"---"}]
[]
[null,"Kotouč [mm]",null,null,null,{"$f":"Program!T42","v":" "},{"$f":"Program!U42","v":" "},{"$f":"  Program!V42","v":" "}]
[null,"Materiál",null,null,null,{"$f":"Program!T43","v":" "}]
[null,"Hmotnost kotouče [kg]",null,null,null,{"$f":"Program!T44","v":" "}]
[null,"Moment setrvačnosti kotouče [kg.m2]",null,null,null,{"$f":"Program!T45","v":" "}]
[null,"Styková plocha obou destiček [mm2]",null,null,null,{"$f":"Program!T46","v":" "}]
[]
[null,"Otáčky [ot/min]",null,null,null,{"$f":"Program!T48","v":" "}]
[null,"Čas brzdění [s]",null,null,null,{"$f":"Program!T49","v":" "}]
[null,"Brzdný moment [N.m]",null,null,null,{"$f":"Program!T50","v":" "}]
[null,"Energie kinetická [J]",null,null,null,{"$f":"Program!T51","v":" "}]
[]
[null,"Ohřev kotouče [°C]",null,null,null,{"$f":"Program!T53","v":" "}]
[null,"Ohřev stykové plochy [°C]",null,null,null,{"$f":"Program!T54","v":" "}]
[null,"Zatížení povrchu [mm2/W]",null,null,null,{"$f":"Program!T55","v":" "}]
[null,{"$f":"Program!V16","v":" "},null,null,null,{"$f":"Program!T56","v":" "}]
[]
[]
[null,"Poznámka:"]
[]
[]
[]
{"$rows_left_out":6}
{"sheet":"Program","index":3,"n_rows":56,"n_cols":26,"rows_kept":56,"cut":false,"hidden":true,"merged":[[17,15,17,17],[19,21,19,23],[32,14,32,16],[34,7,34,9],[35,7,35,9],[27,21,27,22],[19,0,19,5],[31,7,31,9],[32,7,32,9],[28,7,28,9],[27,14,27,19],[19,7,19,12],[20,7,20,9],[21,7,21,9],[22,7,22,9],[23,7,23,9],[38,6,38,13],[31,0,31,2],[19,14,19,19],[12,15,12,17],[15,15,15,17],[20,14,20,16],[21,14,21,16],[16,15,16,17],[28,0,28,2],[29,0,29,2],[35,0,35,4],[33,7,33,9],[30,7,30,9],[29,7,29,9],[27,7,27,9],[25,7,25,9],[1,14,1,16],[9,0,9,11],[0,0,0,6],[10,15,10,17],[11,15,11,17],[0,8,0,19],[1,0,1,2],[2,0,2,2],[3,0,3,2],[4,0,4,2],[5,0,5,2],[9,13,9,26],[6,0,6,2],[44,15,44,18],[45,15,45,18],[29,14,29,16],[20,0,20,2],[21,0,21,2],[27,0,27,2],[22,0,22,2],[23,0,23,2],[24,7,24,9],[26,0,26,2],[26,7,26,9],[28,14,28,16],[24,0,24,2],[22,14,22,16],[24,14,24,16],[30,14,30,16],[38,15,38,23],[39,15,39,16],[41,15,41,18],[42,15,42,18],[43,15,43,18]]}
["Zvolené parametry",null,null,null,null,null,null,null,"Výpočet stykové plochy S'"]
["Brzda",null,null,{"$f":"'TEPELNÝ VÝPOČET BRZD'!P14","v":1},{"$f":"IF(D2=1,\"C\",\"H\")","v":"C"},null,null,null,null,"Brzda C","S'1",{"$f":"2*(PI()*(((K5-N6)^2)-((K5-N6-K6)^2)))","v":{"$error":"#DIV/0!"}},"[mm2]",null,"Plocha kotouče [mm2]",null,null,{"$f":"PI()*((K5/1000)^2)","v":0}]
["Typ brzdění",null,null,{"$f":"'TEPELNÝ VÝPOČET BRZD'!P15","v":0},{"$f":"IF(D3=1,\"Mechanické brzdění\",IF(D3=2,\"Pneumatické brzdění\",IF(D3=3,\"Hydraulické brzdění\",\"NEZVOLEN\")))","v":"NEZVOLEN"},null,null,null,null,"Brzda H","S'2",{"$f":"2*(PI()*(((K5-N7)^2)-((K5-N7-K7)^2)))","v":-28896.369227718918},"[mm2]"]
["Pohon",null,null,{"$f":"'TEPELNÝ VÝPOČET BRZD'!P16","v":0},{"$f":"IF(D4=1,\"Motor 07\",IF(D4=2,\"Pohon 07\",IF(D4=3,\"Pohon 10\",IF(D4=4,\"Pohon 15\",IF(D4=5,\"Motor 1\",IF(D4=6,\"Motor 2\",IF(D4=7,\"Motor 3\",IF(D4=8,\"Motor 9\",IF(D4=9,\"Motor 12\",IF(D4=10,\"Motor 16\",IF(D4=11,\"Motor H2\",IF(D4=12,\"Motor H3\",IF(D4=13,\"Motor 03\",IF(D4=14,\"Motor 04\",IF(D4=15,\"Motor 05\",\"NEZVOLEN\")))))))))))))))","v":"NEZVOLEN"},null,null,null,null,null,null,null,null,null,null,null,null,"Brzda C","Brzda H"]
["Materiál",null,null,1,{"$f":"IF(D5=1,A12,IF(D5=2,A13,IF(D5=3,A14,A15)))","v":"Litina s lupínkovým grafitem ČSN 42 2425"},null,null,null,null,"R",{"$f":"E21/2","v":0},"[mm]",null,null,null,null,"R [mm]",{"$f":"K5-N6","v":{"$error":"#DIV/0!"}},{"$f":"K5-N7","v":-5}]
["Volba",null,null,1,{"$f":"A25","v":"Energie kinetická"},null,null,null,null,"k1",30,"[mm]","l1",{"$f":"55.0052681134417*(E21^-0.44722902539)","v":{"$error":"#DIV/0!"}},"[mm]",null,"r [mm]",{"$f":"R5-K6","v":{"$error":"#DIV/0!"}},{"$f":"S5-K7","v":-68}]
["Kontrola 1",null,null,{"$f":"MIN(D2:D4)","v":0},null,null,null,null,null,"k2",63,"[mm]","l2",5,"[mm]",null,"m' [kg]",{"$f":"IF(D5=1,I12,IF(D5=2,I13,IF(D5=3,I14,I15)))","v":{"$error":"#DIV/0!"}},{"$f":"IF(E5=1,J12,IF(E5=2,J13,IF(E5=3,J14,J15)))","v":0}]
[null,null,null,null,null,null,null,null,null,null,null,null,null,null,null,null,"J' [kg.m2]",{"$f":"(R7/2)*(((R6/1000)^2)+((R5/1000)^2))","v":{"$error":"#DIV/0!"}},{"$f":"(S7/2)*(((S6/1000)^2)+((S5/1000)^2))","v":0}]
[]
["Materiál a výpočet hmotnosti",null,null,null,null,null,null,null,null,null,null,null,null,"Pohon/motor"]
[null,null,null,null,"ρ","c","λ",null,"Brzda C","Brzda H","Celková",null,null,null,null,"Pracovní zdvih pružiny",null,null,null,"[mm]",null,"Number1",{"$f":"IF(D4=1,1,IF(D4=2,1,IF(D4=3,2,IF(D4=4,3,IF(D4=5,2,IF(D4=6,3,IF(D4=7,4,IF(D4=8,4,IF(D4=9,5,IF(D4=10,6,IF(D4=11,5,IF(D4=12,6,IF(D4=13,7,IF(D4=14,8,9))))))))))))))","v":9},null,"Number2",{"$f":"IF(D4=1,1,IF(D4=2,2,IF(D4=3,2,IF(D4=4,2,IF(D4=5,3,IF(D4=6,3,IF(D4=7,3,IF(D4=8,2,IF(D4=9,2,IF(D4=10,2,IF(D4=11,3,IF(D4=12,3,IF(D4=13,2,IF(D4=14,2,IF(D4=15,2,0)))))))))))))))","v":0}]
["Litina s lupínkovým grafitem ČSN 42 2425",null,null,null,7250,500,58,null,{"$f":"E12*(($L$2/2000000)*($E$22/1000))","v":{"$error":"#DIV/0!"}},{"$f":"E12*(($L$3/2000000)*($E$22/1000))","v":0},{"$f":"E12*($R$2*($E$22/1000))","v":0},null,null,null,null,"Tlak vzduchu",null,null,null,"[MPa]",null,null,null,null,"Min","Max"]
["Ocel 11 373 (ČSN 41 1372)",null,null,null,7850,460,51,null,{"$f":"E13*(($L$2/2000000)*($E$22/1000))","v":{"$error":"#DIV/0!"}},{"$f":"E13*(($L$3/2000000)*($E$22/1000))","v":0},{"$f":"E13*($R$2*($E$22/1000))","v":0},null,null,null,null,"Tlak média",null,null,null,"[MPa]",null,"Pro C",{"$f":"(VLOOKUP(E21,'Hodnoty Pohon'!A:G,W11+1,0))*L29","v":{"$error":"#N/A"}},null,{"$f":"IF(Z11=1,119.999,IF(Z11=2,349.999,IF(Z11=3,119.999,IF(D2=1,119.999,349.999))))","v":119.999},{"$f":"IF(Z11=1,300.001,IF(Z11=2,1000.001,IF(Z11=3,500.001,IF(D2=1,500.001,1000.001))))","v":500.00099999999998}]
["Ocel 11 523 (ČSN 41 1523)",null,null,null,7800,460,50,null,{"$f":"E14*(($L$2/2000000)*($E$22/1000))","v":{"$error":"#DIV/0!"}},{"$f":"E14*(($L$3/2000000)*($E$22/1000))","v":0},{"$f":"E14*($R$2*($E$22/1000))","v":0},null,null,null,null,null,null,null,null,null,null,"Pro H",{"$f":"(VLOOKUP(E21,'Hodnoty Pohon'!H:Q,W11+1,0))*L29","v":{"$error":"#N/A"}}]
[{"$f":"'TEPELNÝ VÝPOČET BRZD'!N23","v":0},null,null,null,{"$f":"'TEPELNÝ VÝPOČET BRZD'!O24","v":0},{"$f":"'TEPELNÝ VÝPOČET BRZD'!O25","v":0},{"$f":"'TEPELNÝ VÝPOČET BRZD'!O26","v":0},null,{"$f":"E15*(($L$2/2000000)*($E$22/1000))","v":{"$error":"#DIV/0!"}},{"$f":"E15*(($L$3/2000000)*($E$22/1000))","v":0},{"$f":"E15*($R$2*($E$22/1000))","v":0},null,null,null,null,"Výsledná hodnota"]
[null,null,null,null,null,null,null,null,"m' [kg]","m' [kg]","m [kg]",null,null,null,null,{"$f":"IF(D3=1,P11,IF(D3=2,P12,P13))","v":"Tlak média"},null,null,{"$f":"IF(D2=1,W13,W14)","v":{"$error":"#N/A"}},{"$f":"IF(D3=1,T11,IF(D3=2,T12,T13))","v":"[MPa]"},null,{"$f":"IF(D7=0,\" \",IF(D3=1,\"Pracovní zdvih pružiny [mm]\",IF(D3=2,\"Tlak vzduch [MPa]\",\"Tlak média [MPa]\")))","v":" "},null,null,"Limit",{"$f":"IF(D4=1,15.1,IF(D4=2,15.1,IF(D4=3,15.1,IF(D4=4,15.1,IF(D4=5,0.71,IF(D4=6,0.71,IF(D4=7,0.71,IF(D4=8,0.71,IF(D4=9,0.71,IF(D4=10,0.71,IF(D4=11,5.1,IF(D4=12,5.1,IF(D4=13,12.1,IF(D4=14,12.1,IF(D4=15,12.1,0)))))))))))))))","v":0}]
[{"$f":"IF(D5=1,A12,IF(D5=2,A13,IF(D5=3,A14,A15)))","v":"Litina s lupínkovým grafitem ČSN 42 2425"},null,null,null,{"$f":"IF(D5=1,E12,IF(D5=2,E13,IF(D5=3,E14,E15)))","v":7250},{"$f":"IF(D5=1,F12,IF(D5=2,F13,IF(D5=3,F14,F15)))","v":500},{"$f":"IF(D5=1,G12,IF(D5=2,G13,IF(D5=3,G14,G15)))","v":58},null,null,null,null,null,null,null,"Po limitu",{"$f":"P16","v":"Tlak média"},null,null,{"$f":"IF(S16>Z16,\"POHON\",S16)","v":{"$error":"#N/A"}},{"$f":"T16","v":"[MPa]"}]
[]
[]
["Vstupní parametry",null,null,null,null,null,null,"Ostatní parametry",null,null,null,null,null,null,"Výstupní parametry",null,null,null,null,null,null,"Kontrola průměru"]
["Průměr kotouče",null,null,"D",{"$f":"'TEPELNÝ VÝPOČET BRZD'!G32","v":0},"[mm]",null,"Hustota",null,null,"ρ",{"$f":"IF(D5=1,E12,IF(D5=2,E13,IF(D5=3,E14,E15)))","v":7250},"[kg/m3]",null,"Ohřev kotouče",null,null,"K",{"$f":"L34/(L22*L24)","v":{"$error":"#DIV/0!"}},"[°C]",null,"K",{"$f":"IF(E21<Y13,\"PRŮMĚR\",IF(E21>Z13,\"PRŮMĚR\",S21))","v":"PRŮMĚR"},{"$f":"T21","v":"[°C]"}]
["Tloušťka kotouče",null,null,"t",{"$f":"'TEPELNÝ VÝPOČET BRZD'!G34","v":0},"[mm]",null,"Měrná tepelná kapacita",null,null,"c",{"$f":"IF(D5=1,F12,IF(D5=2,F13,IF(D5=3,F14,F15)))","v":500},"[J/Kg.K]",null,"Ohřev stykové plochy",null,null,"S",{"$f":"(0.5270462767*L36*SQRT(E24))/(SQRT(L21*L22*L23))","v":{"$error":"#DIV/0!"}},"[°C]",null,"S",{"$f":"IF(E21<Y13,\"PRŮMĚR\",IF(E21>Z13,\"PRŮMĚR\",S22))","v":"PRŮMĚR"},{"$f":"T22","v":"[°C]"}]
["Otáčky",null,null,"n",{"$f":"'TEPELNÝ VÝPOČET BRZD'!G37","v":0},"[1/min]",null,"Součinitel tepelné vodivosti",null,null,"λ",{"$f":"IF(D5=1,G12,IF(D5=2,G13,IF(D5=3,G14,G15)))","v":58},"[W/m.K]",null,"Zatížení povrchu",null,null,"L",{"$f":"L28/L35","v":{"$error":"#DIV/0!"}},"[mm2/W]",null,"L",{"$f":"IF(E21<Y13,\"PRŮMĚR\",IF(E21>Z13,\"PRŮMĚR\",S23))","v":"PRŮMĚR"},{"$f":"T23","v":"[mm2/W]"}]
["Čas bzdění",null,null,"τ",{"$f":"'TEPELNÝ VÝPOČET BRZD'!G39","v":0},"[s]",null,"Hmotnost mezikruží",null,null,"m'",{"$f":"L21*((L28/2000000)*(E22/1000))","v":{"$error":"#DIV/0!"}},"[kg]"]
[{"$f":"IF($D$6=1,A27,IF($D$6=2,A28,IF($D$6=3,A29,A30)))","v":"Energie kinetická"},null,null,{"$f":"IF($D$6=1,D27,IF($D$6=2,D28,IF($D$6=3,D29,D30)))","v":"E_kin_Vst"},{"$f":"'TEPELNÝ VÝPOČET BRZD'!G41","v":0},{"$f":"IF($D$6=1,F27,IF($D$6=2,F28,IF($D$6=3,F29,F30)))","v":"[J]"},null,"Hmotnost kotouče",null,null,"m",{"$f":"L21*((R2)*(E22/1000))","v":0},"[kg]",null,{"$f":"P16","v":"Tlak média"},null,null,"p",{"$f":"S17","v":{"$error":"#N/A"}},{"$f":"T16","v":"[MPa]"},null,"P",{"$f":"IF(E21<Y13,\"PRŮMĚR\",IF(E21>Z13,\"PRŮMĚR\",S25))","v":"PRŮMĚR"},{"$f":"T25","v":"[MPa]"}]
[null,null,null,null,null,null,null,"Moment setrvačnosti mezikruží",null,null,"J'",{"$f":"IF(D2=1,R8,S8)","v":{"$error":"#DIV/0!"}},"[kg.m2]"]
["Energie kinetická",null,null,"E_kin_Vst",{"$f":"IF($D$6=1,E25,0)","v":0},"[J]",null,"Moment setrvačnosti kotouče",null,null,"J",{"$f":"(L25/2)*((K5/1000)^2)","v":0},"[kg.m2]"]
["Moment setrvačnosti soustrojí",null,null,"Jred",{"$f":"IF($D$6=2,E25,0)","v":0},"[kg.m2]",null,"Styková plocha",null,null,"S'",{"$f":"IF(D2=1,L2,L3)","v":{"$error":"#DIV/0!"}},"[mm2]",null,"Výstupní kontrola",null,null,null,null,null,null,"MAX  z teplot"]
["Výkon",null,null,"P_Vst",{"$f":"IF($D$6=3,E25,0)","v":0},"[W]",null,"Brzdný moment",null,null,"Mb",{"$f":"(L34*60)/(PI()*E23*E24)","v":{"$error":"#DIV/0!"}},"[N.m]",null,"Ohřev kotouče",null,null,"K",{"$f":"IF($D$7=0,IF(E32=0,\"ZADÁNÍ\",IF($V$29>10000,\"---\",W21)),IF(E32=0,\"PARAMETR\",IF($V$29>10000,\"---\",W21)))","v":"ZADÁNÍ"},"[°C]",null,{"$f":"MAX(S21:S22)","v":{"$error":"#DIV/0!"}}]
["Brzdný moment",null,null,"Mb_Vst",{"$f":"IF($D$6=4,E25,0)","v":0},"[N.m]",null,"Energie kinetická",null,null,"E_kin_Vst",{"$f":"E27","v":0},"[J]",null,"Ohřev stykové plochy",null,null,"S",{"$f":"IF($D$7=0,IF(E32=0,\"ZADÁNÍ\",IF($V$29>10000,\"---\",W22)),IF(E32=0,\"PARAMETR\",IF($V$29>10000,\"---\",W22)))","v":"ZADÁNÍ"},"[°C]"]
{"$rows_left_out":27}
{"sheet":"Hodnoty Pohon","index":4,"n_rows":653,"n_cols":26,"rows_kept":653,"cut":false,"hidden":true,"merged":[]}
["D",1,5,6,7,11,12,"D",2,3,4,8,9,10,13,14,15,null,"Zvoleno:",{"$f":"IF(Program!D7=0,IF(Program!D2=1,21,22),Program!D4)","v":21},null,21,22,null,null,"t"]
[120,0.39374999999999999,3.6719298245614027E-2,1.2602086438152011E-2,4.0771456123432975E-3,5.1186440677966107E-2,3.0241935483870972E-2,350,0.11030704225352111,7.8600000000000003E-2,5.2702702702702699E-2,1.1312E-3,7.2273504273504278E-4,5.3121495327102799E-4,7.248000000000001E-3,4.5757575757575759E-3,2.9090909090909089E-3,120,null,{"$f":"IF($T$1=1,R2,IF($T$1=2,H2,IF($T$1=3,H2,IF($T$1=4,H2,IF($T$1=5,A2,IF($T$1=6,A2,IF($T$1=7,A2,IF($T$1=8,H2,IF($T$1=9,H2,IF($T$1=10,H2,IF($T$1=11,A2,IF($T$1=12,A2,IF($T$1=13,H2,IF($T$1=14,H2,IF($T$1=15,H2,IF($T$1=21,V2,IF($T$1=22,W2,0)))))))))))))))))","v":120},null,120,350,null,null,0]
[121,0.39049586776859507,3.6351005166948891E-2,1.2478805742934924E-2,4.0372606815377689E-3,5.0673378372411364E-2,2.9936974789915971E-2,351,0.1098959233028157,7.8324658699801458E-2,5.2512739777105681E-2,1.1271077319271565E-3,7.249285920180289E-4,5.2932748789363587E-4,7.2222222222222228E-3,4.5598141695702673E-3,2.8988200315897055E-3,121,null,{"$f":"IF($T$1=1,R3,IF($T$1=2,H3,IF($T$1=3,H3,IF($T$1=4,H3,IF($T$1=5,A3,IF($T$1=6,A3,IF($T$1=7,A3,IF($T$1=8,H3,IF($T$1=9,H3,IF($T$1=10,H3,IF($T$1=11,A3,IF($T$1=12,A3,IF($T$1=13,H3,IF($T$1=14,H3,IF($T$1=15,H3,IF($T$1=21,V3,IF($T$1=22,W3,0)))))))))))))))))","v":121},null,121,351,null,null,8]
[122,0.38729508196721313,3.5990026652910317E-2,1.2357913682898876E-2,3.9981485444672829E-3,5.0170499256798118E-2,2.9638103161397675E-2,352,0.1095128458923269,7.8051239745176207E-2,5.2324141347424032E-2,1.1230449657869011E-3,7.2235423140193746E-4,5.2745338777374876E-4,7.1966271538555539E-3,4.5439814814814822E-3,2.8886214239422282E-3,122,null,122,null,122,352,null,null,9]
[123,0.3841463414634147,3.56361469373856E-2,1.2239341502340623E-2,3.9597869566396129E-3,4.9677503138392289E-2,2.9345140032948937E-2,353,0.10913242988249423,7.7779723074346677E-2,5.2136892764592144E-2,1.1190113836975709E-3,7.1979809018291572E-4,5.2559251145190206E-4,7.171212859230394E-3,4.5282583621683971E-3,2.8784943260448384E-3,123,null,123,null,123,353,null,null,10]
[124,0.38104838709677424,3.5289158657899167E-2,1.2123023059278039E-2,3.9221545191781889E-3,4.9194101508916337E-2,2.9057911908646011E-2,354,0.10875464763451434,7.7510088903723004E-2,5.1950979588490841E-2,1.1150066723280359E-3,7.1725997562809506E-4,5.2374471945791168E-4,7.145977429923552E-3,4.5126436781609209E-3,2.8684379884159239E-3,124,null,124,null,124,354,null,null,11]
[125,0.378,3.4948862450427887E-2,1.2008894702419884E-2,3.8852306390181972E-3,4.8720016981532596E-2,2.8776252019386113E-2,355,0.10837947189097109,7.7242317723097836E-2,5.176638758423522E-2,1.1110305228165607E-3,7.1473969771347363E-4,5.2190987427602786E-4,7.1209189842805316E-3,4.4971363115693021E-3,2.8584516720109943E-3,125,null,125,null,125,355,null,null,12]
[126,0.375,3.4615066567435702E-2,1.1896895155020104E-2,3.848995491330034E-3,4.8254982760070661E-2,2.8500000000000001E-2,356,0.10800687576927979,7.6976390290940291E-2,5.1583102718541399E-2,1.1070826306913996E-3,7.1223706907649117E-4,5.2008784031081976E-4,7.0960356669478239E-3,4.4817351598173535E-3,2.8485346480416323E-3,126,null,126,null,126,356,null,null,13]
[127,0.37204724409448819,3.4287586517590202E-2,1.1786965405171435E-2,3.8134299840260522E-3,4.7798742138364797E-2,2.8229001584786056E-2,357,0.10763683275526612,7.6712287629786977E-2,5.1401111156170125E-2,1.1031626957930744E-3,7.0975190496959731E-4,5.1827848385377232E-4,7.0713256484149839E-3,4.4664391353811169E-3,2.8386861977981984E-3,127,null,127,null,127,357,null,null,14]
[128,0.369140625,3.39662447257384E-2,1.1679048602125527E-2,3.7785157242170822E-3,4.7351048027727369E-2,2.7963108320251177E-2,358,0.10726931669687652,7.6449991021727379E-2,5.1220399256445448E-2,1.0992704221983016E-3,7.0728402321478781E-4,5.1648167305057757E-4,7.0467871245662303E-3,4.4512471655328819E-3,2.8289056124761991E-3,128,null,128,null,128,358,null,null,15]
[129,0.3662790697674419,3.3650870211825237E-2,1.1573089958256949E-2,3.7442349864948957E-3,4.6911662510730506E-2,2.770217729393468E-2,359,0.10690430179801723,7.6189482003981679E-2,5.1040953569846538E-2,1.0954055181455215E-3,7.048332441590867E-4,5.1469727786910397E-4,7.0224183162413524E-3,4.4361581920903973E-3,2.819192193006235E-3,129,null,129,null,129,359,null,null,16]
[130,0.3634615384615385,3.3341298287534855E-2,1.1469036656315811E-2,3.7105706829257032E-3,4.6480356419603089E-2,2.7446070878274269E-2,360,0.10654176261251841,7.5930742364568579E-2,5.0862760834670895E-2,1.0915676959619952E-3,7.0239939063095069E-4,5.1292517006802749E-4,6.998217468805701E-3,4.4211711711711734E-3,2.8095452498874385E-3,130,null,130,null,130,360,null,null,17]
[131,0.36068702290076343,3.3037370269523705E-2,1.1366837761639118E-2,3.6775063346479501E-3,4.6056908937673079E-2,2.7194656488549615E-2,361,0.1061816740382209,7.5673754138061225E-2,5.0685807973767295E-2,1.0877566719924255E-3,6.9998228789757322E-4,5.1116522316610902E-4,6.974182851729036E-3,4.4062850729517421E-3,2.7999641030243202E-3,131,null,131,null,131,361,null,null,18]
[132,0.35795454545454547,3.2738933208196479E-2,1.1266444139014335E-2,3.6450260449752262E-3,4.5641107222398988E-2,2.694780635400907E-2,362,0.10582401131118237,7.5418499601428893E-2,5.0510082091336519E-2,1.0839721665290719E-3,6.9758176362306752E-4,5.0941731241210093E-4,6.9503127581730176E-3,4.3914988814317711E-3,2.7904480815669438E-3,132,null,132,null,132,362,null,null,19]
[133,0.35526315789473684,3.2445839631050667E-2,1.1167808373909995E-2,3.6131144739120569E-3,4.5232746048638209E-2,2.6705397301349319E-2,363,0.1054687500000001,7.5164961269962638E-2,5.0335570469798599E-2,1.0802139037433154E-3,6.9519764782750707E-4,5.0768131475527019E-4,6.9266055045871531E-3,4.3768115942029026E-3,2.7809965237543454E-3,133,null,133,null,133,363,null,null,20]
[134,0.35261194029850745,3.2157947299685054E-2,1.1070884697808068E-2,3.5817568139967283E-3,4.4831627470896161E-2,2.646731054977711E-2,364,0.10511586600024797,7.4913121893282836E-2,5.0162260566724653E-2,1.0764816116186459E-3,6.9282977284680278E-4,5.0595710881652146E-4,6.9030594303129723E-3,4.3622222222222265E-3,2.7716087767611264E-3,134,null,134,null,134,364,null,null,21]
[135,0.35000000000000003,3.1875118979630711E-2,1.0975628917391084E-2,3.5509387673912335E-3,4.4437560503388186E-2,2.6233431516936662E-2,365,0.10476533552902442,7.4662964451426631E-2,4.9990140011831913E-2,1.0727750218850307E-3,6.9047797329339791E-4,5.0424457486010683E-4,6.8796728971962581E-3,4.3477297895902593E-3,2.7622841965471447E-3,135,null,135,null,135,365,null,null,22]
[136,0.34742647058823534,3.1597222222222249E-2,1.0881998347353738E-2,3.520646524143856E-3,4.405036081682788E-2,2.6003649635036489E-2,366,0.1044171351196095,7.4414472151013683E-2,4.9819196604040487E-2,1.0690938699546354E-3,6.8814208601776039E-4,5.0254359476590812E-4,6.8564442892071215E-3,4.3333333333333375E-3,2.7530221477102272E-3,136,null,136,null,136,366,null,null,23]
[137,0.34489051094890516,3.1324129157780552E-2,1.0789951746624449E-2,3.4908667415549689E-3,4.3669850450930393E-2,2.5777858176555705E-2,367,0.10407124161622784,7.4167628421488066E-2,4.9649418308590154E-2,1.065437894858865E-3,6.858219500706544E-4,5.0085405200227793E-4,6.8333720120677616E-3,4.3190319031903238E-3,2.7438220033418345E-3,137,null,137,null,137,367,null,null,24]
[138,0.34239130434782611,3.1055716299428774E-2,1.0699449257796634E-2,3.4615865245812643E-3,4.3295857541688659E-2,2.5555954088952639E-2,368,0.10372763216891549,7.3922416911434821E-2,4.9480793254216039E-2,1.0618068391866913E-3,6.8351740666617211E-4,4.991758315994277E-4,6.8104544928877025E-3,4.3048245614035136E-3,2.7346831448856169E-3,138,null,138,null,138,368,null,null,25]
[139,0.33992805755395683,3.0791864356909081E-2,1.0610452349582787E-2,3.4327934072179611E-3,4.2928216062544405E-2,2.5337837837837825E-2,369,0.10338628422848802,7.3678821484969237E-2,4.9313309730381588E-2,1.0582004490242358E-3,6.8122829914550923E-4,4.9750882012334762E-4,6.787690179806358E-3,4.2907103825136662E-3,2.725604961998777E-3,139,null,139,null,139,369,null,null,26]
[140,0.33750000000000002,3.0532458059810395E-2,1.0522923762116849E-2,3.4044753348025096E-3,4.2566765578634994E-2,2.5123413258109999E-2,370,0.10304717554160778,7.3436826218197415E-2,4.9146956184567568E-2,1.0546184738955825E-3,6.789544729414648E-4,4.9585290565024888E-4,6.7650775416427293E-3,4.2766884531590466E-3,2.7165868524161949E-3,140,null,140,null,140,370,null,null,27]
[141,0.33510638297872342,3.0277385989656833E-2,1.0436827454941719E-2,3.3766206471870261E-3,4.2211351013351953E-2,2.4912587412587395E-2,371,0.10271028414594785,7.3196415395746242E-2,4.8981721219615783E-2,1.0510606667047857E-3,6.7669577554365062E-4,4.9420797774151327E-4,6.7426150675520893E-3,4.2627578718783983E-3,2.7076282218172348E-3,141,null,141,null,141,371,null,null,28]
[142,0.33274647887323944,3.0026540420342914E-2,1.0352128557529369E-2,3.3492180627300899E-3,4.1861822426497393E-2,2.4705270457697628E-2,372,0.10237558836545055,7.2957573507361345E-2,4.8817593591126078E-2,1.0475267836790518E-3,6.7445205646439238E-4,4.9257392741914045E-4,6.7203012666894853E-3,4.2489177489177547E-3,2.6987284836951821E-3,142,null,142,null,142,372,null,null,29]
[143,0.33041958041958047,2.9779817166435501E-2,1.0268793322190871E-2,3.3222566630617526E-3,4.1518034803371781E-2,2.4501375515818415E-2,373,0.10204306680567828,7.2720285244571498E-2,4.8654562204905667E-2,1.0440165843130574E-3,6.7222316720530646E-4,4.9095064714168083E-4,6.6981346678798856E-3,4.2351672060409983E-3,2.6898870592292441E-3,143,null,143,null,143,373,null,null,30]
[144,0.32812500000000006,2.9537115438893639E-2,1.0186789079242703E-2,3.2957258785785213E-3,4.1179847854169629E-2,2.4300818553888111E-2,374,0.10171269834925475,7.2484535497417762E-2,4.8492616114469256E-2,1.0405298313143892E-3,6.700089612245387E-4,4.8933803078064233E-4,6.6761138192948585E-3,4.2215053763440926E-3,2.6811033771590616E-3,144,null,144,null,144,374,null,null,31]
[145,0.32586206896551723,2.9298337707786573E-2,1.010608419430423E-2,3.2696154746278388E-3,4.0847125823100169E-2,2.4103518267929617E-2,375,0.10138446215139461,7.2250309351246142E-2,4.8331744518589036E-2,1.0370662905500704E-3,6.678092939046465E-4,4.8773597359736049E-4,6.6542372881355869E-3,4.2079314040728896E-3,2.6723768736616705E-3,145,null,145,null,145,375,null,null,32]
[146,0.32363013698630139,2.9063389571617072E-2,1.0026648027609109E-2,3.2439155383441232E-3,4.0519737306687349E-2,2.3909395973154342E-2,376,0.10105833763551904,7.2017592083562287E-2,4.8171936758893169E-2,1.0336257309941522E-3,6.6562402252111298E-4,4.8614437222032237E-4,6.6325036603221022E-3,4.1944444444444512E-3,2.6637069922308544E-3,146,null,146,null,146,376,null,null,33]
[147,0.32142857142857145,2.8832179632882236E-2,9.9484508952206435E-3,3.2186164661007965E-3,4.0197555080738349E-2,2.3718375499334199E-2,377,0.10073430448895594,7.1786369160946648E-2,4.8013182317511914E-2,1.0302079246763437E-3,6.6345300621147745E-4,4.8456312462293185E-4,6.610911540188588E-3,4.1810436634717851E-3,2.6550931835588459E-3,147,null,147,null,147,377,null,null,34]
[148,0.3192567567567568,2.8604619379527178E-2,9.8714640320479771E-3,3.193708951544934E-3,3.9880455935501775E-2,2.3530383091149253E-2,378,0.10041234265872255,7.1556626236028903E-2,4.7855470814769957E-2,1.0268126466316612E-3,6.6129610594506665E-4,4.8299213010170812E-4,6.589459550184619E-3,4.1677282377919388E-3,2.6465349054203067E-3,148,null,148,null,148,378,null,null,35]
{"$rows_left_out":623}