{"text_format":"1","workbook":"xlsx","n_sheets":5,"sheets":["TEPELNÝ VÝPOČET BRZD","Detail zákazníka","Tisk","Program","Hodnoty Pohon"],"not_rendered":{"charts":0,"images":1,"macros":1,"external_links":0,"defined_names":1,"comments":0,"pivot_tables":0},"unopened":[],"bounds":{"document_bytes":16777216,"sheet_cells":100000,"rows_first":2000,"rows_last":500,"rows_between":2000,"halvings":0,"cell_chars":16384,"cell_head_chars":4096},"cells_cut":0,"cells_raw":0,"read":"whole","date_system":"1900"}

{"sheet":"TEPELNÝ VÝPOČET BRZD","index":0,"n_rows":44,"n_cols":16,"rows_kept":44,"cut":false,"hidden":false,"merged":[[3,1,4,16],[8,1,9,16],[19,1,20,16],[28,10,29,16],[28,1,29,8],[22,13,22,15]]}
[]
[null,null,null,null,null,null,null,"VÝPOČET KOTOUČOVÝCH BRZD"]
[]
[null,"Výběr brzdy"]
[]
[]
[]
[]
[null,"Typ brzdění"]
[]
[]
[]
[]
[null,null,null,null,null,null,null,null,null,null,null,null,null,null,null,1]
[null,null,null,null,null,null,null,null,null,null,null,null,null,null,null,0]
[null,null,null,null,null,null,null,null,null,null,null,null,null,null,null,0]
[]
[]
[]
[null,"Materiál kotouče"]
[]
[]
[null,null,null,null,null,null,null,null,null,null,null,"Název materiálu"]
[null,null,null,null,null,null,null,null,null,null,null,"Hustota",null,"ρ",null,"[kg/m3]"]
[null,null,null,null,null,null,null,null,null,null,null,"Měrná tepelná kapacita",null,"c",null,"[J/Kg.K]"]
[null,null,null,null,null,null,null,null,null,null,null,"Tepelná vodivost",null,"λ",null,"[W/m.K]"]
[]
[]
[null,"Vstupní parametry",null,null,null,null,null,null,null,null,"Výstupní parametry"]
[]
[]
[null,null,"Průměr kotouče",null,null,null,null,"[mm]",null,null,null,"Ohřev kotouče",null,null,{"$f":"Program!S29","v":"ZADÁNÍ"},"[°C]"]
[]
[null,null,"Tloušťka kotouče",null,null,null,null,"[mm]",null,null,null,"Ohřev stykové plochy",null,null,{"$f":"Program!S30","v":"ZADÁNÍ"},"[°C]"]
[]
[null,null,null,null,null,null,null,null,null,null,null,"Zatížení povrchu",null,null,{"$f":"Program!S31","v":"ZADÁNÍ"},"[mm2/W]"]
[null,null,"Otáčky",null,null,null,null,"[ot/min]"]
[]
[null,null,"Čas bzdění",null,null,null,null,"[s]",null,null,null,{"$f":"Program!O33","v":"NEZVOLENO"},null,null,{"$f":"Program!S33","v":"ZADÁNÍ"},{"$f":"Program!T33","v":" "}]
[]
[null,null,"Parametr",null,null,null,null,{"$f":"Program!F25","v":"[J]"}]
[null,null,null,null,null,null,null,null,null,null,null,0,"Lze použít "]
[null,null,null,null,null,null,null,null,null,null,null,0,"Lze použít pouze pro havarijní brzdění"]
[null,null,null,null,null,null,null,null,null,null,null,0,"Nelze použít"]

{"sheet":"Detail zákazníka","index":1,"n_rows":13,"n_cols":3,"rows_kept":13,"cut":false,"hidden":false,"merged":[[12,5,12,9],[2,2,3,9],[4,5,4,9],[6,5,6,9],[8,5,8,9],[10,5,10,9]]}
[]
[]
[null,null,"Detail zákazníka"]
[]
[null,null,"Jméno zákazníka"]
[]
[null,null,"Reference zákazníka"]
[]
[null,null,"Reference PIVKO"]
[]
[null,null,"Typ stroje"]
[]
[null,null,"Jméno výpočtáře"]

{"sheet":"Tisk","index":2,"n_rows":35,"n_cols":9,"rows_kept":35,"cut":false,"hidden":false,"merged":[[27,1,29,3],[34,1,34,3],[10,5,10,9],[12,5,12,6],[15,5,15,7],[18,5,18,7],[20,5,20,7],[17,5,17,7],[16,5,16,7],[11,5,11,7],[13,5,13,7],[21,5,21,7],[22,5,22,7]]}
[]
[null,"Tepelný výpočet brzd PIVKO",null,null,{"$f":"Program!R40","v":" "},null,null,null,{"$f":"Program!V40","v":" "}]
[]
[null,"Jméno zákazníka",null,{"$f":"Program!K40","v":"---"}]
[null,"Reference zákazníka",null,{"$f":"Program!K41","v":"---"}]
[null,"Reference Pivko",null,{"$f":"Program!K42","v":"---"}]
[null,"Typ stroje",null,{"$f":"Program!K43","v":"---"}]
[null,"Jméno výpočtáře",null,{"$f":"Program!K44","v":"---"}]
[]
[null,"Kotouč [mm]",null,null,null,{"$f":"Program!T42","v":" "},{"$f":"Program!U42","v":" "},{"$f":"  Program!V42","v":" "}]
[null,"Materiál",null,null,null,{"$f":"Program!T43","v":" "}]
[null,"Hmotnost kotouče [kg]",null,null,null,{"$f":"Program!T44","v":" "}]
[null,"Moment setrvačnosti kotouče [kg.m2]",null,null,null,{"$f":"Program!T45","v":" "}]
[null,"Styková plocha obou destiček [mm2]",null,null,null,{"$f":"Program!T46","v":" "}]
[]
[null,"Otáčky [ot/min]",null,null,null,{"$f":"Program!T48","v":" "}]
[null,"Čas brzdění [s]",null,null,null,{"$f":"Program!T49","v":" "}]
[null,"Brzdný moment [N.m]",null,null,null,{"$f":"Program!T50","v":" "}]
[null,"Energie kinetická [J]",null,null,null,{"$f":"Program!T51","v":" "}]
[]
[null,"Ohřev kotouče [°C]",null,null,null,{"$f":"Program!T53","v":" "}]
[null,"Ohřev stykové plochy [°C]",null,null,null,{"$f":"Program!T54","v":" "}]
[null,"Zatížení povrchu [mm2/W]",null,null,null,{"$f":"Program!T55","v":" "}]
[null,{"$f":"Program!V16","v":" "},null,null,null,{"$f":"Program!T56","v":" "}]
[]
[]
[null,"Poznámka:"]
[]
[]
[]
[]
[]
[]
[]
[null,{"$f":"NOW()","v":"2017-06-09T22:25:46.240"}]

{"sheet":"Program","index":3,"n_rows":56,"n_cols":26,"rows_kept":56,"cut":false,"hidden":true,"merged":[[17,15,17,17],[19,21,19,23],[32,14,32,16],[34,7,34,9],[35,7,35,9],[27,21,27,22],[19,0,19,5],[31,7,31,9],[32,7,32,9],[28,7,28,9],[27,14,27,19],[19,7,19,12],[20,7,20,9],[21,7,21,9],[22,7,22,9],[23,7,23,9],[38,6,38,13],[31,0,31,2],[19,14,19,19],[12,15,12,17],[15,15,15,17],[20,14,20,16],[21,14,21,16],[16,15,16,17],[28,0,28,2],[29,0,29,2],[35,0,35,4],[33,7,33,9],[30,7,30,9],[29,7,29,9],[27,7,27,9],[25,7,25,9],[1,14,1,16],[9,0,9,11],[0,0,0,6],[10,15,10,17],[11,15,11,17],[0,8,0,19],[1,0,1,2],[2,0,2,2],[3,0,3,2],[4,0,4,2],[5,0,5,2],[9,13,9,26],[6,0,6,2],[44,15,44,18],[45,15,45,18],[29,14,29,16],[20,0,20,2],[21,0,21,2],[27,0,27,2],[22,0,22,2],[23,0,23,2],[24,7,24,9],[26,0,26,2],[26,7,26,9],[28,14,28,16],[24,0,24,2],[22,14,22,16],[24,14,24,16],[30,14,30,16],[38,15,38,23],[39,15,39,16],[41,15,41,18],[42,15,42,18],[43,15,43,18]]}
["Zvolené parametry",null,null,null,null,null,null,null,"Výpočet stykové plochy S'"]
["Brzda",null,null,{"$f":"'TEPELNÝ VÝPOČET BRZD'!P14","v":1},{"$f":"IF(D2=1,\"C\",\"H\")","v":"C"},null,null,null,null,"Brzda C","S'1",{"$f":"2*(PI()*(((K5-N6)^2)-((K5-N6-K6)^2)))","v":{"$error":"#DIV/0!"}},"[mm2]",null,"Plocha kotouče [mm2]",null,null,{"$f":"PI()*((K5/1000)^2)","v":0}]
["Typ brzdění",null,null,{"$f":"'TEPELNÝ VÝPOČET BRZD'!P15","v":0},{"$f":"IF(D3=1,\"Mechanické brzdění\",IF(D3=2,\"Pneumatické brzdění\",IF(D3=3,\"Hydraulické brzdění\",\"NEZVOLEN\")))","v":"NEZVOLEN"},null,null,null,null,"Brzda H","S'2",{"$f":"2*(PI()*(((K5-N7)^2)-((K5-N7-K7)^2)))","v":-28896.369227718918},"[mm2]"]
["Pohon",null,null,{"$f":"'TEPELNÝ VÝPOČET BRZD'!P16","v":0},{"$f":"IF(D4=1,\"Motor 07\",IF(D4=2,\"Pohon 07\",IF(D4=3,\"Pohon 10\",IF(D4=4,\"Pohon 15\",IF(D4=5,\"Motor 1\",IF(D4=6,\"Motor 2\",IF(D4=7,\"Motor 3\",IF(D4=8,\"Motor 9\",IF(D4=9,\"Motor 12\",IF(D4=10,\"Motor 16\",IF(D4=11,\"Motor H2\",IF(D4=12,\"Motor H3\",IF(D4=13,\"Motor 03\",IF(D4=14,\"Motor 04\",IF(D4=15,\"Motor 05\",\"NEZVOLEN\")))))))))))))))","v":"NEZVOLEN"},null,null,null,null,null,null,null,null,null,null,null,null,"Brzda C","Brzda H"]
["Materiál",null,null,1,{"$f":"IF(D5=1,A12,IF(D5=2,A13,IF(D5=3,A14,A15)))","v":"Litina s lupínkovým grafitem ČSN 42 2425"},null,null,null,null,"R",{"$f":"E21/2","v":0},"[mm]",null,null,null,null,"R [mm]",{"$f":"K5-N6","v":{"$error":"#DIV/0!"}},{"$f":"K5-N7","v":-5}]
["Volba",null,null,1,{"$f":"A25","v":"Energie kinetická"},null,null,null,null,"k1",30,"[mm]","l1",{"$f":"55.0052681134417*(E21^-0.44722902539)","v":{"$error":"#DIV/0!"}},"[mm]",null,"r [mm]",{"$f":"R5-K6","v":{"$error":"#DIV/0!"}},{"$f":"S5-K7","v":-68}]
["Kontrola 1",null,null,{"$f":"MIN(D2:D4)","v":0},null,null,null,null,null,"k2",63,"[mm]","l2",5,"[mm]",null,"m' [kg]",{"$f":"IF(D5=1,I12,IF(D5=2,I13,IF(D5=3,I14,I15)))","v":{"$error":"#DIV/0!"}},{"$f":"IF(E5=1,J12,IF(E5=2,J13,IF(E5=3,J14,J15)))","v":0}]
[null,null,null,null,null,null,null,null,null,null,null,null,null,null,null,null,"J' [kg.m2]",{"$f":"(R7/2)*(((R6/1000)^2)+((R5/1000)^2))","v":{"$error":"#DIV/0!"}},{"$f":"(S7/2)*(((S6/1000)^2)+((S5/1000)^2))","v":0}]
[]
["Materiál a výpočet hmotnosti",null,null,null,null,null,null,null,null,null,null,null,null,"Pohon/motor"]
[null,null,null,null,"ρ","c","λ",null,"Brzda C","Brzda H","Celková",null,null,null,null,"Pracovní zdvih pružiny",null,null,null,"[mm]",null,"Number1",{"$f":"IF(D4=1,1,IF(D4=2,1,IF(D4=3,2,IF(D4=4,3,IF(D4=5,2,IF(D4=6,3,IF(D4=7,4,IF(D4=8,4,IF(D4=9,5,IF(D4=10,6,IF(D4=11,5,IF(D4=12,6,IF(D4=13,7,IF(D4=14,8,9))))))))))))))","v":9},null,"Number2",{"$f":"IF(D4=1,1,IF(D4=2,2,IF(D4=3,2,IF(D4=4,2,IF(D4=5,3,IF(D4=6,3,IF(D4=7,3,IF(D4=8,2,IF(D4=9,2,IF(D4=10,2,IF(D4=11,3,IF(D4=12,3,IF(D4=13,2,IF(D4=14,2,IF(D4=15,2,0)))))))))))))))","v":0}]
["Litina s lupínkovým grafitem ČSN 42 2425",null,null,null,7250,500,58,null,{"$f":"E12*(($L$2/2000000)*($E$22/1000))","v":{"$error":"#DIV/0!"}},{"$f":"E12*(($L$3/2000000)*($E$22/1000))","v":0},{"$f":"E12*($R$2*($E$22/1000))","v":0},null,null,null,null,"Tlak vzduchu",null,null,null,"[MPa]",null,null,null,null,"Min","Max"]
["Ocel 11 373 (ČSN 41 1372)",null,null,null,7850,460,51,null,{"$f":"E13*(($L$2/2000000)*($E$22/1000))","v":{"$error":"#DIV/0!"}},{"$f":"E13*(($L$3/2000000)*($E$22/1000))","v":0},{"$f":"E13*($R$2*($E$22/1000))","v":0},null,null,null,null,"Tlak média",null,null,null,"[MPa]",null,"Pro C",{"$f":"(VLOOKUP(E21,'Hodnoty Pohon'!A:G,W11+1,0))*L29","v":{"$error":"#N/A"}},null,{"$f":"IF(Z11=1,119.999,IF(Z11=2,349.999,IF(Z11=3,119.999,IF(D2=1,119.999,349.999))))","v":119.999},{"$f":"IF(Z11=1,300.001,IF(Z11=2,1000.001,IF(Z11=3,500.001,IF(D2=1,500.001,1000.001))))","v":500.00099999999998}]
["Ocel 11 523 (ČSN 41 1523)",null,null,null,7800,460,50,null,{"$f":"E14*(($L$2/2000000)*($E$22/1000))","v":{"$error":"#DIV/0!"}},{"$f":"E14*(($L$3/2000000)*($E$22/1000))","v":0},{"$f":"E14*($R$2*($E$22/1000))","v":0},null,null,null,null,null,null,null,null,null,null,"Pro H",{"$f":"(VLOOKUP(E21,'Hodnoty Pohon'!H:Q,W11+1,0))*L29","v":{"$error":"#N/A"}}]
[{"$f":"'TEPELNÝ VÝPOČET BRZD'!N23","v":0},null,null,null,{"$f":"'TEPELNÝ VÝPOČET BRZD'!O24","v":0},{"$f":"'TEPELNÝ VÝPOČET BRZD'!O25","v":0},{"$f":"'TEPELNÝ VÝPOČET BRZD'!O26","v":0},null,{"$f":"E15*(($L$2/2000000)*($E$22/1000))","v":{"$error":"#DIV/0!"}},{"$f":"E15*(($L$3/2000000)*($E$22/1000))","v":0},{"$f":"E15*($R$2*($E$22/1000))","v":0},null,null,null,null,"Výsledná hodnota"]
[null,null,null,null,null,null,null,null,"m' [kg]","m' [kg]","m [kg]",null,null,null,null,{"$f":"IF(D3=1,P11,IF(D3=2,P12,P13))","v":"Tlak média"},null,null,{"$f":"IF(D2=1,W13,W14)","v":{"$error":"#N/A"}},{"$f":"IF(D3=1,T11,IF(D3=2,T12,T13))","v":"[MPa]"},null,{"$f":"IF(D7=0,\" \",IF(D3=1,\"Pracovní zdvih pružiny [mm]\",IF(D3=2,\"Tlak vzduch [MPa]\",\"Tlak média [MPa]\")))","v":" "},null,null,"Limit",{"$f":"IF(D4=1,15.1,IF(D4=2,15.1,IF(D4=3,15.1,IF(D4=4,15.1,IF(D4=5,0.71,IF(D4=6,0.71,IF(D4=7,0.71,IF(D4=8,0.71,IF(D4=9,0.71,IF(D4=10,0.71,IF(D4=11,5.1,IF(D4=12,5.1,IF(D4=13,12.1,IF(D4=14,12.1,IF(D4=15,12.1,0)))))))))))))))","v":0}]
[{"$f":"IF(D5=1,A12,IF(D5=2,A13,IF(D5=3,A14,A15)))","v":"Litina s lupínkovým grafitem ČSN 42 2425"},null,null,null,{"$f":"IF(D5=1,E12,IF(D5=2,E13,IF(D5=3,E14,E15)))","v":7250},{"$f":"IF(D5=1,F12,IF(D5=2,F13,IF(D5=3,F14,F15)))","v":500},{"$f":"IF(D5=1,G12,IF(D5=2,G13,IF(D5=3,G14,G15)))","v":58},null,null,null,null,null,null,null,"Po limitu",{"$f":"P16","v":"Tlak média"},null,null,{"$f":"IF(S16>Z16,\"POHON\",S16)","v":{"$error":"#N/A"}},{"$f":"T16","v":"[MPa]"}]
[]
[]
["Vstupní parametry",null,null,null,null,null,null,"Ostatní parametry",null,null,null,null,null,null,"Výstupní parametry",null,null,null,null,null,null,"Kontrola průměru"]
["Průměr kotouče",null,null,"D",{"$f":"'TEPELNÝ VÝPOČET BRZD'!G32","v":0},"[mm]",null,"Hustota",null,null,"ρ",{"$f":"IF(D5=1,E12,IF(D5=2,E13,IF(D5=3,E14,E15)))","v":7250},"[kg/m3]",null,"Ohřev kotouče",null,null,"K",{"$f":"L34/(L22*L24)","v":{"$error":"#DIV/0!"}},"[°C]",null,"K",{"$f":"IF(E21<Y13,\"PRŮMĚR\",IF(E21>Z13,\"PRŮMĚR\",S21))","v":"PRŮMĚR"},{"$f":"T21","v":"[°C]"}]
["Tloušťka kotouče",null,null,"t",{"$f":"'TEPELNÝ VÝPOČET BRZD'!G34","v":0},"[mm]",null,"Měrná tepelná kapacita",null,null,"c",{"$f":"IF(D5=1,F12,IF(D5=2,F13,IF(D5=3,F14,F15)))","v":500},"[J/Kg.K]",null,"Ohřev stykové plochy",null,null,"S",{"$f":"(0.5270462767*L36*SQRT(E24))/(SQRT(L21*L22*L23))","v":{"$error":"#DIV/0!"}},"[°C]",null,"S",{"$f":"IF(E21<Y13,\"PRŮMĚR\",IF(E21>Z13,\"PRŮMĚR\",S22))","v":"PRŮMĚR"},{"$f":"T22","v":"[°C]"}]
["Otáčky",null,null,"n",{"$f":"'TEPELNÝ VÝPOČET BRZD'!G37","v":0},"[1/min]",null,"Součinitel tepelné vodivosti",null,null,"λ",{"$f":"IF(D5=1,G12,IF(D5=2,G13,IF(D5=3,G14,G15)))","v":58},"[W/m.K]",null,"Zatížení povrchu",null,null,"L",{"$f":"L28/L35","v":{"$error":"#DIV/0!"}},"[mm2/W]",null,"L",{"$f":"IF(E21<Y13,\"PRŮMĚR\",IF(E21>Z13,\"PRŮMĚR\",S23))","v":"PRŮMĚR"},{"$f":"T23","v":"[mm2/W]"}]
["Čas bzdění",null,null,"τ",{"$f":"'TEPELNÝ VÝPOČET BRZD'!G39","v":0},"[s]",null,"Hmotnost mezikruží",null,null,"m'",{"$f":"L21*((L28/2000000)*(E22/1000))","v":{"$error":"#DIV/0!"}},"[kg]"]
[{"$f":"IF($D$6=1,A27,IF($D$6=2,A28,IF($D$6=3,A29,A30)))","v":"Energie kinetická"},null,null,{"$f":"IF($D$6=1,D27,IF($D$6=2,D28,IF($D$6=3,D29,D30)))","v":"E_kin_Vst"},{"$f":"'TEPELNÝ VÝPOČET BRZD'!G41","v":0},{"$f":"IF($D$6=1,F27,IF($D$6=2,F28,IF($D$6=3,F29,F30)))","v":"[J]"},null,"Hmotnost kotouče",null,null,"m",{"$f":"L21*((R2)*(E22/1000))","v":0},"[kg]",null,{"$f":"P16","v":"Tlak média"},null,null,"p",{"$f":"S17","v":{"$error":"#N/A"}},{"$f":"T16","v":"[MPa]"},null,"P",{"$f":"IF(E21<Y13,\"PRŮMĚR\",IF(E21>Z13,\"PRŮMĚR\",S25))","v":"PRŮMĚR"},{"$f":"T25","v":"[MPa]"}]
[null,null,null,null,null,null,null,"Moment setrvačnosti mezikruží",null,null,"J'",{"$f":"IF(D2=1,R8,S8)","v":{"$error":"#DIV/0!"}},"[kg.m2]"]
["Energie kinetická",null,null,"E_kin_Vst",{"$f":"IF($D$6=1,E25,0)","v":0},"[J]",null,"Moment setrvačnosti kotouče",null,null,"J",{"$f":"(L25/2)*((K5/1000)^2)","v":0},"[kg.m2]"]
["Moment setrvačnosti soustrojí",null,null,"Jred",{"$f":"IF($D$6=2,E25,0)","v":0},"[kg.m2]",null,"Styková plocha",null,null,"S'",{"$f":"IF(D2=1,L2,L3)","v":{"$error":"#DIV/0!"}},"[mm2]",null,"Výstupní kontrola",null,null,null,null,null,null,"MAX  z teplot"]
["Výkon",null,null,"P_Vst",{"$f":"IF($D$6=3,E25,0)","v":0},"[W]",null,"Brzdný moment",null,null,"Mb",{"$f":"(L34*60)/(PI()*E23*E24)","v":{"$error":"#DIV/0!"}},"[N.m]",null,"Ohřev kotouče",null,null,"K",{"$f":"IF($D$7=0,IF(E32=0,\"ZADÁNÍ\",IF($V$29>10000,\"---\",W21)),IF(E32=0,\"PARAMETR\",IF($V$29>10000,\"---\",W21)))","v":"ZADÁNÍ"},"[°C]",null,{"$f":"MAX(S21:S22)","v":{"$error":"#DIV/0!"}}]
["Brzdný moment",null,null,"Mb_Vst",{"$f":"IF($D$6=4,E25,0)","v":0},"[N.m]",null,"Energie kinetická",null,null,"E_kin_Vst",{"$f":"E27","v":0},"[J]",null,"Ohřev stykové plochy",null,null,"S",{"$f":"IF($D$7=0,IF(E32=0,\"ZADÁNÍ\",IF($V$29>10000,\"---\",W22)),IF(E32=0,\"PARAMETR\",IF($V$29>10000,\"---\",W22)))","v":"ZADÁNÍ"},"[°C]"]
[null,null,null,null,null,null,null,"Energie kinetická z Jred",null,null,"E_kin_Jred",{"$f":"0.5*E28*((2*PI()*(E23/60))^2)","v":0},"[J]",null,"Zatížení povrchu",null,null,"L",{"$f":"IF($D$7=0,IF(E32=0,\"ZADÁNÍ\",IF($V$29>10000,\"---\",W23)),IF(E32=0,\"PARAMETR\",IF($V$29>10000,\"---\",W23)))","v":"ZADÁNÍ"},"[mm2/W]"]
["Kontrola 2",null,null,null,{"$f":"MIN(E17:G17,E21:E25)","v":0},null,null,"Energie kinetická z P_Vst",null,null,"E_kin_P_Vst",{"$f":"0.5*E29*E24","v":0},"[J]"]
[null,null,null,null,null,null,null,"Energie kinetická z Mb_Vst",null,null,"E_kin_Mb_Vst",{"$f":"(E30*PI()*E23*E24)/60","v":0},"[J]",null,{"$f":"IF(D7=0,IF(E32=0,\"NEZVOLENO\",\"NEZVOLEN\"),P16)","v":"NEZVOLENO"},null,null,"p",{"$f":"IF($D$7=0,IF(E32=0,\"ZADÁNÍ\",\"TYP\"),IF(E32=0,\"PARAMETR\",IF($V$29>10000,\"---\",W25)))","v":"ZADÁNÍ"},{"$f":"IF(D7=0,IF(E32=0,\" \",\" \"),T16)","v":" "}]
[null,null,null,null,null,null,null,"Energie kinetická výsledná",null,null,"E_kin",{"$f":"IF(D6=1,L30,IF(D6=2,L31,IF(D6=3,L32,L33)))","v":0},"[J]"]
[null,null,null,null,null,null,null,"Výkon",null,null,"P",{"$f":"L34/E24","v":{"$error":"#DIV/0!"}},"[W]"]
["Vyráběné rozměry kotoučů",null,null,null,null,null,null,"Hustota tepelného toku",null,null,"q",{"$f":"L35/(L28/2000000)","v":{"$error":"#DIV/0!"}},"[W/m2]"]
["Pohon","ID","Min D","Max D"]
["Motor 07",1,120,300]
["Pohon 07",2,350,1000,null,null,"Detail zákazníka",null,null,null,null,null,null,null,null,"Tisk"]
["Pohon 10",3,350,1000,null,null,null,"Jméno zákazníka",null,null,{"$f":"IF('Detail zákazníka'!F5=0,\"---\",'Detail zákazníka'!F5)","v":"---"},null,null,null,null,"Typ brzdění",null,{"$f":"IF(D3=1,\"Mechanické brzdění\",IF(D3=2,\"Pneumatické brzdění\",IF(D3=3,\"Hydraulické brzdění\",\" \")))","v":" "},null,null,"Pohon",{"$f":"IF(D4=1,\"Motor 07\",IF(D4=2,\"Pohon 07\",IF(D4=3,\"Pohon 10\",IF(D4=4,\"Pohon 15\",IF(D4=5,\"Motor 1\",IF(D4=6,\"Motor 2\",IF(D4=7,\"Motor 3\",IF(D4=8,\"Motor 9\",IF(D4=9,\"Motor 12\",IF(D4=10,\"Motor 16\",IF(D4=11,\"Motor H2\",IF(D4=12,\"Motor H3\",IF(D4=13,\"Motor 03\",IF(D4=14,\"Motor 04\",IF(D4=15,\"Motor 05\",\" \")))))))))))))))","v":" "}]
["Pohon 15",4,350,1000,null,null,null,"Reference zákazníka",null,null,{"$f":"IF('Detail zákazníka'!F7=0,\"---\",'Detail zákazníka'!F7)","v":"---"}]
["Motor 1",5,120,500,null,null,null,"Reference PIVKO",null,null,{"$f":"IF('Detail zákazníka'!F9=0,\"---\",'Detail zákazníka'!F9)","v":"---"},null,null,null,null,"Kotouč [mm]",null,null,null,{"$f":"IF(E32=0,\" \",E21)","v":" "},{"$f":"IF(E32=0,\" \",\"x\")","v":" "},{"$f":"IF(E32=0,\" \",E22)","v":" "}]
["Motor 2",6,120,500,null,null,null,"Typ stroje",null,null,{"$f":"IF('Detail zákazníka'!F11=0,\"---\",'Detail zákazníka'!F11)","v":"---"},null,null,null,null,"Materál",null,null,null,{"$f":"IF(E32=0,\" \",E5)","v":" "}]
["Motor 3",7,120,500,null,null,null,"Jméno výpočtáře",null,null,{"$f":"IF('Detail zákazníka'!F13=0,\"---\",'Detail zákazníka'!F13)","v":"---"},null,null,null,null,"Hmotnost kotouče [kg]",null,null,null,{"$f":"IF(E32=0,\" \",IF(E21<Y13,\" \",IF(E21>Z13,\"  \",L25)))","v":" "}]
["Motor 9",8,350,1000,null,null,null,null,null,null,null,null,null,null,null,"Moment setrvačnosti kotouče [kg.m2]",null,null,null,{"$f":"IF(E32=0,\" \",IF(E21<Y13,\" \",IF(E21>Z13,\"  \",L27)))","v":" "}]
["Motor 12",9,350,1000,null,null,null,null,null,null,null,null,null,null,null,"Styková plocha obou destiček [mm2]",null,null,null,{"$f":"IF(E32=0,\" \",IF(E21<Y13,\" \",IF(E21>Z13,\"  \",L28)))","v":" "}]
["Motor 16",10,350,1000]
["Motor H2",11,120,500,null,null,null,null,null,null,null,null,null,null,null,"Otáčky [ot/min]",null,null,null,{"$f":"IF(E32=0,\" \",IF(E21<Y13,\" \",IF(E21>Z13,\"  \",E23)))","v":" "}]
["Motor H3",12,120,500,null,null,null,null,null,null,null,null,null,null,null,"Čas brzdění [s]",null,null,null,{"$f":"IF(E32=0,\" \",IF(E21<Y13,\" \",IF(E21>Z13,\"  \",E24)))","v":" "}]
["Motor 03",13,350,1000,null,null,null,null,null,null,null,null,null,null,null,"Brzdný moment [N.m]",null,null,null,{"$f":"IF(E32=0,\" \",IF(E21<Y13,\" \",IF(E21>Z13,\"  \",L29)))","v":" "}]
["Motor 04",14,350,1000,null,null,null,null,null,null,null,null,null,null,null,"Energie kinetická [J]",null,null,null,{"$f":"IF(E32=0,\" \",IF(E21<Y13,\" \",IF(E21>Z13,\"  \",L34)))","v":" "}]
["Motor 05",15,350,1000]
["Zvoleno:",{"$f":"D4","v":0},{"$f":"VLOOKUP($B$53,$B$38:$F$52,2,0)","v":{"$error":"#N/A"}},{"$f":"VLOOKUP($B$53,$B$38:$F$52,3,0)","v":{"$error":"#N/A"}},null,null,null,null,null,null,null,null,null,null,null,"Ohřev kotouče [°C]",null,null,null,{"$f":"IF(E32=0,\" \",IF($V$29>10000,\" \",IF(E21<Y13,\" \",IF(E21>Z13,\"  \",S29))))","v":" "}]
[null,null,null,null,null,null,null,null,null,null,null,null,null,null,null,"Ohřev stykové plochy [°C]",null,null,null,{"$f":"IF(E32=0,\" \",IF($V$29>10000,\" \",IF(E21<Y13,\" \",IF(E21>Z13,\"  \",S30))))","v":" "}]
[null,null,null,null,null,null,null,null,null,null,null,null,null,null,null,"Zatížení povrchu [mm2/W]",null,null,null,{"$f":"IF(E32=0,\" \",IF($V$29>10000,\" \",IF(E21<Y13,\" \",IF(E21>Z13,\"  \",S31))))","v":" "}]
[null,null,null,null,null,null,null,null,null,null,null,null,null,null,null,{"$f":"V16","v":" "},null,null,null,{"$f":"IF($D$7=0,IF(E32=0,\" \",\" \"),IF(E32=0,\" \",IF($V$29>10000,\" \",IF(S16>Z16,\"Motor nelze požít\",IF(E21<Y13,\" \",IF(E21>Z13,\"  \",S33))))))","v":" "}]

{"sheet":"Hodnoty Pohon","index":4,"n_rows":653,"n_cols":26,"rows_kept":653,"cut":false,"hidden":true,"merged":[]}
["D",1,5,6,7,11,12,"D",2,3,4,8,9,10,13,14,15,null,"Zvoleno:",{"$f":"IF(Program!D7=0,IF(Program!D2=1,21,22),Program!D4)","v":21},null,21,22,null,null,"t"]
[120,0.39374999999999999,3.6719298245614027E-2,1.2602086438152011E-2,4.0771456123432975E-3,5.1186440677966107E-2,3.0241935483870972E-2,350,0.11030704225352111,7.8600000000000003E-2,5.2702702702702699E-2,1.1312E-3,7.2273504273504278E-4,5.3121495327102799E-4,7.248000000000001E-3,4.5757575757575759E-3,2.9090909090909089E-3,120,null,{"$f":"IF($T$1=1,R2,IF($T$1=2,H2,IF($T$1=3,H2,IF($T$1=4,H2,IF($T$1=5,A2,IF($T$1=6,A2,IF($T$1=7,A2,IF($T$1=8,H2,IF($T$1=9,H2,IF($T$1=10,H2,IF($T$1=11,A2,IF($T$1=12,A2,IF($T$1=13,H2,IF($T$1=14,H2,IF($T$1=15,H2,IF($T$1=21,V2,IF($T$1=22,W2,0)))))))))))))))))","v":120},null,120,350,null,null,0]
[121,0.39049586776859507,3.6351005166948891E-2,1.2478805742934924E-2,4.0372606815377689E-3,5.0673378372411364E-2,2.9936974789915971E-2,351,0.1098959233028157,7.8324658699801458E-2,5.2512739777105681E-2,1.1271077319271565E-3,7.249285920180289E-4,5.2932748789363587E-4,7.2222222222222228E-3,4.5598141695702673E-3,2.8988200315897055E-3,121,null,{"$f":"IF($T$1=1,R3,IF($T$1=2,H3,IF($T$1=3,H3,IF($T$1=4,H3,IF($T$1=5,A3,IF($T$1=6,A3,IF($T$1=7,A3,IF($T$1=8,H3,IF($T$1=9,H3,IF($T$1=10,H3,IF($T$1=11,A3,IF($T$1=12,A3,IF($T$1=13,H3,IF($T$1=14,H3,IF($T$1=15,H3,IF($T$1=21,V3,IF($T$1=22,W3,0)))))))))))))))))","v":121},null,121,351,null,null,8]
[122,0.38729508196721313,3.5990026652910317E-2,1.2357913682898876E-2,3.9981485444672829E-3,5.0170499256798118E-2,2.9638103161397675E-2,352,0.1095128458923269,7.8051239745176207E-2,5.2324141347424032E-2,1.1230449657869011E-3,7.2235423140193746E-4,5.2745338777374876E-4,7.1966271538555539E-3,4.5439814814814822E-3,2.8886214239422282E-3,122,null,122,null,122,352,null,null,9]
[123,0.3841463414634147,3.56361469373856E-2,1.2239341502340623E-2,3.9597869566396129E-3,4.9677503138392289E-2,2.9345140032948937E-2,353,0.10913242988249423,7.7779723074346677E-2,5.2136892764592144E-2,1.1190113836975709E-3,7.1979809018291572E-4,5.2559251145190206E-4,7.171212859230394E-3,4.5282583621683971E-3,2.8784943260448384E-3,123,null,123,null,123,353,null,null,10]
[124,0.38104838709677424,3.5289158657899167E-2,1.2123023059278039E-2,3.9221545191781889E-3,4.9194101508916337E-2,2.9057911908646011E-2,354,0.10875464763451434,7.7510088903723004E-2,5.1950979588490841E-2,1.1150066723280359E-3,7.1725997562809506E-4,5.2374471945791168E-4,7.145977429923552E-3,4.5126436781609209E-3,2.8684379884159239E-3,124,null,124,null,124,354,null,null,11]
[125,0.378,3.4948862450427887E-2,1.2008894702419884E-2,3.8852306390181972E-3,4.8720016981532596E-2,2.8776252019386113E-2,355,0.10837947189097109,7.7242317723097836E-2,5.176638758423522E-2,1.1110305228165607E-3,7.1473969771347363E-4,5.2190987427602786E-4,7.1209189842805316E-3,4.4971363115693021E-3,2.8584516720109943E-3,125,null,125,null,125,355,null,null,12]
[126,0.375,3.4615066567435702E-2,1.1896895155020104E-2,3.848995491330034E-3,4.8254982760070661E-2,2.8500000000000001E-2,356,0.10800687576927979,7.6976390290940291E-2,5.1583102718541399E-2,1.1070826306913996E-3,7.1223706907649117E-4,5.2008784031081976E-4,7.0960356669478239E-3,4.4817351598173535E-3,2.8485346480416323E-3,126,null,126,null,126,356,null,null,13]
[127,0.37204724409448819,3.4287586517590202E-2,1.1786965405171435E-2,3.8134299840260522E-3,4.7798742138364797E-2,2.8229001584786056E-2,357,0.10763683275526612,7.6712287629786977E-2,5.1401111156170125E-2,1.1031626957930744E-3,7.0975190496959731E-4,5.1827848385377232E-4,7.0713256484149839E-3,4.4664391353811169E-3,2.8386861977981984E-3,127,null,127,null,127,357,null,null,14]
[128,0.369140625,3.39662447257384E-2,1.1679048602125527E-2,3.7785157242170822E-3,4.7351048027727369E-2,2.7963108320251177E-2,358,0.10726931669687652,7.6449991021727379E-2,5.1220399256445448E-2,1.0992704221983016E-3,7.0728402321478781E-4,5.1648167305057757E-4,7.0467871245662303E-3,4.4512471655328819E-3,2.8289056124761991E-3,128,null,128,null,128,358,null,null,15]
[129,0.3662790697674419,3.3650870211825237E-2,1.1573089958256949E-2,3.7442349864948957E-3,4.6911662510730506E-2,2.770217729393468E-2,359,0.10690430179801723,7.6189482003981679E-2,5.1040953569846538E-2,1.0954055181455215E-3,7.048332441590867E-4,5.1469727786910397E-4,7.0224183162413524E-3,4.4361581920903973E-3,2.819192193006235E-3,129,null,129,null,129,359,null,null,16]
[130,0.3634615384615385,3.3341298287534855E-2,1.1469036656315811E-2,3.7105706829257032E-3,4.6480356419603089E-2,2.7446070878274269E-2,360,0.10654176261251841,7.5930742364568579E-2,5.0862760834670895E-2,1.0915676959619952E-3,7.0239939063095069E-4,5.1292517006802749E-4,6.998217468805701E-3,4.4211711711711734E-3,2.8095452498874385E-3,130,null,130,null,130,360,null,null,17]
[131,0.36068702290076343,3.3037370269523705E-2,1.1366837761639118E-2,3.6775063346479501E-3,4.6056908937673079E-2,2.7194656488549615E-2,361,0.1061816740382209,7.5673754138061225E-2,5.0685807973767295E-2,1.0877566719924255E-3,6.9998228789757322E-4,5.1116522316610902E-4,6.974182851729036E-3,4.4062850729517421E-3,2.7999641030243202E-3,131,null,131,null,131,361,null,null,18]
[132,0.35795454545454547,3.2738933208196479E-2,1.1266444139014335E-2,3.6450260449752262E-3,4.5641107222398988E-2,2.694780635400907E-2,362,0.10582401131118237,7.5418499601428893E-2,5.0510082091336519E-2,1.0839721665290719E-3,6.9758176362306752E-4,5.0941731241210093E-4,6.9503127581730176E-3,4.3914988814317711E-3,2.7904480815669438E-3,132,null,132,null,132,362,null,null,19]
[133,0.35526315789473684,3.2445839631050667E-2,1.1167808373909995E-2,3.6131144739120569E-3,4.5232746048638209E-2,2.6705397301349319E-2,363,0.1054687500000001,7.5164961269962638E-2,5.0335570469798599E-2,1.0802139037433154E-3,6.9519764782750707E-4,5.0768131475527019E-4,6.9266055045871531E-3,4.3768115942029026E-3,2.7809965237543454E-3,133,null,133,null,133,363,null,null,20]
[134,0.35261194029850745,3.2157947299685054E-2,1.1070884697808068E-2,3.5817568139967283E-3,4.4831627470896161E-2,2.646731054977711E-2,364,0.10511586600024797,7.4913121893282836E-2,5.0162260566724653E-2,1.0764816116186459E-3,6.9282977284680278E-4,5.0595710881652146E-4,6.9030594303129723E-3,4.3622222222222265E-3,2.7716087767611264E-3,134,null,134,null,134,364,null,null,21]
[135,0.35000000000000003,3.1875118979630711E-2,1.0975628917391084E-2,3.5509387673912335E-3,4.4437560503388186E-2,2.6233431516936662E-2,365,0.10476533552902442,7.4662964451426631E-2,4.9990140011831913E-2,1.0727750218850307E-3,6.9047797329339791E-4,5.0424457486010683E-4,6.8796728971962581E-3,4.3477297895902593E-3,2.7622841965471447E-3,135,null,135,null,135,365,null,null,22]
[136,0.34742647058823534,3.1597222222222249E-2,1.0881998347353738E-2,3.520646524143856E-3,4.405036081682788E-2,2.6003649635036489E-2,366,0.1044171351196095,7.4414472151013683E-2,4.9819196604040487E-2,1.0690938699546354E-3,6.8814208601776039E-4,5.0254359476590812E-4,6.8564442892071215E-3,4.3333333333333375E-3,2.7530221477102272E-3,136,null,136,null,136,366,null,null,23]
[137,0.34489051094890516,3.1324129157780552E-2,1.0789951746624449E-2,3.4908667415549689E-3,4.3669850450930393E-2,2.5777858176555705E-2,367,0.10407124161622784,7.4167628421488066E-2,4.9649418308590154E-2,1.065437894858865E-3,6.858219500706544E-4,5.0085405200227793E-4,6.8333720120677616E-3,4.3190319031903238E-3,2.7438220033418345E-3,137,null,137,null,137,367,null,null,24]
[138,0.34239130434782611,3.1055716299428774E-2,1.0699449257796634E-2,3.4615865245812643E-3,4.3295857541688659E-2,2.5555954088952639E-2,368,0.10372763216891549,7.3922416911434821E-2,4.9480793254216039E-2,1.0618068391866913E-3,6.8351740666617211E-4,4.991758315994277E-4,6.8104544928877025E-3,4.3048245614035136E-3,2.7346831448856169E-3,138,null,138,null,138,368,null,null,25]
[139,0.33992805755395683,3.0791864356909081E-2,1.0610452349582787E-2,3.4327934072179611E-3,4.2928216062544405E-2,2.5337837837837825E-2,369,0.10338628422848802,7.3678821484969237E-2,4.9313309730381588E-2,1.0582004490242358E-3,6.8122829914550923E-4,4.9750882012334762E-4,6.787690179806358E-3,4.2907103825136662E-3,2.725604961998777E-3,139,null,139,null,139,369,null,null,26]
[140,0.33750000000000002,3.0532458059810395E-2,1.0522923762116849E-2,3.4044753348025096E-3,4.2566765578634994E-2,2.5123413258109999E-2,370,0.10304717554160778,7.3436826218197415E-2,4.9146956184567568E-2,1.0546184738955825E-3,6.789544729414648E-4,4.9585290565024888E-4,6.7650775416427293E-3,4.2766884531590466E-3,2.7165868524161949E-3,140,null,140,null,140,370,null,null,27]
[141,0.33510638297872342,3.0277385989656833E-2,1.0436827454941719E-2,3.3766206471870261E-3,4.2211351013351953E-2,2.4912587412587395E-2,371,0.10271028414594785,7.3196415395746242E-2,4.8981721219615783E-2,1.0510606667047857E-3,6.7669577554365062E-4,4.9420797774151327E-4,6.7426150675520893E-3,4.2627578718783983E-3,2.7076282218172348E-3,141,null,141,null,141,371,null,null,28]
[142,0.33274647887323944,3.0026540420342914E-2,1.0352128557529369E-2,3.3492180627300899E-3,4.1861822426497393E-2,2.4705270457697628E-2,372,0.10237558836545055,7.2957573507361345E-2,4.8817593591126078E-2,1.0475267836790518E-3,6.7445205646439238E-4,4.9257392741914045E-4,6.7203012666894853E-3,4.2489177489177547E-3,2.6987284836951821E-3,142,null,142,null,142,372,null,null,29]
[143,0.33041958041958047,2.9779817166435501E-2,1.0268793322190871E-2,3.3222566630617526E-3,4.1518034803371781E-2,2.4501375515818415E-2,373,0.10204306680567828,7.2720285244571498E-2,4.8654562204905667E-2,1.0440165843130574E-3,6.7222316720530646E-4,4.9095064714168083E-4,6.6981346678798856E-3,4.2351672060409983E-3,2.6898870592292441E-3,143,null,143,null,143,373,null,null,30]
[144,0.32812500000000006,2.9537115438893639E-2,1.0186789079242703E-2,3.2957258785785213E-3,4.1179847854169629E-2,2.4300818553888111E-2,374,0.10171269834925475,7.2484535497417762E-2,4.8492616114469256E-2,1.0405298313143892E-3,6.700089612245387E-4,4.8933803078064233E-4,6.6761138192948585E-3,4.2215053763440926E-3,2.6811033771590616E-3,144,null,144,null,144,374,null,null,31]
[145,0.32586206896551723,2.9298337707786573E-2,1.010608419430423E-2,3.2696154746278388E-3,4.0847125823100169E-2,2.4103518267929617E-2,375,0.10138446215139461,7.2250309351246142E-2,4.8331744518589036E-2,1.0370662905500704E-3,6.678092939046465E-4,4.8773597359736049E-4,6.6542372881355869E-3,4.2079314040728896E-3,2.6723768736616705E-3,145,null,145,null,145,375,null,null,32]
[146,0.32363013698630139,2.9063389571617072E-2,1.0026648027609109E-2,3.2439155383441232E-3,4.0519737306687349E-2,2.3909395973154342E-2,376,0.10105833763551904,7.2017592083562287E-2,4.8171936758893169E-2,1.0336257309941522E-3,6.6562402252111298E-4,4.8614437222032237E-4,6.6325036603221022E-3,4.1944444444444512E-3,2.6637069922308544E-3,146,null,146,null,146,376,null,null,33]
[147,0.32142857142857145,2.8832179632882236E-2,9.9484508952206435E-3,3.2186164661007965E-3,4.0197555080738349E-2,2.3718375499334199E-2,377,0.10073430448895594,7.1786369160946648E-2,4.8013182317511914E-2,1.0302079246763437E-3,6.6345300621147745E-4,4.8456312462293185E-4,6.610911540188588E-3,4.1810436634717851E-3,2.6550931835588459E-3,147,null,147,null,147,377,null,null,34]
[148,0.3192567567567568,2.8604619379527178E-2,9.8714640320479771E-3,3.193708951544934E-3,3.9880455935501775E-2,2.3530383091149253E-2,378,0.10041234265872255,7.1556626236028903E-2,4.7855470814769957E-2,1.0268126466316612E-3,6.6129610594506665E-4,4.8299213010170812E-4,6.589459550184619E-3,4.1677282377919388E-3,2.6465349054203067E-3,148,null,148,null,148,378,null,null,35]
[149,0.31711409395973156,2.8380623071968595E-2,9.7956595565663052E-3,3.1691839741832162E-3,3.9568320518567013E-2,2.3345347313237199E-2,379,0.10009243234738852,7.1328349144520423E-2,4.7698792006924208E-2,1.0234396748510662E-3,6.5915318449331591E-4,4.8143128925490691E-4,6.5681463305821922E-3,4.1544973544973612E-3,2.6380316225585528E-3,149,null,149,null,149,379,null,null,36]
[150,0.31500000000000006,2.8160107635385193E-2,9.7210104371502088E-3,3.1450327884897733E-3,3.9261033185083782E-2,2.3163198959687881E-2,380,9.9774554009018065E-2,7.1101523902303135E-2,4.7543135783945867E-2,1.0200887902330744E-3,6.5702410640066441E-4,4.7988050396155426E-4,6.5469705391884309E-3,4.1413502109704714E-3,2.629582806573957E-3,150,null,150,null,150,380,null,null,37]
[151,0.3129139072847682,2.7942992556990814E-2,9.6474904599347343E-3,3.1212469135082957E-3,3.895848185490712E-2,2.2983870967741914E-2,381,9.9458688345189006E-2,7.0876136702573977E-2,4.7388492167345746E-2,1.016759776536313E-3,6.5490873795601362E-4,4.7833967736088536E-4,6.5259308510638219E-3,4.1282860147213536E-3,2.6211879358145006E-3,151,null,151,null,151,381,null,null,38]
[152,0.31085526315789475,2.7729199788023379E-2,9.5750741981238934E-3,3.0978181229224366E-3,3.8660557876296957E-2,2.2807298335467324E-2,382,9.9144816301087249E-2,7.0652173913043348E-2,4.7234851308041906E-2,1.0134524203330025E-3,6.5280694716473491E-4,4.7680871383217697E-4,6.5050259582458778E-3,4.1153039832285193E-3,2.6128464952684029E-3,152,null,152,null,152,382,null,null,39]
[153,0.30882352941176472,2.7518653650198923E-2,9.5037369826711706E-3,3.0747384355700848E-3,3.8367155895824241E-2,2.2633418043202007E-2,383,9.8832919061674934E-2,7.0429622073186565E-2,4.7082203484268656E-2,1.0101665109633457E-3,6.5071860372121397E-4,4.7528751897496681E-4,6.4842545694780802E-3,4.1024033437826622E-3,2.6045579764588027E-3,153,null,153,null,153,383,null,null,40]
[154,0.30681818181818182,2.7311280746395314E-2,9.4334548742609249E-3,3.0520001063785345E-3,3.8078173734156173E-2,2.2462168978562395E-2,384,9.8522978047930865E-2,7.0208467891547097E-2,4.6930539099525936E-2,1.0069018404907976E-3,6.4864357898192151E-4,4.7377599958964983E-4,6.463615409944016E-3,4.0895833333333409E-3,2.5963218773404342E-3,154,null,154,null,154,384,null,null,41]
[155,0.30483870967741938,2.7107009875344083E-2,9.3642046365239231E-3,3.0295956176989167E-3,3.77935122674131E-2,2.2293491864831011E-2,385,9.8214974913161196E-2,6.9988698243090383E-2,4.677984868056824E-2,1.0036582036582037E-3,6.4658174593899668E-4,4.7227406365844398E-4,6.4431072210065568E-3,4.0768431983385332E-3,2.5881377021982578E-3,155,null,155,null,155,385,null,null,42]
[156,0.30288461538461542,2.6905771950122188E-2,9.295963710424E-3,3.0075176710195298E-3,3.7513075313807494E-2,2.2127329192546556E-2,386,9.7908891539379275E-2,6.9770300166607346E-2,4.6630122875432133E-2,1.0004353978447806E-3,6.44532979194333E-4,4.7078162032671673E-4,6.422728759952004E-3,4.0641821946169852E-3,2.580004961548003E-3,156,null,156,null,156,386,null,null,43]
[157,0.30095541401273884,2.6707499920247617E-2,9.2287101897565414E-3,2.9857591790388811E-3,3.7236769525292791E-2,2.1963625154130677E-2,387,9.7604710033752956E-2,6.9553260862166233E-2,4.6481352451501562E-2,9.9723322302392456E-4,6.4249715493415634E-4,4.6929857988466426E-4,6.4024787997390645E-3,4.0515995872033106E-3,2.571923172038579E-3,157,null,157,null,157,387,null,null,44]
[158,0.29905063291139239,2.6512128697194316E-2,9.1624227977028985E-3,2.9643132580803497E-3,3.6964504283965686E-2,2.1802325581395322E-2,388,9.7302412725117846E-2,6.9337567688611879E-2,4.6333528293610031E-2,9.9405148172182576E-4,6.4047415090408082E-4,4.6782485374933624E-4,6.3823561287525647E-3,4.0390946502057703E-3,2.5638918563563153E-3,158,null,158,null,158,388,null,null,45]
[159,0.29716981132075471,2.6319595083152635E-2,9.0970808643880234E-3,2.9431732208314194E-3,3.6696191602980155E-2,2.1643377885783688E-2,389,9.7001982160555278E-2,6.9123208161111463E-2,4.6186641402178916E-2,9.9088997897687483E-4,6.3846384638463764E-4,4.6636035444699809E-4,6.3623595505617886E-3,4.0266666666666758E-3,2.5559105431309905E-3,159,null,159,null,159,389,null,null,46]
[160,0.29531250000000003,2.6129837702871479E-2,9.0326643053915846E-3,2.9223325693913949E-3,3.6431746031745982E-2,2.1486731001206245E-2,390,9.6703401102033335E-2,6.8910169948745464E-2,4.6040682891391065E-2,9.8774852229983889E-4,6.3646612216726028E-4,4.6490499559582337E-4,6.3424878836833513E-3,4.0143149284253676E-3,2.5479787668436097E-3,160,null,160,null,160,390,null,null,47]
[161,0.29347826086956524,2.594279693842776E-2,8.9691536011656421E-3,2.9017849886124134E-3,3.6171084565196784E-2,2.1332335329341288E-2,391,9.6406652523109843E-2,6.8698440872143302E-2,4.5895643987398912E-2,9.8462692163479577E-4,6.3448086053072088E-4,4.6345869188890948E-4,6.3227399613484982E-3,4.0020387359836996E-3,2.540096067735895E-3,161,null,161,null,161,391,null,null,48]
[162,0.29166666666666669,2.5758414866777501E-2,8.9065297773145858E-3,2.8815243397194248E-3,3.5914126556925531E-2,2.1180142687277019E-2,392,9.6111719605695811E-2,6.8488008901162092E-2,4.5751516026566401E-2,9.8152498932080313E-4,6.3250794521800687E-4,4.6202135907760908E-4,6.303114631274742E-3,3.9898373983739939E-3,2.5322619917214511E-3,162,null,162,null,162,392,null,null,49]
[163,0.28987730061349698,2.5576635199951191E-2,8.8447743856954562E-3,2.8615446541955885E-3,3.5660793635996349E-2,2.1030106257378955E-2,393,9.581858573687807E-2,6.8278862152608241E-2,4.5608290453743858E-2,9.7844254005429311E-4,6.3054726141362498E-4,4.6059291395517105E-4,6.2836107554417311E-3,3.9777102330293915E-3,2.524476090298568E-3,163,null,163,null,163,393,null,null,50]
[164,0.28810975609756095,2.5397403227763692E-2,8.7838694862991291E-3,2.8418401279203063E-3,3.5411009627252472E-2,2.0882180539273123E-2,394,9.5527234505800071E-2,6.8070988888000478E-2,4.5465958820575206E-2,9.7537939085217036E-4,6.2859869572132892E-4,4.5917327434068375E-4,6.2642272098712799E-3,3.965656565656576E-3,2.5167379204646288E-3,164,null,164,null,164,394,null,null,51]
[165,0.28636363636363638,2.5220665762916174E-2,8.7237976298749839E-3,2.8224051155477888E-3,3.5164700474950156E-2,2.0736321303841645E-2,395,9.52376497005991E-2,6.7864377511373669E-2,4.5324512783836778E-2,9.7233536101560452E-4,6.2666213614225768E-4,4.577623590633143E-4,6.2449628844114431E-3,3.9536757301107854E-3,2.509047044632087E-3,165,null,165,null,165,395,null,null,52]
[166,0.28463855421686746,2.5046371088374396E-2,8.6645418412636833E-3,2.803234125114721E-3,3.4921794169557485E-2,2.0592485549132917E-2,396,9.4949815305399365E-2,6.7659016567122504E-2,4.5183944103807043E-2,9.6931027209449497E-4,6.2473747205347573E-4,4.5636008794683775E-4,6.2258166825245693E-3,3.941767068273103E-3,2.5014030305459791E-3,166,null,166,null,166,396,null,null,53]
[167,0.28293413173652698,2.4874468906913944E-2,8.6060856034046434E-3,2.7843218128662081E-3,3.468222067756651E-2,2.0450631458094112E-2,397,9.4663715497359149E-2,6.7454894737884297E-2,4.5044244642666591E-2,9.6630394785259975E-4,6.2282459418690954E-4,4.5496638179444985E-4,6.2067875210792475E-3,3.9299299299299408E-3,2.4938054512029413E-3,167,null,167,null,167,397,null,null,54]
[168,0.28125,2.4704910292729067E-2,8.5484128419865343E-3,2.7656629782897607E-3,3.444591187417452E-2,2.0310718358038736E-2,398,9.437933464377142E-2,6.7252000842459816E-2,4.4905406362927627E-2,9.6331621423330902E-4,6.2092339460866747E-4,4.5358116237385638E-4,6.1878743301460436E-3,3.9181636726547016E-3,2.4862538847716946E-3,168,null,168,null,168,398,null,null,55]
[169,0.27958579881656809,2.4537647645007259E-2,8.4915079107108476E-3,2.7472525593476268E-3,3.4212801478698922E-2,2.0172706681766673E-2,399,9.4096657299216416E-2,6.7050323833771727E-2,4.4767421325892523E-2,9.6034689932605422E-4,6.1903376669873928E-4,4.5220435240263517E-4,6.1690760527969724E-3,3.9064676616915534E-3,2.4787479145149754E-3,169,null,169,null,169,399,null,null,56]
[170,0.27794117647058825,2.4372634643377081E-2,8.4353555771401641E-3,2.7290856278982881E-3,3.3982824992596923E-2,2.0036557930258686E-2,400,9.3815668202765296E-2,6.6849852796859496E-2,4.4630281690140668E-2,9.5739583333333354E-4,6.1715560513106438E-4,4.5083587553386336E-4,6.1503916449086047E-3,3.8948412698412808E-3,2.4712871287128715E-3,170,null,170,null,170,400,null,null,57]
[171,0.27631578947368424,2.4209826205141633E-2,8.379941009104214E-3,2.7111573852984226E-3,3.3755919639968171E-2,1.9902234636871474E-2,401,9.3536352275233742E-2,6.6650576946910275E-2,4.4493979710042993E-2,9.5446284853834592E-4,6.1528880585396133E-4,4.4947565634200469E-4,6.1318200749687522E-3,3.8832838773491703E-3,2.4638711205875385E-3,171,null,171,null,171,401,null,null,58]
[172,0.27470930232558138,2.4049178444214718E-2,8.3252497616382766E-3,2.6934631581770892E-3,3.3532024310425373E-2,1.9769700332963342E-2,402,9.3258694616484381E-2,6.6452485627324809E-2,4.4358507734303727E-2,9.5154777927321688E-4,6.1343326607091284E-4,4.4812362030905204E-4,6.1133603238866284E-3,3.8717948717948828E-3,2.4564994882292734E-3,172,null,172,null,172,402,null,null,59]
[173,0.27312138728323704,2.3890648631681159E-2,8.2712677644297041E-3,2.6759983943743159E-3,3.3311079504223323E-2,1.9638919514884199E-2,403,9.2982680502777304E-2,6.6255568307817828E-2,4.4223858204528621E-2,9.4865046188780534E-4,6.1158888422169569E-4,4.4677969381091867E-4,6.0950113848064471E-3,3.8603736479842789E-3,2.4491718345239031E-3,173,null,173,null,173,403,null,null,60]
[174,0.27155172413793105,2.3734195157906757E-2,8.2179813097497285E-3,2.6587586590366766E-3,3.3093027279543163E-2,1.9509857612267215E-2,404,9.2708295384167347E-2,6.6059814582551959E-2,4.4090023653819213E-2,9.4577073471907819E-4,6.0975555996385102E-4,4.4544380410407403E-4,6.0767722629243509E-3,3.8490196078431486E-3,2.4418877670814745E-3,174,null,174,null,174,404,null,null,61]
[175,0.27,2.3579777496127389E-2,8.165377040848746E-3,2.6417396308628291E-3,3.2877811201833487E-2,1.9382480957562533E-2,405,9.2435524881947326E-2,6.5865214168304834E-2,4.3956996705392569E-2,9.4290843806104155E-4,6.0793319415448758E-4,4.4411587931241869E-4,6.0586419753086299E-3,3.8377321603128172E-3,2.4346468981662111E-3,175,null,175,null,175,405,null,null,62]
[176,0.26846590909090912,2.3427356167450272E-2,8.1134419407944622E-3,2.6249370984923262E-3,3.2665376295115497E-2,1.9256756756756723E-2,406,9.2164354786136327E-2,6.5671756902668327E-2,4.3824770071225871E-2,9.4006341413521548E-4,6.0612168883240837E-4,4.4279584841439289E-4,6.0406195507231386E-3,3.8265107212475751E-3,2.4274488446277133E-3,176,null,176,null,176,406,null,null,63]
[177,0.26694915254237289,2.327689270720391E-2,8.0621633217333333E-3,2.6083469570313727E-3,3.2455668995163826E-2,1.9132653061224452E-2,407,9.1894771053012067E-2,6.5479432742279478E-2,4.3693336550725444E-2,9.3723550706164302E-4,6.0432094720055821E-4,4.4148364123031462E-4,6.0227040294538641E-3,3.8153547133139088E-3,2.4202932278333724E-3,177,null,177,null,177,407,null,null,64]
[178,0.2654494382022472,2.312834963257647E-2,8.0115288145566309E-3,2.5919652047094979E-3,3.2248637104479221E-2,1.9010138740661653E-2,408,9.1626759802686419E-2,6.5288231761082449E-2,4.3562689029419656E-2,9.3442456283041909E-4,6.025308736087809E-4,4.4017918840994239E-4,6.0048944631385624E-3,3.8042635658914847E-3,2.4131796736019803E-3,178,null,178,null,178,408,null,null,65]
[179,0.26396648044692739,2.2981690411485439E-2,7.9615263589535266E-3,2.5757879396614354E-3,3.2044229748973772E-2,1.8889183457051928E-2,409,9.1360307316723274E-2,6.5098144148620821E-2,4.343282047767516E-2,9.3163042927373193E-4,6.0075137353688356E-4,4.3888242142025734E-4,5.9871899145994183E-3,3.7932367149758573E-3,2.4061078121385055E-3,179,null,179,null,179,409,null,null,66]
[180,0.26250000000000001,2.2836879432624198E-2,7.9121441938343404E-3,2.559811356828757E-3,3.1842397336292946E-2,1.8769757639620615E-2,410,9.1095400035797774E-2,6.4909160208359601E-2,4.3303723949436088E-2,9.2885295603840337E-4,5.989823535780005E-4,4.3759327253346092E-4,5.9695894576786493E-3,3.7822736030828637E-3,2.3990772779700115E-3,180,null,180,null,180,410,null,null,67]
[181,0.2610497237569061,2.2693881976633953E-2,7.8633708481079933E-3,2.5440317449761159E-3,3.1643091515702916E-2,1.8651832460732948E-2,411,9.0832024557396154E-2,6.4721270356036462E-2,4.31753925809856E-2,9.2609199455892012E-4,5.9722372142224803E-4,4.3631167481518343E-4,5.9520921770770032E-3,3.7713736791546715E-3,2.3920877098826954E-3,181,null,181,null,181,411,null,null,68]
[182,0.25961538461538464,2.2552664188352008E-2,7.8151951317984875E-3,2.5284454838171576E-3,3.1446265139474919E-2,1.8535379812695076E-2,412,9.0570167633555562E-2,6.4534465118041409E-2,4.3047819589729447E-2,9.2334739803094255E-4,5.9547538584066881E-4,4.3503756211289946E-4,5.934697168195089E-3,3.7605363984674453E-3,2.3851387508600258E-3,182,null,182,null,182,412,null,null,69]
[183,0.25819672131147542,2.2413193050089774E-2,7.7676061274859435E-3,2.5130490412454526E-3,3.1251872225701846E-2,1.8420372285418783E-2,413,9.0309816168642587E-2,6.4348735129824544E-2,4.2920998273001047E-2,9.2061902138528603E-4,5.9373725666945576E-4,4.3377086904454525E-4,5.9174035369774797E-3,3.7497612225406052E-3,2.378230048021953E-3,183,null,183,null,183,413,null,null,70]
[184,0.25679347826086957,2.2275436355896214E-2,7.7205931820584599E-3,2.4978389706659721E-3,3.1059867922485589E-2,1.8306783144912606E-2,414,9.005095721717013E-2,6.416407113433116E-2,4.2794922006887497E-2,9.179067212623591E-4,5.9200924479445196E-4,4.3251153098733457E-4,5.9002103997595305E-3,3.7390476190476323E-3,2.3713612525651743E-3,184,null,184,null,184,414,null,null,71]
[185,0.25540540540540541,2.2139362686764599E-2,7.6741458987616929E-3,2.4828119084229013E-3,3.087020847343638E-2,1.8194586312563807E-2,415,8.9793577981651773E-2,6.3980463980463767E-2,4.2669584245076379E-2,9.1521035598705522E-4,5.9029126213592121E-4,4.3125948406676885E-4,5.8831168831168703E-3,3.7283950617284082E-3,2.3645320197044333E-3,185,null,{"$f":"IF($T$1=1,R67,IF($T$1=2,H67,IF($T$1=3,H67,IF($T$1=4,H67,IF($T$1=5,A67,IF($T$1=6,A67,IF($T$1=7,A67,IF($T$1=8,H67,IF($T$1=9,H67,IF($T$1=10,H67,IF($T$1=11,A67,IF($T$1=12,A67,IF($T$1=13,H67,IF($T$1=14,H67,IF($T$1=15,H67,IF($T$1=21,V67,IF($T$1=22,W67,0)))))))))))))))))","v":185},null,185,415,null,null,72]
[186,0.25403225806451613,2.2004941386742454E-2,7.6282541295337094E-3,2.4679645713197294E-3,3.068285118442857E-2,1.8083756345177626E-2,416,8.9537665810492648E-2,6.379790462157045E-2,4.2544978517722667E-2,9.1252978554408294E-4,5.8858322163358112E-4,4.3001466514583782E-4,5.8661221237174882E-3,3.7178030303030435E-3,2.3577420086148266E-3,186,null,186,null,186,416,null,null,73]
[187,0.25267379679144386,2.1872142539906561E-2,7.5829079676132151E-3,2.4532937542278053E-3,3.0497754391559634E-2,1.7974268415741637E-2,417,8.928320819591648E-2,6.361638411395891E-2,4.2421098430335473E-2,9.0986487155372982E-4,5.8688503723189735E-4,4.2877701181440577E-4,5.8492252681763878E-3,3.707271010387171E-3,2.3509908823751034E-3,187,null,187,null,187,417,null,null,74]
[188,0.25132978723404259,2.17409369481667E-2,7.5380977404098859E-3,2.4387963277796689E-3,3.0314877430261976E-2,1.7866098294884617E-2,418,8.9030192771927766E-2,6.3435893615435987E-2,4.2297937662684158E-2,9.0721547724805071E-4,5.8519662386563045E-4,4.2754646237878218E-4,5.8324254729127329E-3,3.6967984934086766E-3,2.344278307911939E-3,188,null,188,null,188,418,null,null,75]
[189,0.25,2.1611296109863534E-2,7.4938140026259946E-3,2.4244692361437043E-3,3.0134180605519454E-2,1.7759222333000958E-2,419,8.8778607312308536E-2,6.3256424383871815E-2,4.2175489967723467E-2,9.0458146744746843E-4,5.8351789744563146E-4,4.2632295585146989E-4,5.8157219040094674E-3,3.6863849765258355E-3,2.3376039559451561E-3,189,null,189,null,189,419,null,null,76]
[190,0.24868421052631579,2.1483192199127626E-2,7.4500475296190739E-3,2.4103094948767592E-3,2.9955625163142711E-2,1.7653617443012845E-2,420,8.8528439728648878E-2,6.3077967775788418E-2,4.2053749170537273E-2,9.0196270853778245E-4,5.8184877484488264E-4,4.2510643194108941E-4,5.799113737075319E-3,3.6760299625468304E-3,2.3309675009338814E-3,190,null,190,null,190,420,null,null,77]
[191,0.24738219895287958,2.1356598045968306E-2,7.4067893109958137E-3,2.3963141888515868E-3,2.9779173262059769E-2,1.7549261083743807E-2,421,8.8279678068410875E-2,6.2900515244971991E-2,4.193270916730054E-2,8.9935906844757591E-4,5.8018917388477479E-4,4.2389683104247544E-4,5.7826001571091769E-3,3.665732959850621E-3,2.324368621023616E-3,191,null,191,null,191,421,null,null,78]
[192,0.24609375,2.1231487117062377E-2,7.3640305444278489E-3,2.3824804702560686E-3,2.9604787947580161E-2,1.7446131243878511E-2,422,8.8032310513024944E-2,6.2724058341108654E-2,4.1812363924259195E-2,8.9677041662601252E-4,5.7853901332162081E-4,4.2269409422694183E-4,5.766180358366773E-3,3.6554934823091389E-3,2.3178069979942055E-3,192,null,192,null,192,422,null,null,79]
[193,0.24481865284974094,2.110783349721412E-2,7.3217626296805246E-3,2.3688055566613462E-3,2.9432433125593013E-2,1.7344206426484869E-2,423,8.7786325376018076E-2,6.2548588708443043E-2,4.1692707476727514E-2,8.9419662402101497E-4,5.7689821283339821E-4,4.2149816323271128E-4,5.7498535442296285E-3,3.6453110492107848E-3,2.3112823172086821E-3,193,null,193,null,193,423,null,null,80]
[194,0.24355670103092786,2.0985611871459461E-2,7.2799771628461324E-3,2.3552867291561017E-3,2.9262073537661207E-2,1.7243465634075472E-2,424,8.7541711101173508E-2,6.2374098084459359E-2,4.1573733928102631E-2,8.9163756305781947E-4,5.7526669300671544E-4,4.2030898045550811E-4,5.7336189270762198E-3,3.6351851851851992E-3,2.3047942675629754E-3,194,null,194,null,194,424,null,null,81]
[195,0.24230769230769234,2.0864797507788253E-2,7.2386659307734826E-3,2.3419213305443621E-3,2.9093674736975463E-2,1.7143888354186679E-2,425,8.7298456260720844E-2,6.2200578298584462E-2,4.1455437448895932E-2,8.8909310761789624E-4,5.7364437532400083E-4,4.1912648893930877E-4,5.7174757281553247E-3,3.6251154201292846E-3,2.2983425414364639E-3,195,null,195,null,195,425,null,null,82]
[196,0.24107142857142858,2.074536624046E-2,7.1978209056860806E-3,2.3287067636043202E-3,2.8927203065134029E-2,1.7045454545454506E-2,426,8.7056549553556586E-2,6.2028021270912524E-2,4.1337812275780872E-2,8.8656313301823124E-4,5.7203118215090555E-4,4.1795063236724889E-4,5.701423177461501E-3,3.6151012891344528E-3,2.2919268346433554E-3,196,null,196,null,196,426,null,null,83]
[197,0.23984771573604061,2.0627294453889267E-2,7.1574342399814738E-3,2.315640489405771E-3,2.8762625629714954E-2,1.6948144624167421E-2,427,8.6815979803493884E-2,6.1856419010950861E-2,4.1220852710657022E-2,8.8404751599095884E-4,5.7042703672391978E-4,4.1678135505268215E-4,5.6854605136126522E-3,3.6051423324150742E-3,2.2855468463848804E-3,197,null,197,null,197,427,null,null,84]
[198,0.23863636363636365,2.0510559067078344E-2,7.1174982612047149E-3,2.3027200256838785E-3,2.8599910282609706E-2,1.6851939451277161E-2,428,8.657673595754134E-2,6.1685763616386523E-2,4.110455311972995E-2,8.8154613466334198E-4,5.6883186313819709E-4,4.1561860193038973E-4,5.669586983729648E-3,3.5952380952381097E-3,2.2792022792022791E-3,198,null,198,null,198,428,null,null,85]
[199,0.23743718592964827,2.0395137518575454E-2,7.0780054671891624E-3,2.2899429452670817E-3,2.8439025599087977E-2,1.6756820319849444E-2,429,8.6338807084210253E-2,6.1516047271873243E-2,4.0988907932606559E-2,8.7905886853809024E-4,5.6724558633558075E-4,4.1446231854793547E-4,5.653801843317958E-3,3.585388127853896E-3,2.2728928389305746E-3,199,null,199,null,199,429,null,null,86]
[200,0.23625000000000002,2.0281007751938078E-2,7.0389485213581664E-3,2.2773068745570542E-3,2.8279940857565227E-2,1.6662768942937285E-2,430,8.6102182371849537E-2,6.1347262247838381E-2,4.0873911641405761E-2,8.7658559847401073E-4,5.6566813209283176E-4,4.1331245105716589E-4,5.6381043561512549E-3,3.5755919854280659E-3,2.2666182346531057E-3,200,null,200,null,200,430,null,null,87]
[201,0.23507462686567165,2.0168148201681575E-2,7.0003202481814545E-3,2.2648094920587059E-3,2.8122626020045508E-2,1.6569767441860426E-2,431,8.5866851127008134E-2,6.1179400899309413E-2,4.0759558799883994E-2,8.7412620666698401E-4,5.6409942701005165E-4,4.1216894620585084E-4,5.622493794156946E-3,3.5658492279745835E-3,2.2603781786568137E-3,201,null,201,null,201,431,null,null,88]
[202,0.23391089108910892,2.0056537779694406E-2,6.9621136287803019E-3,2.2524485269583331E-3,2.7967051713213356E-2,1.6477798334875077E-2,432,8.563280277282409E-2,6.1012455664759664E-2,4.0645844022575442E-2,8.7168057663125989E-4,5.6253939849929718E-4,4.1103175132946237E-4,5.606969437303615E-3,3.5561594202898699E-3,2.2541723863882665E-3,202,null,202,null,202,432,null,null,89]
[203,0.23275862068965517,1.9946155862101918E-2,6.9243217966758466E-3,2.2402217577480676E-3,2.7813189210149945E-2,1.6386844526218913E-2,433,8.5400026847439886E-2,6.084641906497288E-2,4.0532761983946543E-2,8.692485931810661E-4,5.6098797477338504E-4,4.0990081434308975E-4,5.5915305734903038E-3,3.5465221318880004E-3,2.2480005764104038E-3,203,null,203,null,203,433,null,null,90]
[204,0.23161764705882354,1.9836982276561558E-2,6.8869380336751204E-3,2.2281270108948921E-3,2.7661010412649369E-2,1.6296889295516884E-2,434,8.5168513002443644E-2,6.0681283701926263E-2,4.0420307417564652E-2,8.668301424125251E-4,5.5944508483487902E-4,4.0877608373348734E-4,5.5761764984376362E-3,3.5369369369369521E-3,2.2418624703599913E-3,204,null,204,null,204,434,null,null,91]
[205,0.23048780487804879,1.9728997289972992E-2,6.8499557658896447E-3,2.216162159552532E-3,2.7510487834112352E-2,1.6207916287534083E-2,435,8.4938251001335577E-2,6.0517042257691722E-2,4.0308475115280407E-2,8.6442511168586915E-4,5.579106584652604E-4,4.0765750855125288E-4,5.5609065155807257E-3,3.5274034141958822E-3,2.2357577929057685E-3,205,null,205,null,205,435,null,null,92]
[206,0.22936893203883496,1.9622181596587542E-2,6.8133685598816048E-3,2.2043251223146372E-3,2.7361594582995492E-2,1.6119909502262404E-2,436,8.4709230718019168E-2,6.0353687493354825E-2,4.0197259926423708E-2,8.6203338960795387E-4,5.5638462621427438E-4,4.0654503840313437E-4,5.5457199359638274E-3,3.5179211469534202E-3,2.2296862717072819E-3,206,null,206,null,206,436,null,null,93]
[207,0.22826086956521741,1.9516516306501717E-2,6.7771701189328799E-3,2.1926138620076965E-3,2.7214304346794962E-2,1.6032853285328493E-2,437,8.4481442135316845E-2,6.0191212247951265E-2,4.0086656757012944E-2,8.5965486601505899E-4,5.5486691938945248E-4,4.0543862344446201E-4,5.5306160781367292E-3,3.5084897229669498E-3,2.2236476373743851E-3,207,null,207,null,207,437,null,null,94]
[208,0.22716346153846156,1.9411982934520591E-2,6.7413542794323815E-3,2.1810263845222408E-3,2.7068591376544882E-2,1.5946732318710792E-2,438,8.4254875343509394E-2,6.0029609437420445E-2,3.9976660568977231E-2,8.5728943195597458E-4,5.533574700458051E-4,4.0433821437170357E-4,5.5155942680528147E-3,3.4991087344028679E-3,2.2176416234273933E-3,208,null,208,null,208,438,null,null,95]
[209,0.22607655502392349,1.9308563389377156E-2,6.7059150073773312E-3,2.1695607376809012E-3,2.6924430471810916E-2,1.5861531611754191E-2,439,8.4029520538898908E-2,5.986887205357589E-2,3.986726637939144E-2,8.5493697967536431E-4,5.5185621097568135E-4,4.0324376241514091E-4,5.5006538389687932E-3,3.4897777777777935E-3,2.2116679662578858E-3,209,null,209,null,209,439,null,null,96]
[210,0.22500000000000003,1.9206239963294427E-2,6.6708463949843328E-3,2.1582150101419903E-3,2.678179696616095E-2,1.5777236492471172E-2,440,8.3805368022394675E-2,5.9708993163092139E-2,3.9758469259723712E-2,8.5259740259740298E-4,5.50363075698795E-4,4.0215521933166477E-4,5.4857941313460551E-3,3.4804964539007252E-3,2.2057264050901375E-3,210,null,210,null,210,440,null,null,97]
[211,0.22393364928909956,1.9104995321877736E-2,6.6361426574062096E-3,2.146987330337303E-3,2.664066671309508E-2,1.5693832599118902E-2,441,8.3582408198121738E-2,5.9549965906507817E-2,3.9650264335095317E-2,8.5027059530968163E-4,5.488779984524104E-4,4.0107253739768596E-4,5.4710144927536146E-3,3.4712643678161078E-3,2.1998166819431715E-3,211,null,211,null,211,441,null,null,98]
[212,0.22287735849056603,1.9004812494324983E-2,6.6017981295508031E-3,2.1358758654429068E-3,2.6501016072418174E-2,1.561130587204203E-2,442,8.3360631572051452E-2,5.9391783497244645E-2,3.9542646783552501E-2,8.4795645354737552E-4,5.4740091418168724E-4,3.9999566940216135E-4,5.456314277772622E-3,3.4620811287478116E-3,2.193938541593418E-3,212,null,212,null,212,442,null,null,99]
[213,0.22183098591549294,1.8905674863943369E-2,6.5678072629980428E-3,2.1248788203817198E-3,2.6362821897038816E-2,1.5529642545771537E-2,443,8.3140028750653905E-2,5.9234439220641949E-2,3.9435611835350229E-2,8.4565487417766975E-4,5.4593175853018239E-4,3.9892456863973083E-4,5.4416928479024138E-3,3.4529463500439913E-3,2.1880917315379761E-3,213,null,213,null,213,443,null,null,100]
[214,0.2207943925233645,1.8807566158961321E-2,6.534164623011764E-3,2.1139944368567471E-3,2.6226061520179089E-2,1.5448829141370298E-2,444,8.2920590439571673E-2,5.9077926433006606E-2,3.9329154772247479E-2,8.4336575518443788E-4,5.4447046783050103E-4,3.9785918890396536E-4,5.4271495714680604E-3,3.4438596491228233E-3,2.1822760019584529E-3,214,null,214,null,214,444,null,null,101]
[215,0.21976744186046512,1.8710470443625081E-2,6.5008648856429048E-3,2.1032209924138809E-3,2.6090712742980485E-2,1.5368852459016353E-2,445,8.2702307442314424E-2,5.8922238560677888E-2,3.9223270926813915E-2,8.4108899565316889E-4,5.4301697909510122E-4,3.9679948448072201E-4,5.412683823529405E-3,3.4348206474190887E-3,2.1764911056853854E-3,215,null,215,null,215,445,null,null,102]
[216,0.21875,1.8614372109569642E-2,6.4679028349208202E-3,2.0925567995332063E-3,2.5956753822491557E-2,1.5289699570815409E-2,446,8.2485170658974261E-2,5.8767369099107132E-2,3.9117955681747779E-2,8.3882449575613802E-4,5.4157123000724201E-4,3.9574541014160576E-4,5.3982949857915418E-3,3.4258289703316047E-3,2.1707367981632225E-3,216,null,216,null,216,446,null,null,103]
[217,0.21774193548387097,1.8519255867454253E-2,6.4352733601296223E-3,2.082000204747819E-3,2.5824163460023777E-2,1.521135781383429E-2,447,8.2269171084961054E-2,5.8613311611951859E-2,3.9013204469204706E-2,8.3657215673781495E-4,5.4013315891207852E-4,3.9469692113753419E-4,5.3839824465167245E-3,3.4168842471714697E-3,2.1650128374158624E-3,217,null,217,null,217,447,null,null,104]
[218,0.21674311926605505,1.8425106738853038E-2,6.402971453166542E-3,2.0715495877891752E-3,2.5692920789862458E-2,1.5133814783347454E-2,448,8.2054299809757703E-2,5.8460059730184075E-2,3.8909012770137259E-2,8.3433188090050879E-4,5.3870270480789689E-4,3.9365397319240545E-4,5.3697456004376714E-3,3.4079861111111277E-3,2.1593189840127345E-3,218,null,218,null,218,448,null,null,105]
[219,0.21575342465753428,1.8331910048391784E-2,6.3709922059794538E-3,2.0612033607580586E-3,2.5563005368320148E-2,1.5057058326289055E-2,449,8.1840548015694847E-2,5.830760715121263E-2,3.8805376113645144E-2,8.3210357159024069E-4,5.3727980733748809E-4,3.9261652249686531E-4,5.355583848672239E-3,3.3991341991342159E-3,2.1536550010354109E-3,219,null,219,null,219,449,null,null,106]
[220,0.21477272727272728,1.8239651416122098E-2,6.3393308080808147E-3,2.0509599673202636E-3,2.543439716312049E-2,1.4981076534903239E-2,450,8.1627906976744685E-2,5.8155947638019095E-2,3.8702290076335612E-2,8.298871331828446E-4,5.3586440677965959E-4,3.9158452570217292E-4,5.3414965986394516E-3,3.3903281519861998E-3,2.1480206540447503E-3,220,null,220,null,220,450,null,null,107]
[221,0.21380090497737558,1.8148316750124741E-2,6.3079825441353507E-3,2.0408178819261431E-3,2.5307076543100899E-2,1.4905857740585735E-2,451,8.1416368057333488E-2,5.8005075018307269E-2,3.8599750281694163E-2,8.2768247107028721E-4,5.3445644404087882E-4,3.9055793991416325E-4,5.327483263976837E-3,3.3815676141257705E-3,2.1424157110485477E-3,221,null,221,null,221,451,null,null,108]
[222,0.21283783783783786,1.8057892239334031E-2,6.2769427916189767E-3,2.0307756090531984E-3,2.518102426822303E-2,1.4831390507910033E-2,452,8.1205922711172607E-2,5.785498318366581E-2,3.8497752399465172E-2,8.2548949164720721E-4,5.3305586064704945E-4,3.8953672268730383E-4,5.3135432644590775E-3,3.3728522336769927E-3,2.1368399424696936E-3,222,null,222,null,222,452,null,null,109]
[223,0.21188340807174891,1.7968364346575762E-2,6.2462070185464961E-3,2.0208316824709251E-3,2.5056221479880274E-2,1.4757663628831774E-2,453,8.0996562480107448E-2,5.7705666088743793E-2,3.8396292145042289E-2,8.2330810229766689E-4,5.3166259873541652E-4,3.8852083201884466E-4,5.2996760259179237E-3,3.3641816623821933E-3,2.1312931211148298E-3,223,null,223,null,223,453,null,null,110]
[224,0.2109375,1.7879719801811134E-2,6.2157707812657238E-3,2.0109846645271459E-3,2.4932649691492056E-2,1.4684666117065088E-2,454,8.0788278992984408E-2,5.7557117750439098E-2,3.8295365278868544E-2,8.2113821138211419E-4,5.3027660104659714E-4,3.8751022634305984E-4,5.2858809801633573E-3,3.3555555555555725E-3,2.1257750221434896E-3,224,null,224,null,224,454,null,null,111]
[225,0.21,1.7791945595579735E-2,6.1856297223158059E-3,2.0012331454551139E-3,2.4810290779375126E-2,1.4612387202625064E-2,455,8.058106396453503E-2,5.740933224709921E-2,3.8194967605845745E-2,8.189797282245493E-4,5.2889781091673693E-4,3.865048645255781E-4,5.2721575649059957E-3,3.3469735720375276E-3,2.1202854230377164E-3,225,null,225,null,225,455,null,null,112]
[226,0.20907079646017698,1.7705028972634703E-2,6.1557795683475358E-3,1.9915757427006733E-3,2.4689126973882283E-2,1.4540816326530573E-2,456,8.037490919427738E-2,5.7262303717734345E-2,3.8095094974753274E-2,8.1683256309989373E-4,5.2752617226978747E-4,3.8550470585780179E-4,5.2585052236806843E-3,3.3384353741496768E-3,2.1148241035721547E-3,226,null,226,null,226,456,null,null,113]
[227,0.20814977973568283,1.7618957425763505E-2,6.1262161281036001E-3,1.982011100268812E-3,2.4569140850799552E-2,1.4469943135662027E-2,457,8.0169806565434334E-2,5.7116026361242668E-2,3.7995743277675915E-2,8.1469662722155774E-4,5.2616162960990396E-4,3.8450971005141231E-4,5.2449234057712841E-3,3.3299406276505682E-3,2.1093908457845987E-3,227,null,227,null,227,457,null,null,114]
[228,0.20723684210526316,1.753371868978815E-2,6.0969352904567528E-3,1.9725378880889495E-3,2.4450315322992931E-2,1.4399757477768761E-2,458,7.9965748043868162E-2,5.6970494435647265E-2,3.7896908449440617E-2,8.12571832729202E-4,5.24804128013961E-4,3.8351983723296039E-4,5.2314115661366246E-3,3.3214890016920644E-3,2.1039854339469956E-3,228,null,228,null,228,458,null,null,115]
[229,0.20633187772925765,1.7449300735738648E-2,6.0679330225039772E-3,1.9631548013983456E-3,2.4332633632296426E-2,1.4330249396621045E-2,459,7.9762725677031618E-2,5.6825702257344859E-2,3.7798586467062023E-2,8.1045809267669012E-4,5.2345361312418261E-4,3.825350479385393E-4,5.217969165337585E-3,3.3130801687763886E-3,2.0986076545368936E-3,229,null,229,null,229,459,null,null,116]
[230,0.20543478260869566,1.7365691765194039E-2,6.0392053677147811E-3,1.9538605601430174E-3,2.4216079341633178E-2,1.4261409127301811E-2,460,7.9560731592934711E-2,5.6681644200365852E-2,3.770077334919663E-2,8.0835532102022903E-4,5.221100311408875E-4,3.8155530310854076E-4,5.2045956694653107E-3,3.304713804713822E-3,2.0932572962093256E-3,230,null,230,null,230,460,null,null,117]
[231,0.20454545454545456,1.7282880204785297E-2,6.0107484441318535E-3,1.9446539083956E-3,2.4100636327361997E-2,1.4193227091633436E-2,461,7.9359757999127326E-2,5.6538314695645644E-2,3.7603465155605385E-2,8.0626343260669362E-4,5.2077332881534462E-4,3.8058056408249034E-4,5.1912905500705224E-3,3.2963895885810418E-3,2.0879341497691225E-3,231,null,231,null,231,461,null,null,118]
[232,0.20366379310344829,1.7200854700854796E-2,5.9825584426223474E-3,1.9355336137895829E-3,2.3986288771841741E-2,1.4125693893735101E-2,462,7.9159797181697106E-2,5.639570823030704E-2,3.7506657986624566E-2,8.0418234316213181E-4,5.194434534427384E-4,3.7961079259396253E-4,5.1780532840939066E-3,3.2881072026800843E-3,2.0826380081436485E-3,232,null,232,null,232,462,null,null,119]
[233,0.20278969957081547,1.7119604114267113E-2,5.9546316251781386E-3,1.9264984669693978E-3,2.3873021156206365E-2,1.4058800315706367E-2,463,7.8960841504282522E-2,5.6253819346953324E-2,3.7410347982644865E-2,8.0211196928044724E-4,5.1812035285524172E-4,3.7864595076557271E-4,5.1648833537975801E-3,3.2798663324979287E-3,2.0773686663559492E-3,233,null,233,null,233,463,null,null,120]
[234,0.20192307692307696,1.7039117515366235E-2,5.9269643232634801E-3,1.9175472810558322E-3,2.3760818253343745E-2,1.399253731343281E-2,464,7.876288340710072E-2,5.6112642642972187E-2,3.7314531323598396E-2,8.0005222841225665E-4,5.1680397541519407E-4,3.7768600110404607E-4,5.1517802466975772E-3,3.2716666666666844E-3,2.0721259214983062E-3,234,null,234,null,234,464,null,null,121]
[235,0.20106382978723406,1.6959384179074336E-2,5.8995529362084994E-3,1.9086788911262793E-3,2.3649665121071535E-2,1.3926896012509748E-2,465,7.8565915405990033E-2,5.5972172769849907E-2,3.7219204228453692E-2,7.9800303885391838E-4,5.1549427000838384E-4,3.7673090649536036E-4,5.1387434554973832E-3,3.2635078969243734E-3,2.0669095727061937E-3,235,null,235,null,235,465,null,null,122]
[236,0.20021186440677968,1.6880393580127523E-2,5.8723939296470695E-3,1.8998921537093461E-3,2.3539547095503696E-2,1.3861867704280132E-2,466,7.8369930091466769E-2,5.5832404432495944E-2,3.7124362954718243E-2,7.9596431973672855E-4,5.1419118603743274E-4,3.7578063019996327E-4,5.1257724780224582E-3,3.2553897180763033E-3,2.0617194211326236E-3,236,null,236,null,236,466,null,null,123]
[237,0.19936708860759492,1.680213538844411E-2,5.8454838339976351E-3,1.8911859462933526E-3,2.3430449784601487E-2,1.3797443841982938E-2,467,7.817492012779606E-2,5.5693332388577627E-2,3.7030003797948824E-2,7.9393599101628342E-4,5.1289467341527923E-4,3.7483513584806106E-4,5.1128668171557578E-3,3.2473118279570073E-3,2.056555269922879E-3,237,null,237,null,237,467,null,null,124]
[238,0.19852941176470587,1.6724599464621133E-2,5.8188192429856136E-3,1.8825591668482869E-3,2.3322359061902938E-2,1.3733616037008459E-2,468,7.7980878252076655E-2,5.5554951447864619E-2,3.6936123091269098E-2,7.9191797346200279E-4,5.116046825587616E-4,3.7389438743497868E-4,5.1000259807742294E-3,3.2392739273927572E-3,2.0514169241896245E-3,238,null,238,null,238,468,null,null,125]
[239,0.19769874476987448,1.6647775855554988E-2,5.7923968122060594E-3,1.8740107333607837E-3,2.3215261060425145E-2,1.367037605525708E-2,469,7.7787797273339163E-2,5.5417256471583326E-2,3.6842717204894633E-2,7.8991018864681399E-4,5.1032116438229662E-4,3.7295834931658944E-4,5.0872494816862493E-3,3.2312757201646272E-3,2.046304190988391E-3,239,null,239,null,239,469,null,null,126]
[240,0.19687499999999999,1.6571654790182199E-2,5.7662132577253004E-3,1.8655395833817149E-3,2.3109142166733709E-2,1.3607715813598148E-2,470,7.7595670071657796E-2,5.5280242371780718E-2,3.6749782545665126E-2,7.879125589369914E-4,5.0904407029165363E-4,3.7202698620481304E-4,5.0745368375700161E-3,3.2233169129721037E-3,2.0412168792934247E-3,240,null,240,null,240,470,null,null,127]
[241,0.19605809128630705,1.6496226675336539E-2,5.7402653547203464E-3,1.8571446735859943E-3,2.3003989015174215E-2,1.3545627376425838E-2,471,7.7404489597275153E-2,5.5143904110697674E-2,3.6657315556583567E-2,7.8592500748215013E-4,5.0777335217782194E-4,3.711002631631811E-4,5.0618875709128449E-3,3.2153972153972335E-3,2.0361547999738954E-3,241,null,241,null,241,471,null,null,128]
[242,0.19524793388429754,1.6421482091718738E-2,5.7145499361548509E-3,1.8488249793442166E-3,2.2899788482260368E-2,1.3484102952308842E-2,472,7.7214248869739904E-2,5.5008236700151529E-2,3.6565312716362507E-2,7.8394745820539106E-4,5.0650896241096941E-4,3.7017814560246859E-4,5.0493012089513883E-3,3.207516339869299E-3,2.0311177657704573E-3,242,null,242,null,242,472,null,null,129]
[243,0.19444444444444445,1.6347411789975296E-2,5.689063891490518E-3,1.840579494305756E-3,2.279652768121404E-2,1.3423134890730958E-2,473,7.7024940977057268E-2,5.4873235200927691E-2,3.6473770538977011E-2,7.8197983579359376E-4,5.0525085383449156E-4,3.692605992763905E-4,5.0367772836127306E-3,3.1996740016300099E-3,2.0261055912721604E-3,243,null,243,null,243,473,null,null,130]
[244,0.19364754098360656,1.6274006686882919E-2,5.6638041654328295E-3,1.8324072299929742E-3,2.2694193956652349E-2,1.3362715678919716E-2,474,7.6836559074851846E-2,5.473889472218027E-2,3.6382685573224348E-2,7.8002206568785577E-4,5.0399897975914878E-4,3.6834759027736213E-4,5.0243153314563638E-3,3.1918699186992052E-3,2.0211180928936968E-3,244,null,244,null,244,474,null,null,131]
[245,0.19285714285714287,1.6201257861635315E-2,5.6387677567100395E-3,1.8243072154061893E-3,2.2592774879417184E-2,1.3302837938760257E-2,475,7.6649096385542723E-2,5.4605210420841398E-2,3.629205440229033E-2,7.7807407407407458E-4,5.0275329395729057E-4,3.6743908503232195E-4,5.011914893617026E-3,3.1841038118410564E-3,2.0161550888529887E-3,245,null,245,null,245,475,null,null,132]
[246,0.19207317073170735,1.6129156552229126E-2,5.6139517168844136E-3,1.8162784966390749E-3,2.2492258241542783E-2,1.324349442379181E-2,476,7.6462546197530679E-2,5.4472177501039255E-2,3.6201873643321995E-2,7.7613578787367034E-4,5.0151375065716564E-4,3.6653505029861681E-4,4.9995755157483711E-3,3.1763754045307626E-3,2.0112163991491006E-3,246,null,246,null,246,476,null,null,133]
[247,0.19129554655870448,1.6057694151945929E-2,5.5893531491947174E-3,1.8083201365041734E-3,2.2392632051357022E-2,1.3184678016284222E-2,477,7.6276901864397173E-2,5.4339791213524564E-2,3.6112139947006745E-2,7.7420713473444849E-4,5.0028030453731504E-4,3.6563545315994669E-4,4.9872967479674844E-3,3.1686844229217295E-3,2.0063018455404795E-3,247,null,247,null,247,477,null,null,134]
[248,0.19052419354838712,1.598686220592738E-2,5.5649692074290083E-3,1.8004312141682085E-3,2.2293884528712331E-2,1.3126381724392032E-2,478,7.6092156804115019E-2,5.4208046855105385E-2,3.6022849997157672E-2,7.7228804302159528E-4,4.9905291072104908E-4,3.6474026102237023E-4,4.9750781448002082E-3,3.161030595813223E-3,2.0014112515235102E-3,248,null,248,null,248,478,null,null,135]
[249,0.18975903614457834,1.5916652407840546E-2,5.5407970948267958E-3,1.7926108247969044E-3,2.2196004100342261E-2,1.3068598679383705E-2,479,7.5908304498270449E-2,5.4076939768090186E-2,3.5934000510305035E-2,7.7037844180880986E-4,4.978315247710039E-4,3.6384944161036781E-4,4.9629192651272601E-3,3.1534136546184925E-3,1.996544442311384E-3,249,null,{"$f":"IF($T$1=1,R131,IF($T$1=2,H131,IF($T$1=3,H131,IF($T$1=4,H131,IF($T$1=5,A131,IF($T$1=6,A131,IF($T$1=7,A131,IF($T$1=8,H131,IF($T$1=9,H131,IF($T$1=10,H131,IF($T$1=11,A131,IF($T$1=12,A131,IF($T$1=13,H131,IF($T$1=14,H131,IF($T$1=15,H131,IF($T$1=21,V131,IF($T$1=22,W131,0)))))))))))))))))","v":249},null,249,479,null,null,136]
[250,0.189,1.5847056596630799E-2,5.5168340630096973E-3,1.7848580792090196E-3,2.20989793953398E-2,1.3011322132943747E-2,480,7.5725338491296507E-2,5.3946465339738903E-2,3.5845588235293824E-2,7.684782608695656E-4,4.9661610268377909E-4,3.6296296296296261E-4,4.9508196721311532E-3,3.145833333333352E-3,1.9917012448132775E-3,250,null,250,null,250,480,null,null,137]
[251,0.18824701195219123,1.5778066753359434E-2,5.4930774109397205E-3,1.7771721035393217E-3,2.2002799240753799E-2,1.2954545454545449E-2,481,7.5543252389717361E-2,5.3816619001721959E-2,3.5757609952887112E-2,7.6658743066850205E-4,4.9540660088465312E-4,3.6208079342989831E-4,4.9387789332438845E-3,3.1382893685052145E-3,1.9868814876138315E-3,251,null,251,null,251,481,null,null,138]
[252,0.1875,1.5709674998123639E-2,5.4695244839043479E-3,1.76955203891023E-3,2.1907452657299858E-2,1.2898262128892102E-2,482,7.5362039861403704E-2,5.3687396229587146E-2,3.5670062475375401E-2,7.6470588235294165E-4,4.9420297622237552E-4,3.6120290166787207E-4,4.9267966200953802E-3,3.1307814992025704E-3,1.9820850009529254E-3,252,null,252,null,252,482,null,null,139]
[253,0.18675889328063242,1.5641873587056127E-2,5.44617267252761E-3,1.7619970411118736E-3,2.1812928855182299E-2,1.2842465753424653E-2,483,7.5181694634838661E-2,5.3558792542233988E-2,3.5582942646191558E-2,7.6283354774453298E-4,4.9300518596403521E-4,3.6032925663682252E-4,4.9148723084627014E-3,3.1233094669849033E-3,1.9773116167057479E-3,253,null,253,null,253,483,null,null,140]
[254,0.1860236220472441,1.5574654909402186E-2,5.4230194118063966E-3,1.7545062802903047E-3,2.171921723002377E-2,1.2787150035893752E-2,484,7.500221049839427E-2,5.3430803501395868E-2,3.549624733953146E-2,7.6097035933101549E-4,4.9181318779000362E-4,3.5945982759627131E-4,4.9030055782199721E-3,3.1158730158730346E-3,1.9725611683631536E-3,254,null,254,null,254,484,null,null,141]
[255,0.18529411764705883,1.5508011484671761E-2,5.4000621801712414E-3,1.7470789406436372E-3,2.1626307358899383E-2,1.2732308791994279E-2,485,7.482358129961833E-2,5.3303424711129366E-2,3.5409973459980142E-2,7.5911625025810493E-4,4.9062693978894933E-4,3.5859458410171752E-4,4.8911960132890439E-3,3.1084718923198918E-3,1.9678334910122985E-3,255,null,255,null,255,485,null,null,142]
[256,0.1845703125,1.5441935959864341E-2,5.3772984985708582E-3,1.7397142201258659E-3,2.1534188996472189E-2,1.2677935943060496E-2,486,7.4645800944531382E-2,5.3176651817310995E-2,3.5324117942143393E-2,7.5727115432149667E-4,4.8944640045292737E-4,3.5773349600108401E-4,4.879443201590861E-3,3.1011058451816931E-3,1.9631284213175609E-3,256,null,256,null,256,486,null,null,143]
[257,0.18385214007782102,1.5376421106764468E-2,5.3547259295797347E-3,1.7324113301581494E-3,2.144285207122696E-2,1.2624025513819985E-2,487,7.4468863396933732E-2,5.3050480507141111E-2,3.5238677750284671E-2,7.5543500595898617E-4,4.8827152867253671E-4,3.5687653343121489E-4,4.8677467349975282E-3,3.093774625689538E-3,1.9584457975017257E-3,257,null,257,null,257,487,null,null,144]
[258,0.18313953488372095,1.5311459819305847E-2,5.3323420765281166E-3,1.7251694953473317E-3,2.1352286681799497E-2,1.2570571630204658E-2,488,7.4292762677722224E-2,5.2924906508654765E-2,3.5153649877967305E-2,7.5360774024270296E-4,4.8710228373214845E-4,3.5602366681442325E-4,4.8561062092850752E-3,3.0864779874214027E-3,1.9537854593274467E-3,258,null,258,null,258,488,null,null,145]
[259,0.18243243243243246,1.5247045111001934E-2,5.3101445826537093E-3,1.7179879532114944E-3,2.1262483093398475E-2,1.2517568517217147E-2,489,7.4117492864216802E-2,5.2799925590239619E-2,3.5069031347701882E-2,7.5178929287145766E-4,4.8593862530520312E-4,3.5517486685508791E-4,4.8445212240868793E-3,3.0792156862745291E-3,1.9491472480789654E-3,259,null,259,null,259,489,null,null,146]
[260,0.18173076923076925,1.5183170112441153E-2,5.2881311302744975E-3,1.7108659539123374E-3,2.1173431734317263E-2,1.2465010496850948E-2,490,7.3943048089496435E-2,5.2675533560160546E-2,3.498481921059865E-2,7.499796001631992E-4,4.8478051344957342E-4,3.5433010453629952E-4,4.8329913828477726E-3,3.071987480438204E-3,1.9445310065440947E-3,260,null,260,null,260,490,null,null,147]
[261,0.18103448275862072,1.5119828068844796E-2,5.2662994399820294E-3,1.7038027599941858E-3,2.1085123192533039E-2,1.241289198606272E-2,491,7.3769422541744553E-2,5.2551726266091024E-2,3.4901010546024971E-2,7.4817859904758081E-4,4.8362790860299485E-4,3.534893511165536E-4,4.8215162927787878E-3,3.0647931303669201E-3,1.9399365789964558E-3,261,null,261,null,261,491,null,null,148]
[262,0.18034351145038172,1.5057012337685787E-2,5.2446472698546298E-3,1.6967976461294389E-3,2.0997548212390596E-2,1.2361207494795284E-2,492,7.3596610463603551E-2,5.2428499594651151E-2,3.4817602461267687E-2,7.4638622705863289E-4,4.8248077157856024E-4,3.5265257812649092E-4,4.8100955648125556E-3,3.0576323987539134E-3,1.9353638111779664E-3,262,null,262,null,262,492,null,null,149]
[263,0.17965779467680609,1.4994716386366579E-2,5.2231724146899194E-3,1.6898498988702681E-3,2.091069769136852E-2,1.2309951624049763E-2,493,7.3424606151538466E-2,5.2305849470951987E-2,3.4734592091200264E-2,7.4460242232754124E-4,4.8133906356027885E-4,3.5181975736568407E-4,4.7987288135593322E-3,3.05050505050507E-3,1.9308125502815764E-3,263,null,263,null,263,493,null,null,150]
[264,0.17897727272727273,1.4932933789954431E-2,5.2018727052561275E-3,1.6829588164063943E-3,2.0824562676925229E-2,1.2259119064005512E-2,494,7.325340395520942E-2,5.2183771858146454E-2,3.4651976597954749E-2,7.4282712357552779E-4,4.8020274609869823E-4,3.5099086089946936E-4,4.7874156572636469E-3,3.0434108527131977E-3,1.9262826449342467E-3,264,null,264,null,264,494,null,null,151]
[265,0.17830188679245282,1.4871658228972471E-2,5.1807460075616405E-3,1.6761237083287659E-3,2.0739134363422711E-2,1.2208704592186434E-2,495,7.3082998276852967E-2,5.206226275698643E-2,3.4569753170598357E-2,7.410602701068338E-4,4.7907178110658764E-4,3.5016586105582359E-4,4.776155717761567E-3,3.0363495746326568E-3,1.9217739451801662E-3,265,null,265,null,265,495,null,null,152]
[266,0.17763157894736842,1.4810883487244899E-2,5.1597902221422803E-3,1.6693438953989731E-3,2.0654404089125583E-2,1.2158703071672362E-2,496,7.2913383570671911E-2,5.1941318205385972E-2,3.448791902481467E-2,7.3930180180180219E-4,4.7794613085468297E-4,3.4934473042228431E-4,4.7649486204385579E-3,3.0293209876543405E-3,1.9172863024642043E-3,266,null,266,null,266,496,null,null,153]
[267,0.17696629213483148,1.4750603449794833E-2,5.1390032833658157E-3,1.6626187093242344E-3,2.0570363333273504E-2,1.2109109449354189E-2,497,7.274455434223373E-2,5.1820934277990761E-2,3.4406471402589338E-2,7.3755165911005942E-4,4.768257579674907E-4,3.4852744184291399E-4,4.7537939941879343E-3,3.0223248652810047E-3,1.9128195696155967E-3,267,null,267,null,267,497,null,null,154]
[268,0.17630597014925373,1.4690812100793241E-2,5.1183831587532065E-3,1.6559474925378023E-3,2.0487003713224716E-2,1.2059918754231558E-2,498,7.2576505147877265E-2,5.170110708575331E-2,3.4325407571900252E-2,7.3580978304379205E-4,4.7571062541915127E-4,3.4771396841530615E-4,4.7426914713699069E-3,3.0153609831029379E-3,1.9083736008318549E-3,268,null,268,null,268,498,null,null,155]
[269,0.17565055762081785,1.4631503521557617E-2,5.0979278483161382E-3,1.6493295979846329E-3,2.0404316981668752E-2,1.2011126095751863E-2,499,7.2409230594127613E-2,5.1581832775514223E-2,3.4244724826412033E-2,7.3407611517111978E-4,4.7460069652936071E-4,3.4690428348763342E-4,4.7316406877711834E-3,3.0084291187739659E-3,1.9039482516629033E-3,269,null,269,null,269,499,null,null,156]
[270,0.17500000000000002,1.4572671888598874E-2,5.0776353839103588E-3,1.6427643889121749E-3,2.0322295023906419E-2,1.1962726662189399E-2,500,7.2242725337119118E-2,5.1463107529589221E-2,3.4164420485174894E-2,7.323505976095622E-4,4.7349593495934789E-4,3.4609836065573713E-4,4.7206412825651417E-3,3.0015290519877871E-3,1.8995433789954334E-3,270,null,270,null,270,500,null,null,157]
[271,0.17435424354243545,1.4514311471715216E-2,5.0575038286044252E-3,1.6362512386661372E-3,2.0240929855195083E-2,1.1914715719063555E-2,501,7.2076984082026299E-2,5.1344927565361714E-2,3.4084491892327651E-2,7.3063317301959589E-4,4.7239630470790976E-4,3.452961737602566E-4,4.7096928982725645E-3,2.9946605644546342E-3,1.8951588410374776E-3,271,null,271,null,271,501,null,null,158]
[272,0.17371323529411767,1.4456416632131602E-2,5.037531276063374E-3,1.6297895304910916E-3,2.0160213618157466E-2,1.1867088607594948E-2,502,7.1912001582502633E-2,5.1227289134881178E-2,3.4004936416804972E-2,7.2892378459830324E-4,4.7130177010749961E-4,3.4449769688379923E-4,4.6987951807229032E-3,2.9878234398782542E-3,1.8907944973031937E-3,272,null,272,null,272,502,null,null,159]
[273,0.1730769230769231,1.439898182068358E-2,5.017715849946972E-3,1.6233786573357854E-3,2.0080138580252236E-2,1.1819840743198419E-2,503,7.1747772640126911E-2,5.111018852446686E-2,3.3925751452048618E-2,7.2722237607311039E-4,4.7021229582037125E-4,3.4370290434814903E-4,4.6879477790160926E-3,2.9810174639332012E-3,1.8864502085978595E-3,273,null,273,null,273,503,null,null,160]
[274,0.17244525547445258,1.4342001576044221E-2,4.9980557033220902E-3,1.617018021663029E-3,2.0000697131304604E-2,1.177296761401191E-2,504,7.1584292103857236E-2,5.0993622054317032E-2,3.3846934415722826E-2,7.2552889169561147E-4,4.6912784683477592E-4,3.4291177071151387E-4,4.6771503454848835E-3,2.9742424242424439E-3,1.8821258370030763E-3,274,null,274,null,274,504,null,null,161]
[275,0.17181818181818184,1.4285470522993012E-2,4.9785490180888426E-3,1.6107070352640374E-3,1.9921881781095312E-2,1.1726464779460185E-2,505,7.1421554869492601E-2,5.0877586078123524E-2,3.3768482749433545E-2,7.2384327623547986E-4,4.6804838846121137E-4,3.42124270765811E-4,4.6664025356576988E-3,2.9674981103552729E-3,1.8778212458621724E-3,275,null,275,null,275,505,null,null,162]
[276,0.17119565217391305,1.4229383370725499E-2,4.9591940044201215E-3,1.6044451190770981E-3,1.9843685157006422E-2,1.1680327868852473E-2,506,7.125955587914147E-2,5.0762076982691494E-2,3.3690393918451654E-2,7.2216547497446425E-4,4.6697388632872339E-4,3.4134037953398923E-4,4.6557040082220074E-3,2.9607843137255097E-3,1.8735362997658077E-3,276,null,276,null,276,506,null,null,163]
[277,0.17057761732851986,1.4173734911202624E-2,4.9399889002141413E-3,1.5982317030104574E-3,1.9766100001722308E-2,1.1634552580013077E-2,507,7.109829012069796E-2,5.0647091187564434E-2,3.3612665411439924E-2,7.2049543370046685E-4,4.6590430638125707E-4,3.4056007226738864E-4,4.6450544249881818E-3,2.9541008276900123E-3,1.8692708645377746E-3,277,null,277,null,277,507,null,null,164]
[278,0.16996402877697842,1.4118520017538628E-2,4.9209319705596647E-3,1.5920662257693033E-3,1.9689119170984377E-2,1.1589134677944063E-2,508,7.0937752627324768E-2,5.0532625144654154E-2,3.3535294740183831E-2,7.1883309870170544E-4,4.6483961487405942E-4,3.3978332444313579E-4,4.6344534508538735E-3,2.9474474474474673E-3,1.8650248072209932E-3,278,null,278,null,278,508,null,null,165]
[279,0.16935483870967744,1.4063733642426472E-2,4.9020215072135519E-3,1.5859481346867375E-3,1.9612735631398072E-2,1.1544069993519134E-2,509,7.0777938476943358E-2,5.0418675337875862E-2,3.3458279439326034E-2,7.1717841676095405E-4,4.6377977837013028E-4,3.390101117615746E-4,4.6239007537688583E-3,2.9408239700374731E-3,1.8607979960636963E-3,279,null,279,null,279,509,null,null,166]
[280,0.16875000000000001,1.4009370816599824E-2,4.8832558280903163E-3,1.5798768855586319E-3,1.9536942458290695E-2,1.1499354422207892E-2,510,7.0618842791730863E-2,5.0305238282788191E-2,3.3381617066104506E-2,7.1553133514986429E-4,4.6272476373672157E-4,3.3824041014373274E-4,4.6133960047003665E-3,2.9342301943199004E-3,1.8565903005058016E-3,280,null,280,null,280,510,null,null,167]
[281,0.16814946619217083,1.3955426647330524E-2,4.8646332767633554E-3,1.5738519424822622E-3,1.9461732833618729E-2,1.1454983922829599E-2,511,7.0460460737623812E-2,5.0192310526237911E-2,3.3305305200094282E-2,7.138918016233645E-4,4.6167453814188514E-4,3.3747419572882148E-4,4.6029388775988885E-3,2.9276659209545313E-3,1.8524015911654691E-3,281,null,281,null,281,511,null,null,168]
[282,0.16755319148936171,1.3901896316960672E-2,4.8461522219775486E-3,1.5678727776986189E-3,1.9387100043923293E-2,1.1410954516335699E-2,512,7.0302787523828542E-2,5.0079888646009665E-2,3.3229341442952705E-2,7.1225976441413564E-4,4.6062906905106651E-4,3.3671144487177078E-4,4.5925290493644376E-3,2.9211309523809723E-3,1.8482317398258394E-3,282,null,282,null,282,512,null,null,169]
[283,0.16696113074204949,1.384877508146834E-2,4.8278110571729335E-3,1.5619388714383021E-3,1.9313037478332497E-2,1.1367262284620311E-2,513,7.0145818402338106E-2,4.9967969250480151E-2,3.3153723418168184E-2,7.1063517222716248E-4,4.5958832422374521E-4,3.3595213414079611E-4,4.5821661998132731E-3,2.9146250927988321E-3,1.8440806194219513E-3,283,null,283,null,283,513,null,null,170]
[284,0.16637323943661972,1.3796058269066073E-2,4.8096082000191427E-3,1.5560497117708993E-3,1.9239538626609366E-2,1.1323903369357935E-2,514,6.99895486674557E-2,4.9856548978277099E-2,3.3078448770812355E-2,7.0901797423435979E-4,4.5855227171012113E-4,3.3519624031499989E-4,4.5718500116450735E-3,2.9081481481481679E-3,1.8399481040278348E-3,284,null,284,null,284,514,null,null,171]
[285,0.16578947368421054,1.3743741278831248E-2,4.7915420919603493E-3,1.5502047944577599E-3,1.9166597077244184E-2,1.1280873970867657E-2,515,6.9833973655324427E-2,4.9745624497942773E-2,3.3003515167295612E-2,7.0740812006927123E-4,4.5752087984784421E-4,3.344437403820034E-4,4.5615801704105494E-3,2.90169992609019E-3,1.8358340688437772E-3,285,null,285,null,285,515,null,null,172]
[286,0.16520979020979024,1.3691819579367506E-2,4.7736111977704125E-3,1.5444036228080748E-3,1.9094206515590087E-2,1.1238170347003173E-2,516,6.9679088743463263E-2,4.9635192507601858E-2,3.2928920295125938E-2,7.0580555982184046E-4,4.5649411725878943E-4,3.3369461153561218E-4,4.5513563644794964E-3,2.8952802359882204E-3,1.8317383901837608E-3,286,null,286,null,286,516,null,null,173]
[287,0.16463414634146342,1.3640288707496383E-2,4.7558140051179951E-3,1.5386457075381749E-3,1.9022360722040731E-2,1.1195788812067902E-2,517,6.952488935030933E-2,4.9525249734633917E-2,3.2854661862671081E-2,7.0421024403325338E-4,4.5547195284587478E-4,3.3294883117351181E-4,4.5411782850092687E-3,2.8888888888889087E-3,1.8276609454630657E-3,287,null,287,null,287,517,null,null,174]
[288,0.16406250000000003,1.3589144266978406E-2,4.7381490241413518E-3,1.5329305666339666E-3,1.8951053570248951E-2,1.1153725735754561E-2,518,6.937137093476603E-2,4.941579293535002E-2,3.2780737598923804E-2,7.0262212369084985E-4,4.5445435578992158E-4,3.3220637689499442E-4,4.5310456259136881E-3,2.882525697503691E-3,1.8236016131860423E-3,288,null,288,null,288,518,null,null,175]
[289,0.16349480968858132,1.3538381927262821E-2,4.7206147870325716E-3,1.5272577252164203E-3,1.8880279025385312E-2,1.1111977542108568E-2,519,6.9218528995757325E-2,4.9306818894673789E-2,3.2707145253270398E-2,7.0104115022310404E-4,4.5344129554655702E-4,3.3146722649871622E-4,4.5209580838323519E-3,2.8761904761904961E-3,1.8195602729340406E-3,289,null,289,null,289,519,null,null,176]
[290,0.16293103448275861,1.3487997422265275E-2,4.7032098476310182E-3,1.5216267154100353E-3,1.8810031142435589E-2,1.1070540708514627E-2,520,6.906635907178782E-2,4.9198324425826639E-2,3.2633882595262301E-2,6.9946727549467325E-4,4.5243274184315804E-4,3.3073135798048441E-4,4.5109153581003609E-3,2.8698830409356925E-3,1.8155368053535056E-3,290,null,290,null,290,520,null,null,177]
[291,0.16237113402061856,1.3437986549172654E-2,4.6859327810257227E-3,1.5160370762142045E-3,1.874030406453607E-2,1.1029411764705906E-2,521,6.8914856740508651E-2,4.9090306370017024E-2,3.2560947414390716E-2,6.9790045180151156E-4,4.5142866467583583E-4,3.299987495310733E-4,4.5009171507184509E-3,2.8636032093362711E-3,1.8115310921442253E-3,291,null,291,null,291,521,null,null,178]
[292,0.16181506849315069,1.3388345167274445E-2,4.6687821831665156E-3,1.5104883533774019E-3,1.8671092021345752E-2,1.0988587291795211E-2,522,6.8764017618289042E-2,4.8982761596133982E-2,3.2488337519864345E-2,6.9634063186605095E-4,4.5042903430646069E-4,3.2926937953407044E-4,4.490963166323512E-3,2.8573508005822618E-3,1.8075430160477374E-3,292,null,292,null,292,522,null,null,179]
[293,0.1612627986348123,1.3339069196819873E-2,4.6517566704836616E-3,1.5049800992741258E-3,1.8602389327454494E-2,1.0948063921327621E-2,523,6.8613837359793539E-2,4.8875687000444534E-2,3.2416050740389953E-2,6.9478776883244561E-4,4.4943382125972565E-4,3.2854322656374963E-4,4.4810531121595052E-3,2.8511256354393812E-3,1.8035724608358864E-3,293,null,293,null,293,523,null,null,180]
[294,0.16071428571428573,1.3290154617900207E-2,4.6348548795157951E-3,1.499511872784522E-3,1.8534190380826175E-2,1.0907838334353975E-2,524,6.8464311657564711E-2,4.8769079506295082E-2,3.234408492395599E-2,6.9324181626188007E-4,4.4844299632024989E-4,3.2782026938297371E-4,4.4711866980487605E-3,2.8449275362319041E-3,1.7996193112995325E-3,294,null,294,null,294,524,null,null,181]
[295,0.16016949152542373,1.3241597469355567E-2,4.6180754665459244E-3,1.4940832391766227E-3,1.8466489661275974E-2,1.0867907260524735E-2,525,6.8315436241611349E-2,4.8662936063816803E-2,3.2272437937619032E-2,6.9170272812794031E-4,4.4745653052971927E-4,3.2710048694112347E-4,4.4613636363636531E-3,2.8387563268257613E-3,1.7956834532374098E-3,295,null,295,null,295,525,null,null,182]
[296,0.1596283783783784,1.3193393847705586E-2,4.6014171072453289E-3,1.4886937699911357E-3,1.8399281728980876E-2,1.0828267477203673E-2,526,6.816720687900199E-2,4.8557253649634716E-2,3.2201107667293005E-2,6.9017045881204526E-4,4.4647439518406568E-4,3.2638385837205515E-4,4.4515836419986568E-3,2.8326118326118528E-3,1.7917647734451269E-3,296,null,296,null,296,526,null,null,183]
[297,0.15909090909090912,1.3145539906103378E-2,4.5848784963251213E-3,1.4833430429287155E-3,1.8332561223022653E-2,1.0788915808600873E-2,527,6.801961937346368E-2,4.8452029266580675E-2,3.2130092017541315E-2,6.8864496309894031E-4,4.4549656183068254E-4,3.2567036299208346E-4,4.4418464323427538E-3,2.8264938804895817E-3,1.7878631597043147E-3,297,null,297,null,297,527,null,null,184]
[298,0.15855704697986578,1.3098031853312146E-2,4.5684583471953082E-3,1.4780306417396586E-3,1.826632285996236E-2,1.0749849124924589E-2,528,6.7872669564986082E-2,4.8347259943410013E-2,3.205938891137159E-2,6.8712619617224927E-4,4.4452300226567723E-4,3.2495998029799197E-4,4.432151727252219E-3,2.8204022988505954E-3,1.7839785007719134E-3,298,null,298,null,298,528,null,null,185]
[299,0.15802675585284282,1.305086595270395E-2,4.5521553916311481E-3,1.4727561561159598E-3,1.8200561432445646E-2,1.0711064341551439E-2,529,6.7726353329430541E-2,4.824294273452185E-2,3.1988996290033246E-2,6.8561411361008594E-4,4.4355368853115956E-4,3.2425268996506904E-4,4.4224992490237485E-3,2.8143369175627447E-3,1.780110686369601E-3,299,null,299,null,299,529,null,null,186]
[300,0.15750000000000003,1.300403852127999E-2,4.5359683794466204E-3,1.4675191815856714E-3,1.8135271807838103E-2,1.0672558418214526E-2,530,6.758066657814428E-2,4.8139074719683088E-2,3.191891211281761E-2,6.841086713807225E-4,4.4258859291256529E-4,3.2354847184516938E-4,4.4128887223679461E-3,2.8082975679542409E-3,1.7762596071733559E-3,300,null,300,null,300,530,null,null,187]
[301,null,1.2957545928711919E-2,4.5198960781748501E-3,1.46231931940951E-3,1.8070448926889873E-2,1.0634328358208982E-2,531,6.7435605257579592E-2,4.803565300375584E-2,3.1849134356860744E-2,6.8260982583831617E-4,4.4162768793601462E-4,3.2284730596480099E-4,4.4033198743831494E-3,2.8022840827980223E-3,1.7724251548031584E-3,null,null,301,null,301,531,null,null,188]
[302,null,1.2911384596403654E-2,4.5039372727552858E-3,1.4571561764796515E-3,1.800608780242877E-2,1.0596371207614544E-2,532,6.729116534891777E-2,4.7932674716428508E-2,3.1779661016948825E-2,6.8111753371869041E-4,4.4067094636570547E-4,3.2214917252323646E-4,4.3937924345296012E-3,2.7962962962963171E-3,1.7686072218128222E-3,null,null,302,null,302,532,null,null,189]
[303,null,1.2865550996573169E-2,4.4880907652275004E-3,1.452029365220662E-3,1.7942183518081255E-2,1.0558684054534705E-2,533,6.714734286769812E-2,4.7830137011950193E-2,3.1710490105326034E-2,6.796317521351726E-4,4.3971834120133977E-4,3.2145405189064932E-4,4.3843061346039497E-3,2.7903340440654082E-3,1.7648057016799591E-3,null,null,303,null,303,533,null,null,190]
[304,null,1.2820041651353758E-2,4.4723553744314146E-3,1.4469385034925166E-3,1.787873122702055E-2,1.0521264028352066E-2,534,6.700413386345147E-2,4.7728037068868551E-2,3.1641619651504992E-2,6.7815243857448576E-4,4.3876984567558391E-4,3.2076192460627433E-4,4.3748607087140817E-3,2.7843971631205883E-3,1.7610204887960712E-3,null,null,304,null,304,534,null,null,191]
[305,null,1.2774853131914333E-2,4.4567299357138185E-3,1.4418832144956473E-3,1.7815726150741212E-2,1.048410829899944E-2,535,6.6861534419338509E-2,4.7626372089771052E-2,3.1573047702079637E-2,6.7667955089269324E-4,4.3782543325156118E-4,3.2007277137659088E-4,4.3654558932542812E-3,2.7784854918613089E-3,1.7572514784567725E-3,null,null,305,null,305,535,null,null,192]
[306,null,1.2729982057598239E-2,4.4412133006410176E-3,1.4368631266779761E-3,1.775316357785952E-2,1.0447214076246363E-2,536,6.6719540651792655E-2,4.7525139301029432E-2,3.1504772320540539E-2,6.7521304731119655E-4,4.3688507762037695E-4,3.1938657307353075E-4,4.3560914268807056E-3,2.772598870056518E-3,1.7534985668521328E-3,null,null,306,null,306,536,null,null,193]
[307,null,1.2685425095080168E-2,4.4258043367174562E-3,1.431877873643883E-3,1.7691038862939077E-2,1.0410578609000614E-2,537,6.657814871016754E-2,4.742433595254749E-2,3.1436791587092609E-2,6.7375288641278509E-4,4.3594875269867609E-4,3.1870331073270778E-4,4.3467670504871757E-3,2.766737138830183E-3,1.7497616510571475E-3,null,null,307,null,307,537,null,null,194]
[308,null,1.2641178957540706E-2,4.4105019271101923E-3,1.4269270940650621E-3,1.762934742534096E-2,1.0374199184624375E-2,538,6.6437354776388888E-2,4.7323959317512043E-2,3.1369103598475147E-2,6.7229902713773738E-4,4.3501643262623067E-4,3.1802296555167149E-4,4.3374825071812815E-3,2.7609001406469968E-3,1.7460406290223289E-3,null,null,308,null,308,538,null,null,195]
[309,null,1.2597240403858106E-2,4.3953049703790523E-3,1.4220104315932228E-3,1.7568084748097838E-2,1.0338073128264685E-2,539,6.6297155064610869E-2,4.7224006692147026E-2,3.1301706467784227E-2,6.7085142877997212E-4,4.340880917635596E-4,3.1734551888818168E-4,4.328237542260787E-3,2.7550877192982666E-3,1.7423353995644159E-3,null,null,309,null,309,539,null,null,196]
[310,null,1.2553606237816853E-2,4.3802123802123586E-3,1.4171275347745866E-3,1.750724637681152E-2,1.0302197802197833E-2,540,6.6157545820876754E-2,4.712447539547078E-2,3.1234598324297359E-2,6.6941005098324882E-4,4.3316370468957788E-4,3.166709522585059E-4,4.3190319031903386E-3,2.7492997198879762E-3,1.7386458623572022E-3,null,null,310,null,310,540,null,null,197]
[311,null,1.2510273307332615E-2,4.3652230851680719E-3,1.4122780569661409E-3,1.7446827918573285E-2,1.0266570605187351E-2,541,6.6018523322783795E-2,4.7025362769056264E-2,3.1167777313300386E-2,6.6797485373741822E-4,4.3224324619927637E-4,3.1599924733573855E-4,4.3098653395784742E-3,2.7435359888190285E-3,1.734971917922482E-3,null,null,311,null,311,541,null,null,198]
[312,null,1.2467238503693202E-2,4.350336028420239E-3,1.4074616562536066E-3,1.7386825040906537E-2,1.0231188971855288E-2,542,6.5880083879152521E-2,4.6926666176794439E-2,3.1101241595916637E-2,6.6654579737471947E-4,4.3132669130143114E-4,3.1533038594814091E-4,4.3007376031549164E-3,2.7377963737796585E-3,1.7313134676211085E-3,null,null,312,null,312,542,null,null,199]
[313,null,1.242449876081513E-2,4.3355501675106066E-3,1.4026779953710787E-3,1.7327233470731153E-2,1.0196050372066431E-2,543,6.5742223829699908E-2,4.6828383004660516E-2,3.1034989348938238E-2,6.6512284256612557E-4,4.3041401521634105E-4,3.146643500775025E-4,4.2916484477481618E-3,2.7320807237300139E-3,1.7276704136441662E-3,null,null,{"$f":"IF($T$1=1,R195,IF($T$1=2,H195,IF($T$1=3,H195,IF($T$1=4,H195,IF($T$1=5,A195,IF($T$1=6,A195,IF($T$1=7,A195,IF($T$1=8,H195,IF($T$1=9,H195,IF($T$1=10,H195,IF($T$1=11,A195,IF($T$1=12,A195,IF($T$1=13,H195,IF($T$1=14,H195,IF($T$1=15,H195,IF($T$1=21,V195,IF($T$1=22,W195,0)))))))))))))))))","v":313},null,313,543,null,null,200]
[314,null,1.2382051054515425E-2,4.3208644741052878E-3,1.3979267416222992E-3,1.7268048993349105E-2,1.0161152310325189E-2,544,6.5604939544716911E-2,4.6730510660483164E-2,3.0969018764659562E-2,6.6370595031773596E-4,4.2950519337359508E-4,3.140011218575231E-4,4.2825976292633471E-3,2.7263888888889097E-3,1.7240426590042547E-3,null,null,314,null,314,544,null,null,201]
[315,null,1.2339892401798305E-2,4.3062779337563516E-3,1.3932075668035256E-3,1.7209267451450776E-2,1.0126492325184797E-2,545,6.5468227424749795E-2,4.6633046573716669E-2,3.0903328050712827E-2,6.6229508196721364E-4,4.2860020140986736E-4,3.1334068357221506E-4,4.2735849056603978E-3,2.7207207207207416E-3,1.7204301075268815E-3,null,null,315,null,315,545,null,null,202]
[316,null,1.2298019860156384E-2,4.2917895456682257E-3,1.3885201471279553E-3,1.7150884744141486E-2,1.0092067988668588E-2,546,6.5332083900285609E-2,4.6535988195215816E-2,3.0837915429905761E-2,6.6089019918026952E-4,4.2769901516673964E-4,3.126830176543262E-4,4.2646100369324565E-3,2.7150760719225659E-3,1.7168326638419631E-3,null,null,316,null,316,546,null,null,203]
[317,null,1.2256430526886058E-2,4.2773983224688051E-3,1.3838641631516721E-3,1.7092896825987802E-2,1.0057876905703027E-2,547,6.5196505431441495E-2,4.6439332997013701E-2,3.0772779140061338E-2,6.5949126394718963E-4,4.2680161068855217E-4,3.1202810668378182E-4,4.2556727850845705E-3,2.7094547964113392E-3,1.7132502333754322E-3,null,null,317,null,317,547,null,null,204]
[318,null,1.2215121538416732E-2,4.2631032899851443E-3,1.3792392997010762E-3,1.7035299706083112E-2,1.0023916713562217E-2,548,6.506148850765793E-2,4.6343078472102214E-2,3.070791743385954E-2,6.5809823857940761E-4,4.259079642202806E-4,3.1137593338614688E-4,4.2467729141126625E-3,2.7038567493113158E-3,1.7096827223409498E-3,null,null,318,null,318,548,null,null,205]
[319,null,1.2174090069653564E-2,4.2489034870236368E-3,1.3746452458017649E-3,1.6978089447132028E-2,9.9901850813236461E-3,549,6.4927029647395634E-2,4.6247222134215282E-2,3.06433285786811E-2,6.567110857061203E-4,4.2501805220543999E-4,3.1072648063110685E-4,4.2379101899827501E-3,2.6982817869416016E-3,1.7061300377317215E-3,null,null,319,null,319,549,null,null,206]
[320,null,1.2133333333333421E-2,4.2347979651545667E-3,1.3700816946088305E-3,1.6921262164553155E-2,9.9566797093348595E-3,550,6.479312539783641E-2,4.6151761517614846E-2,3.0579010856453228E-2,6.5532976827094519E-4,4.2413185128401513E-4,3.1007973143096825E-4,4.2290843806104339E-3,2.6927297668038618E-3,1.7025920873124146E-3,null,null,320,null,320,550,null,null,207]
[321,null,1.209284857939371E-2,4.2207857885009472E-3,1.3655483433385415E-3,1.6864814025599879E-2,9.9233983286908418E-3,551,6.4659772334587473E-2,4.6056694176879368E-2,3.0514962563497276E-2,6.5395424952862118E-4,4.2324933829041602E-4,3.0943566893917716E-4,4.220295255840641E-3,2.6872005475701783E-3,1.6990687796111744E-3,null,null,321,null,321,551,null,null,208]
[322,null,1.2052633094353834E-2,4.2068660335315249E-3,1.3610448932013755E-3,1.6808741248498623E-2,9.8903387007218558E-3,552,6.4526967061389676E-2,4.5962017686695063E-2,3.0451182010378296E-2,6.5258449304175E-4,4.2237049025146012E-4,3.0879427644885636E-4,4.211542587427613E-3,2.6816939890710592E-3,1.6955600239117437E-3,null,null,322,null,322,552,null,null,209]
[323,null,1.2012684200708909E-2,4.1930377888578811E-3,1.3565710493363733E-3,1.6753040101604281E-2,9.8574986164914578E-3,553,6.4394706209829067E-2,4.5867729641649618E-2,3.0387667521756524E-2,6.5122046267757875E-4,4.2149528438437805E-4,3.0815553739136129E-4,4.2028261490151516E-3,2.6762099522835928E-3,1.6920657302456747E-3,null,null,323,null,323,553,null,null,210]
[324,null,1.1972999256335536E-2,4.17930015503551E-3,1.3521265207467824E-3,1.6697706902572385E-2,9.8248758963045031E-3,554,6.4262986439052122E-2,4.5773827656028485E-2,3.0324417436240644E-2,6.4986212260482274E-4,4.2062369809484535E-4,3.0751943533485261E-4,4.1941457161171081E-3,2.6707482993197488E-3,1.6885858093846401E-3,null,null,324,null,324,554,null,null,211]
[325,null,1.1933575653909288E-2,4.1656522443687975E-3,1.3477110202369641E-3,1.6642738017547599E-2,9.7924683892248853E-3,555,6.413180443548451E-2,4.5680309363613683E-2,3.0261430106242965E-2,6.4850943729052803E-4,4.1975570897503808E-4,3.0688595398288782E-4,4.185501066098103E-3,2.6653088934148208E-3,1.6851201728328379E-3,null,null,325,null,325,555,null,null,212]
[326,null,1.1894410820333675E-2,4.1520931807198166E-3,1.3433242643505288E-3,1.6588129860368232E-2,9.760273972602776E-3,556,6.4001156912553134E-2,4.5587172417485007E-2,3.0198703897836333E-2,6.4716237149697268E-4,4.188912948017123E-4,3.0625507717302894E-4,4.1768919781545013E-3,2.6598915989160103E-3,1.6816687328194896E-3,null,null,326,null,326,556,null,null,213]
[327,null,1.1855502216180326E-2,4.1386220993208265E-3,1.3389659733096795E-3,1.6533878891786292E-2,9.7282905516111792E-3,557,6.3871040610411753E-2,4.5494414489823755E-2,3.0136237190612869E-2,6.4582089027860775E-4,4.1803043353430774E-4,3.0562678887546829E-4,4.1683182332956058E-3,2.6544962812711501E-3,1.6782314022914312E-3,null,null,327,null,327,557,null,null,214]
[328,null,1.1816847335140103E-2,4.1252381465904358E-3,1.3346358709557292E-3,1.6479981618702896E-2,9.6965160587915451E-3,558,6.3741452295669798E-2,4.5402033271718711E-2,3.0074028377544415E-2,6.4448495897903428E-4,4.1717310331307409E-4,3.0500107319167088E-4,4.1597796143250914E-3,2.649122807017565E-3,1.6748080949057918E-3,null,null,328,null,328,558,null,null,215]
[329,null,1.1778443703484942E-2,4.1119404799532929E-3,1.3303336846907713E-3,1.6426434593418474E-2,9.6649484536082842E-3,559,6.361238876112453E-2,4.5310026472974614E-2,3.0012075864844719E-2,6.4315454322801916E-4,4.1631928245722103E-4,3.0437791435303306E-4,4.1512759058226645E-3,2.643771043771065E-3,1.6713987250227672E-3,null,null,329,null,329,559,null,null,216]
[330,null,1.1740288879540121E-2,4.098728267663279E-3,1.3260591454204726E-3,1.637323441289763E-2,9.6335857220119364E-3,560,6.3483846825496459E-2,4.5218391821922936E-2,2.9950378071833345E-2,6.4182960893854803E-4,4.1546894946309051E-4,3.0375729671955814E-4,4.1428068941259458E-3,2.6384408602150747E-3,1.668003207698476E-3,null,null,330,null,330,560,null,null,217]
[331,null,1.1702380453166801E-2,4.0856006886300774E-3,1.321811987497966E-3,1.6320377718048194E-2,9.6024258760108189E-3,561,6.3355823333167985E-2,4.5127127065234821E-2,2.9888933430801214E-2,6.4051012230391358E-4,4.1462208300235126E-4,3.0313920477854786E-4,4.1343723673125761E-3,2.6331321260898936E-3,1.664621458677906E-3,null,null,331,null,331,561,null,null,218]
[332,null,1.1664716045254502E-2,4.072556932249078E-3,1.3175919486688194E-3,1.6267861193014217E-2,9.5714669532509788E-3,562,6.3228315153925144E-2,4.5036229967736485E-2,2.9827740386877848E-2,6.3919604979484031E-4,4.1377866192021602E-4,3.0252362314330981E-4,4.1259721151825357E-3,2.6278447121820827E-3,1.661253394387945E-3,null,null,332,null,332,562,null,null,219]
[333,null,1.1627293307223396E-2,4.0595961982345273E-3,1.3133987700170529E-3,1.6215681564482554E-2,9.540707016604217E-3,563,6.3101319182702481E-2,4.4945698312226674E-2,2.9766797397900176E-2,6.3788735815664428E-4,4.1293866523367935E-4,3.0191053655188079E-4,4.1176059292406886E-3,2.6225784903139825E-3,1.6578989319304955E-3,null,null,333,null,333,563,null,null,220]
[334,null,1.1590109920536121E-2,4.0467176964558479E-3,1.3092321959121862E-3,1.6163835601002773E-2,9.5101441537640535E-3,564,6.2974832339330988E-2,4.4855529899296413E-2,2.970610293428301E-2,6.3658401440642792E-4,4.1210207212977819E-4,3.0129992986576516E-4,4.1092736026795296E-3,2.6173333333333543E-3,1.6545579890756745E-3,null,null,334,null,334,564,null,null,221]
[335,null,1.1553163596218949E-2,4.0339206467770745E-3,1.3050919739572887E-3,1.6112320112320038E-2,9.4797764768494268E-3,565,6.2848851568289107E-2,4.4765722547150881E-2,2.9645655478891066E-2,6.3528598583030983E-4,4.1126886196387246E-4,3.0069178806868931E-4,4.10097493036214E-3,2.612109115103148E-3,1.6512304842550938E-3,null,null,335,null,335,565,null,null,222]
[336,null,1.1516452074392072E-2,4.0212042788993147E-3,1.3009778549380136E-3,1.6061131948720747E-2,9.449602122015956E-3,566,6.2723373838456678E-2,4.4676274091433432E-2,2.9585453526912553E-2,6.3399323998068616E-4,4.1043901425794689E-4,3.0008609626537021E-4,4.0927097088053607E-3,2.6069057104913889E-3,1.6479163365552209E-3,null,null,336,null,336,566,null,null,223]
[337,null,1.1479973123808825E-2,4.0085678322061922E-3,1.2968895927725915E-3,1.6010268000390557E-2,9.4196192490746018E-3,567,6.259839614287184E-2,4.4587182385051743E-2,2.95254955857343E-2,6.3270574467352825E-4,4.0961250869893362E-4,2.9948283968029969E-4,4.0844777361631534E-3,2.6017229953611875E-3,1.6446154657108216E-3,null,null,337,null,337,567,null,null,224]
[338,null,1.1443724541403622E-2,3.9960105556121825E-3,1.2928269444627649E-3,1.5959725196784617E-2,9.3898260411175941E-3,568,6.2473915498490809E-2,4.4498445298005992E-2,2.9465780174818389E-2,6.3142346798571094E-4,4.0878932513705438E-4,2.9888200365654256E-4,4.0762788122101715E-3,2.5965608465608678E-3,1.6413277920984794E-3,null,null,338,null,338,568,null,null,225]
[339,null,1.1407704151848455E-2,3.9835317074138048E-3,1.2887896700456429E-3,1.5909500506009661E-2,9.3602207041513803E-3,569,6.234992894595056E-2,4.4410060717219105E-2,2.9406305825580303E-2,6.3014637825237446E-4,4.0796944358418316E-4,2.982835736545498E-4,4.0681127383255288E-3,2.5914191419142123E-3,1.6380532367301934E-3,null,null,339,null,339,569,null,null,226]
[340,null,1.1371909807117716E-2,3.9711305551435802E-3,1.2847775325464524E-3,1.5859590934217727E-2,9.3308014667365501E-3,570,6.2226433549334298E-2,4.4322026546369062E-2,2.9347071081268532E-2,6.2887444406431806E-4,4.071528442122287E-4,2.9768753525098582E-4,4.0599793174767558E-3,2.5862977602108248E-3,1.6347917212470526E-3,null,null,340,null,340,570,null,null,227]
[341,null,1.1336339386061208E-2,3.9588063754267128E-3,1.280790297932172E-3,1.5809993525011293E-2,9.301566579634506E-3,571,6.2103426395939722E-2,4.4234340705723123E-2,2.9288074496845624E-2,6.2760763426542444E-4,4.0633950735153538E-4,2.970938741375693E-4,4.0518783542039596E-3,2.5811965811966021E-3,1.6315431679129841E-3,null,null,341,null,341,571,null,null,228]
[342,null,1.1300990793985128E-2,3.9465584538404402E-3,1.2768277350660249E-3,1.5760705358859487E-2,9.2725143154607382E-3,572,6.1980904596050032E-2,4.4147001131974055E-2,2.9229314638870678E-2,6.2634591795011636E-4,4.0552941348930439E-4,2.9650257611992881E-4,4.0438096546041588E-3,2.5761154855643256E-3,1.6283074996085796E-3,null,null,342,null,342,572,null,null,229]
[343,null,1.1265861962240876E-2,3.9343860847759734E-3,1.2728896156628151E-3,1.5711723552525224E-2,9.2436429683446179E-3,573,6.1858865282707627E-2,4.406000577807833E-2,2.9170790085383268E-2,6.250892644608432E-4,4.0472254326803325E-4,2.9591362711647076E-4,4.0357730263158136E-3,2.5710543549443566E-3,1.6250846398249907E-3,null,null,343,null,343,573,null,null,230]
[344,null,1.1230950847821506E-2,3.9222885713029931E-3,1.2689757142450859E-3,1.5663045258502959E-2,9.214950853595489E-3,574,6.1737305611490489E-2,4.397335261309613E-2,2.9112499425788699E-2,6.2383764338559743E-4,4.0391887748397374E-4,2.953270131572624E-4,4.0277682785035468E-3,2.566013071895446E-3,1.6218745126578985E-3,null,null,344,null,344,574,null,null,231]
[345,null,1.1196255432965646E-2,3.910265225036633E-3,1.2650858081000873E-3,1.5614667664466899E-2,9.1864363073749771E-3,575,6.1616222760291196E-2,4.3887039622033386E-2,2.9054441260744725E-2,6.2259102455546197E-4,4.0311839708560843E-4,2.9474272038292656E-4,4.0197952218430279E-3,2.5609915198956507E-3,1.6186770428015561E-3,null,null,345,null,345,575,null,null,232]
[346,null,1.1161773724768769E-2,3.8983153660069087E-3,1.2612196772375293E-3,1.5566587992729372E-2,9.1580976863753615E-3,576,6.1495613929098532E-2,4.3801064805685491E-2,2.899661420204952E-2,6.2134937804218554E-4,4.0232108317214525E-4,2.9416073504355035E-4,4.0118536685060536E-3,2.5559895833333545E-3,1.6154921555428983E-3,null,null,346,null,346,576,null,null,233]
[347,null,1.1127503754801578E-2,3.8864383225305226E-3,1.2573771043481101E-3,1.5518803499709188E-2,9.1299333675038865E-3,577,6.1375476339781646E-2,4.3715426180483026E-2,2.8939016872531077E-2,6.2011267415578776E-4,4.0152691699202976E-4,2.9358104349760694E-4,4.003943432145796E-3,2.5510071474983973E-3,1.612319776755723E-3,null,null,347,null,347,577,null,null,234]
[348,null,1.1093443578735441E-2,3.8746334310850172E-3,1.2535578747627997E-3,1.5471311475409763E-2,9.1019417475728583E-3,578,6.1255807235876723E-2,4.3630121778339179E-2,2.8881647905937859E-2,6.1888088344219303E-4,4.0073587994147547E-4,2.9300363221088901E-4,3.9960643278822263E-3,2.5460440985733031E-3,1.6091598328949403E-3,null,null,348,null,348,578,null,null,235]
[349,null,1.1059591275974667E-2,3.8629000361852083E-3,1.2497617764128614E-3,1.5424109242906799E-2,9.0741212429954563E-3,579,6.1136603882376198E-2,4.3545149646498964E-2,2.8824505946830756E-2,6.1765397668089156E-4,3.9994795356301051E-4,2.9242848775545615E-4,3.9882161722877129E-3,2.5411003236246173E-3,1.6060122509908886E-3,null,null,349,null,349,579,null,null,236]
[350,null,1.1025944949295487E-2,3.8512374902618537E-3,1.2459885997905997E-3,1.53771941578453E-2,9.0464702894870914E-3,580,6.1017863565520365E-2,4.3460507847390251E-2,2.8767589650476367E-2,6.1643192488262954E-4,3.9916311954404265E-4,2.9185559680859342E-4,3.9803987833727864E-3,2.5361757105943367E-3,1.6028769586437191E-3,null,null,350,null,350,580,null,null,237]
[351,null,1.0992502724491621E-2,3.8396451535425234E-3,1.2422381379108163E-3,1.5330563607945746E-2,9.0189873417721948E-3,581,6.0899583592591462E-2,4.3376194458476451E-2,2.8710897682741501E-2,6.1521469928712527E-4,3.9838135971544011E-4,2.9128494615178284E-4,3.9726119805720706E-3,2.5312701482914464E-3,1.5997538840178431E-3,null,null,351,null,351,581,null,null,238]
[352,null,1.0959262750026264E-2,3.8281223939346017E-3,1.2385101862729595E-3,1.5284215012519239E-2,8.9916708732963573E-3,582,6.0781761291710104E-2,4.3292207572110976E-2,2.8654428719988901E-2,6.1400227136081283E-4,3.9760265605012969E-4,2.9071652266968694E-4,3.9648555847303837E-3,2.526383526383548E-3,1.5966429558364461E-3,null,null,352,null,352,582,null,null,239]
[353,null,1.0926223196690373E-2,3.816668586910404E-3,1.2348045428239543E-3,1.5238145821991405E-2,8.9645193759436761E-3,583,6.0664394011634093E-2,4.3208545295393377E-2,2.8598181448974285E-2,6.1279461279461329E-4,3.9682699066171122E-4,2.9015031334914343E-4,3.9571294180889924E-3,2.5215157353885892E-3,1.5935441033760659E-3,null,null,353,null,353,583,null,null,240]
[354,null,1.0893382257267107E-2,3.8052831153943356E-3,1.2311210079216969E-3,1.5192353517434863E-2,8.9375313597592002E-3,584,6.0547479121559569E-2,4.3125205750027096E-2,2.8542154566744488E-2,6.1159169550173062E-4,3.9605434580308773E-4,2.8958630527817274E-4,3.9494333042720403E-3,2.5166666666666883E-3,1.5904572564612324E-3,null,null,354,null,354,584,null,null,241]
[355,null,1.0860738146202326E-2,3.7939653696520757E-3,1.2274593842992007E-3,1.5146835610110139E-2,8.9107053526763808E-3,585,6.0431014010924412E-2,4.3042187072178946E-2,2.8486346780536898E-2,6.1039349161547455E-4,3.9528470386511217E-4,2.8902448564499593E-4,3.9417670682731177E-3,2.5118362124120497E-3,1.5873823454591704E-3,null,null,355,null,355,585,null,null,242]
[356,null,1.0828289099280956E-2,3.7827147471817253E-3,1.2238194770293816E-3,1.5101589641014775E-2,8.88403990024942E-3,586,6.0314996089213979E-2,4.2959487412340111E-2,2.8430756807679994E-2,6.0919997348710868E-4,3.9451804737524956E-4,2.8846484173706514E-4,3.9341305364420064E-3,2.507024265644977E-3,1.5843193012745644E-3,null,null,356,null,356,586,null,null,243]
[357,null,1.0796033373309174E-2,3.7715306526068908E-3,1.2202010934904647E-3,1.5056613180440503E-2,8.8575335653903967E-3,587,6.0199422785769001E-2,4.2877104935188849E-2,2.8375383375495077E-2,6.0801111368372356E-4,3.9375435899625477E-4,2.8790736094010436E-4,3.9265235364715559E-3,2.5022307202039731E-3,1.5812680553443817E-3,null,null,357,null,357,587,null,null,244]
[358,null,1.0763969245802238E-2,3.7604124975716578E-3,1.2166040433320069E-3,1.5011903827538323E-2,8.831184928111099E-3,588,6.0084291549595714E-2,4.27950378194547E-2,2.8320225221199164E-2,6.0682688498613546E-4,3.9299362152486576E-4,2.8735203073716167E-4,3.9189458973847334E-3,2.4974554707379352E-3,1.5782285396327581E-3,null,null,358,null,358,588,null,null,245]
[359,null,1.0732095014677874E-2,3.749359700637413E-3,1.2130281384415162E-3,1.4967459209891286E-2,8.8049925852694468E-3,589,5.9969599849178191E-2,4.2713284257784236E-2,2.8265281091808973E-2,6.0564726038680821E-4,3.9223581789051129E-4,2.8679883870767281E-4,3.9113974495218118E-3,2.4926984126984342E-3,1.57520068662594E-3,null,null,359,null,359,589,null,null,246]
[360,null,1.0700408997955092E-2,3.7383716871814887E-3,1.209473192911658E-3,1.492327698309486E-2,8.7789551503204E-3,590,5.9855345172292775E-2,4.2631842456608476E-2,2.8210549744046066E-2,6.0447221308780055E-4,3.9148093115403483E-4,2.862477725265346E-4,3.9038780245277027E-3,2.4879594423320877E-3,1.5721844293272861E-3,null,null,360,null,360,590,null,null,247]
[361,null,1.0668909533458303E-2,3.7274478892975727E-3,1.2059390230080382E-3,1.4879354830344686E-2,8.7530712530712977E-3,591,5.9741525025824666E-2,4.255071063601161E-2,2.8156029944243065E-2,6.0330171649873696E-4,3.9072894450643174E-4,2.8569881996319015E-4,3.896387455339447E-3,2.4832384566730132E-3,1.5691797012523259E-3,null,null,361,null,361,591,null,null,248]
[362,null,1.0637594978526677E-2,3.716587745697874E-3,1.2024254471375475E-3,1.4835690462031629E-2,8.7273395394414956E-3,592,5.9628136935586558E-2,4.2469887029601396E-2,2.8101720468250931E-2,6.0213574423480134E-4,3.8997984126760185E-4,2.8515196888072357E-4,3.8889255761738366E-3,2.478535353535375E-3,1.566186436423874E-3,null,null,362,null,362,592,null,null,249]
[363,null,1.0606463709728585E-2,3.7057907016169772E-3,1.1989322858172574E-3,1.4792281615343895E-2,8.7017586712262295E-3,593,5.9515178446139377E-2,4.2389369884380981E-2,2.8047620101347391E-2,6.0097427011475521E-4,3.8923360488511634E-4,2.8460720723496561E-4,3.8814922225151862E-3,2.4738500315060075E-3,1.5632045693672026E-3,null,null,363,null,363,593,null,null,250]
[364,null,1.0575514122581052E-2,3.6950562087173832E-3,1.1954593616438592E-3,1.4749126053876139E-2,8.6763273258646332E-3,594,5.9402647120615042E-2,4.2309157460622082E-2,2.7993727638146344E-2,5.9981726815897733E-4,3.8849021893299821E-4,2.840645230736097E-4,3.8740872311032438E-3,2.4691823899371285E-3,1.5602340351052655E-3,null,null,364,null,364,594,null,null,251]
[365,null,1.0544744631274092E-2,3.6843837249966758E-3,1.1920064992636302E-3,1.4706221567245397E-2,8.6510441962117986E-3,595,5.9290540540541184E-2,4.2229248031739788E-2,2.7940041882508326E-2,5.9866471258752691E-4,3.8774966711051749E-4,2.8352390453533741E-4,3.8667104399212351E-3,2.46453232893913E-3,1.5572747691539803E-3,null,null,365,null,365,595,null,null,252]
[366,null,1.0514153668399851E-2,3.6737727146962974E-3,1.1885735253429198E-3,1.4663565970713686E-2,8.6259079903148166E-3,596,5.9178856305667958E-2,4.2149639884168595E-2,2.7886561647452048E-2,5.9751657781822955E-4,3.8701193324099933E-4,2.8298533984895467E-4,3.8593616881840496E-3,2.459899749373455E-3,1.5543267075175606E-3,null,null,366,null,366,596,null,null,253]
[367,null,1.0483739684686457E-2,3.6632226482118985E-3,1.1851602685391436E-3,1.4621157104817166E-2,8.6009174311927061E-3,597,5.9067592033796662E-2,4.2070331317239931E-2,2.7833285755066876E-2,5.9637283846478335E-4,3.8627700127064621E-4,2.8244881733253686E-4,3.8520408163265582E-3,2.45528455284555E-3,1.5513897866839042E-3,null,null,367,null,367,597,null,null,254]
[368,null,1.045350114873647E-2,3.6527330020052194E-3,1.1817665594722768E-3,1.4578992835001709E-2,8.5760712566201706E-3,598,5.8956745360610428E-2,4.199132064306111E-2,2.7780213036426388E-2,5.9523346933488814E-4,3.8554485526737378E-4,2.8191432539258486E-4,3.8447476659920622E-3,2.4506866416978993E-3,1.5484639436200306E-3,null,null,368,null,368,598,null,null,255]
[369,null,1.0423436546769837E-2,3.6423032585174925E-3,1.1783922306968357E-3,1.4537071051264767E-2,8.551368218915072E-3,599,5.8846313939506706E-2,4.1912606186395494E-2,2.7727342331502869E-2,5.9409844542839658E-4,3.8481547941965902E-4,2.8138185252318945E-4,3.8374820800208798E-3,2.4461059190031367E-3,1.5455491157675731E-3,null,null,369,null,369,599,null,null,256]
[370,null,1.039354438237128E-2,3.631932906084314E-3,1.1750371166743369E-3,1.4495389667803393E-2,8.5268070847295818E-3,600,5.8736295441431691E-2,4.1834186284544189E-2,2.7674672489082765E-2,5.9296774193548442E-4,3.8408885803540253E-4,2.8085138730520574E-4,3.8302439024390515E-3,2.4415422885572355E-3,1.5426452410383187E-3,null,null,370,null,370,600,null,null,257]
[371,null,1.0363823176242017E-2,3.6216214388519741E-3,1.1717010537462269E-3,1.4453946622668294E-2,8.5023866348449152E-3,601,5.8626687554716589E-2,4.1756059287228885E-2,2.7622202366683175E-2,5.9184133423484397E-4,3.8336497554080279E-4,2.8032291840543726E-4,3.823032978447184E-3,2.4369956548727714E-3,1.5397522578098008E-3,null,null,371,null,371,601,null,null,258]
[372,null,1.033427146595574E-2,3.6113683566952001E-3,1.1683838801072708E-3,1.4412739877423824E-2,8.4781056639695856E-3,602,5.8517487984915677E-2,4.1678223556476143E-2,2.7569930830469196E-2,5.9071919789189598E-4,3.8264381647924354E-4,2.7979643457582819E-4,3.8158491544094102E-3,2.4324659231722643E-3,1.5368701049209396E-3,null,null,372,null,372,602,null,null,259]
[373,null,1.0304887805718727E-2,3.6011731651363009E-3,1.1650854357793915E-3,1.4371767416813746E-2,8.4539629805410986E-3,603,5.8408694454646262E-2,4.1600677466502936E-2,2.751785675517229E-2,5.8960130865702326E-4,3.8192536551019381E-4,2.7927192465266611E-4,3.8086922778424802E-3,2.4279529993815924E-3,1.5339987216677316E-3,null,null,373,null,373,603,null,null,260]
[374,null,1.0275670766134061E-2,3.5910353752656716E-3,1.1618055625859526E-3,1.433102724843271E-2,8.429957406531045E-3,604,5.8300304703430283E-2,4.1523419403603393E-2,2.7465979024009515E-2,5.8848764246382428E-4,3.8120960740812014E-4,2.7874937755579225E-4,3.8015621974049727E-3,2.4234567901234784E-3,1.531138047798989E-3,null,null,374,null,374,604,null,null,261]
[375,null,1.024661893396985E-2,3.5809545036636385E-3,1.1585441041264714E-3,1.4290517402403268E-2,8.4060877772534678E-3,605,5.819231648753781E-2,4.144644776603694E-2,2.7414296528603679E-2,5.8737817542738513E-4,3.8049652706141076E-4,2.7822878228782143E-4,3.794458762886626E-3,2.4189772027110503E-3,1.5282880235121233E-3,null,null,375,null,375,605,null,null,262]
[376,null,1.0217730911931342E-2,3.5709300723236188E-3,1.1553009057517589E-3,1.4250235931058392E-2,8.3823529411765161E-3,606,5.8084727579832199E-2,4.1369760963917528E-2,2.7362808168904431E-2,5.8627288384257247E-4,3.7978610947131245E-4,2.7771012793337101E-4,3.7873818251977897E-3,2.414514145141473E-3,1.5254485894489803E-3,null,null,376,null,376,606,null,null,263]
[377,null,1.0189005318436922E-2,3.5609616085765642E-3,1.1520758145394767E-3,1.4210180908629312E-2,8.3587517597372585E-3,607,5.7977535769616978E-2,4.1293357419104205E-2,2.73115128531102E-2,5.8517174418234541E-4,3.7907833975087861E-4,2.7719340365829723E-4,3.7803312363589962E-3,2.4100675260896472E-3,1.522619686691718E-3,null,null,{"$f":"IF($T$1=1,R259,IF($T$1=2,H259,IF($T$1=3,H259,IF($T$1=4,H259,IF($T$1=5,A259,IF($T$1=6,A259,IF($T$1=7,A259,IF($T$1=8,H259,IF($T$1=9,H259,IF($T$1=10,H259,IF($T$1=11,A259,IF($T$1=12,A259,IF($T$1=13,H259,IF($T$1=14,H259,IF($T$1=15,H259,IF($T$1=21,V259,IF($T$1=22,W259,0)))))))))))))))))","v":377},null,377,607,null,null,264]
[378,null,1.0160440787397832E-2,3.5510486450166701E-3,1.1488686792700991E-3,1.4170350430938613E-2,8.3352831071596169E-3,608,5.7870738862484443E-2,4.1217235565092887E-2,2.7260409497591002E-2,5.8407473309608597E-4,3.7837320312392961E-4,2.7667859870894162E-4,3.7733068494906412E-3,2.4056372549019823E-3,1.5198012567587313E-3,null,null,378,null,378,608,null,null,265]
[379,null,1.013203596800163E-2,3.5411907194283169E-3,1.145679350403279E-3,1.41307426150985E-2,8.3119458702753616E-3,609,5.7764334680165896E-2,4.1141393846909222E-2,2.7209497026812173E-2,5.8298182740794836E-4,3.7767068492402449E-4,2.7616570241138425E-4,3.7663085188027914E-3,2.4012232415902357E-3,1.516993241600622E-3,null,null,379,null,379,609,null,null,266]
[380,null,1.0103789524499234E-2,3.5313873747142323E-3,1.1425076800546045E-3,1.4091355599214079E-2,8.2887389483481157E-3,610,5.7658321060383558E-2,4.1065830721002797E-2,2.7158774373258872E-2,5.8189300411522692E-4,3.7697077059344373E-4,2.7565470417070662E-4,3.7593360995850909E-3,2.3968253968254184E-3,1.5141955835962142E-3,null,null,380,null,380,610,null,null,267]
[381,null,1.0075700135995553E-2,3.5216381588248353E-3,1.1393535219727409E-3,1.4052187542091598E-2,8.2656612529002794E-3,611,5.7552695856704097E-2,4.099054465514234E-2,2.7108240477361496E-2,5.8080824038674256E-4,3.7627344568218424E-4,2.7514559347026178E-4,3.7523894481967914E-3,2.3924436319317705E-3,1.511408225548612E-3,null,null,381,null,381,611,null,null,268]
[382,null,1.0047766496243568E-2,3.5119426246887544E-3,1.1362167315169501E-3,1.4013236622951552E-2,8.2427117075428505E-3,612,5.7447456938393759E-2,4.0915534128312184E-2,2.7057894287421905E-2,5.7972751356124685E-4,3.7557869584696452E-4,2.7463835987095287E-4,3.7454684220568882E-3,2.3880778588808E-3,1.5086311106813014E-3,null,null,382,null,382,612,null,null,269]
[383,null,1.0019987313441846E-2,3.5023003301444871E-3,1.133097165634981E-3,1.3974501041146533E-2,8.2198892478080772E-3,613,5.7342602190275115E-2,4.0840797630609875E-2,2.7007734759540426E-2,5.7865080114584367E-4,3.7488650685024141E-4,2.7413299301051985E-4,3.7385728796343605E-3,2.3837279902853888E-3,1.5058641826342968E-3,null,null,383,null,383,613,null,null,270]
[384,null,9.992361310035407E-3,3.4927108378731793E-3,1.1299946828413226E-3,1.3935979015883743E-2,8.1971928209848624E-3,614,5.7238129512585278E-2,4.0766333663144784E-2,2.6957760857543749E-2,5.7757808081442897E-4,3.7419686455923749E-4,2.7362948260283362E-4,3.731702680438531E-3,2.3793939393939611E-3,1.5031073854603263E-3,null,null,384,null,384,614,null,null,271]
[385,null,9.9648872225198658E-3,3.4831737153325133E-3,1.126909143195813E-3,1.3897668785952097E-2,8.1746213859569088E-3,615,5.7134036820835857E-2,4.0692140737937976E-2,2.690797155291353E-2,5.7650933040614765E-4,3.7350975494497893E-4,2.7312781843719824E-4,3.7248576850095168E-3,2.3750756200847161E-3,1.5003606636210625E-3,null,null,385,null,385,615,null,null,272]
[386,null,9.9375638012488034E-3,3.4736885346916689E-3,1.1238404082825988E-3,1.385956860945381E-2,8.1521739130435266E-3,616,5.7030322045674209E-2,4.0618217377823021E-2,2.6858365824715881E-2,5.7544452792386732E-4,3.7282516408134483E-4,2.7262799037766058E-4,3.7180377549087982E-3,2.3707729468599248E-3,1.4976239619833914E-3,null,null,386,null,386,616,null,null,273]
[387,null,9.9103898102442869E-3,3.4642548727673497E-3,1.1207883411894367E-3,1.3821676763540383E-2,8.1298493838430422E-3,617,5.6926983132746384E-2,4.0544562116348028E-2,2.680894265953155E-2,5.7438365153266943E-4,3.7214307814412557E-4,2.7212998836232782E-4,3.7112427527098853E-3,2.3664858348402865E-3,1.4948972258157249E-3,null,null,387,null,387,617,null,null,274]
[388,null,9.883364027010514E-3,3.4548723109608429E-3,1.1177528064873316E-3,1.3783991544152907E-2,8.1076467910787906E-3,618,5.6824018042561437E-2,4.0471173497678647E-2,2.6759701051386905E-2,5.7332667955835629E-4,3.7146348341009314E-4,2.7163380240269238E-4,3.7044725419890833E-3,2.3622141997593476E-3,1.4921804007843511E-3,null,null,388,null,388,618,null,null,275]
[389,null,9.8564852423504695E-3,3.4455404351961074E-3,1.1147336702105055E-3,1.3746511265766616E-2,8.0855651384476191E-3,619,5.6721424750357283E-2,4.0398050076502129E-2,2.6710640001685711E-2,5.7227359048597542E-4,3.7078636625607989E-4,2.7113942258296368E-4,3.6977269873163673E-3,2.3579579579579794E-3,1.4894734329498256E-3,null,null,389,null,389,619,null,null,276]
[390,null,9.829752260185589E-3,3.4362588358588537E-3,1.1117307998366882E-3,1.3709234261139581E-2,8.0636034404708498E-3,620,5.6619201245967941E-2,4.0325190417932491E-2,2.6661758519141612E-2,5.7122436295835972E-4,3.7011171315806896E-4,2.7064683905940809E-4,3.6910059542463471E-3,2.3537170263789185E-3,1.4867762687634021E-3,null,null,390,null,390,620,null,null,277]
[391,null,9.8031638973783298E-3,3.4270271077366126E-3,1.1087440642677277E-3,1.3672158881065495E-2,8.0417607223476784E-3,621,5.6517345533692288E-2,4.0252593097416613E-2,2.6613055619711348E-2,5.7017897577468335E-4,3.6943951069029344E-4,2.7015604205969521E-4,3.6843093093093383E-3,2.3494913225613622E-3,1.4840888550635015E-3,null,null,391,null,391,621,null,null,278]
[392,null,9.7767189835576279E-3,3.4178448499597646E-3,1.105773333810512E-3,1.3635283494130439E-2,8.020036019810944E-3,622,5.6415855632164176E-2,4.018025670064141E-2,2.6564530326528744E-2,5.6913740788903391E-4,3.68769745524346E-4,2.6966702188225183E-4,3.6776369200025275E-3,2.3452807646356247E-3,1.4814111390722186E-3,null,null,392,null,392,622,null,null,279]
[393,null,9.7504163609471676E-3,3.4087116659435117E-3,1.1028184801581951E-3,1.3598606486473609E-2,7.9984283789852305E-3,623,5.6314729574223898E-2,4.0108179823442024E-2,2.6516181669839385E-2,5.6809963840900011E-4,3.681024044282978E-4,2.6917976889562271E-4,3.6709886547812288E-3,2.3410852713178511E-3,1.4787430683918666E-3,null,null,393,null,393,623,null,null,280]
[394,null,9.7242548841964208E-3,3.3996271633307861E-3,1.0998793763717248E-3,1.356212626155185E-2,7.9769368562472489E-3,624,5.6213965406791168E-2,4.0036361071710901E-2,2.6468008686936027E-2,5.6706564659427504E-4,3.6743747426582721E-4,2.6869427353783793E-4,3.6643643830502441E-3,2.3369047619047835E-3,1.476084591001561E-3,null,null,394,null,394,624,null,null,281]
[395,null,9.6982334202143847E-3,3.3905909539360584E-3,1.096955896861666E-3,1.3525841239908002E-2,7.9555605180884805E-3,625,5.6113561190739347E-2,3.9964799061307961E-2,2.642001042209469E-2,5.6603541185527384E-4,3.667749419953578E-4,2.68210526315788E-4,3.6577639751553094E-3,2.3327391562685896E-3,1.4734356552538368E-3,null,null,395,null,395,625,null,null,282]
[396,null,9.6723508480059932E-3,3.3816026536900483E-3,1.0940479173703096E-3,1.3489749858942947E-2,7.9342984409800053E-3,626,5.601351500077105E-2,3.9893492417971646E-2,2.6372185926511436E-2,5.6500891375176792E-4,3.6611479466920583E-4,2.6772851780460432E-4,3.6511873023746342E-3,2.3285883748517416E-3,1.4707962098713051E-3,null,null,396,null,396,626,null,null,283]
[397,null,9.6466060585111441E-3,3.3726618825853059E-3,1.0911553149540697E-3,1.3453850572691288E-2,7.9131497112394974E-3,627,5.5913824925295078E-2,3.9822439777230954E-2,2.6324534258239898E-2,5.6398613199153244E-4,3.6545701943273658E-4,2.6724823864704796E-4,3.6446342369105384E-3,2.3244523386619516E-3,1.4681662039433437E-3,null,null,397,null,397,627,null,null,284]
[398,null,9.6209979544462833E-3,3.3637682646226602E-3,1.0882779679661551E-3,1.3418141851600618E-2,7.8921134249003589E-3,628,5.5814489066304686E-2,3.9751639784318421E-2,2.6277054482129383E-2,5.6296704642900945E-4,3.6480160352353013E-4,2.6676967955290335E-4,3.6381046518811689E-3,2.3203309692671611E-3,1.4655455869228237E-3,null,null,398,null,398,628,null,null,285]
[399,null,9.5955254501485024E-3,3.3549214277585082E-3,1.0854157560395174E-3,1.3382622182314256E-2,7.871188687582905E-3,629,5.5715505539257117E-2,3.9681091094083999E-2,2.6229745669763733E-2,5.619516370639851E-4,3.6414853427055592E-4,2.6629283129837964E-4,3.6315984213123142E-3,2.3162241887905821E-3,1.4629343086228722E-3,null,null,399,null,399,629,null,null,286]
[400,null,9.5701874714221175E-3,3.3461210038529328E-3,1.0825685600700666E-3,1.3347290067457482E-2,7.8503746143676108E-3,630,5.5616872472954416E-2,3.9610792370909878E-2,2.6182606899400808E-2,5.6093988404028129E-4,3.6349779909335605E-4,2.6581768472551832E-4,3.6251154201293006E-3,2.3121319199057933E-3,1.460332319213667E-3,null,null,400,null,400,630,null,null,287]
[401,null,9.5449829553876549E-3,3.3373666286186415E-3,1.0797362622001487E-3,1.3312144025427105E-2,7.8296703296703782E-3,631,5.5518588009425558E-2,3.9540742288626182E-2,2.6135637255912593E-2,5.5993176764446129E-4,3.628493855012377E-4,2.6534423074160636E-4,3.6186555241489791E-3,2.3080540858318854E-3,1.4577395692192681E-3,null,null,401,null,401,631,null,null,288]
[402,null,9.5199108503332495E-3,3.3286579415706947E-3,1.0769187458022837E-3,1.3277182590184353E-2,7.8090749671197342E-3,632,5.5420650303809701E-2,3.9470939530427587E-2,2.6088835830726024E-2,5.5892726830454934E-4,3.6220328109247369E-4,2.6487246031859675E-4,3.612218610071796E-3,2.3039906103286601E-3,1.4551560095144814E-3,null,null,402,null,402,632,null,null,289]
[403,null,9.4949701155683346E-3,3.3199945859770314E-3,1.0741158954631572E-3,1.3242404311051042E-2,7.7885876694359915E-3,633,5.532305752424084E-2,3.9401382788790823E-2,2.6042201721764364E-2,5.5792636658876437E-4,3.6155947355351195E-4,2.6440236449253431E-4,3.6058045554739461E-3,2.2999414176918787E-3,1.452581591321756E-3,null,null,403,null,403,633,null,null,290]
[404,null,9.4701597212796564E-3,3.3113762088097512E-3,1.0713275969678607E-3,1.3207807752508911E-2,7.7682075883123043E-3,634,5.5225807851733547E-2,3.9332070765392982E-2,2.5995734033389256E-2,5.569290432042664E-4,3.6091795065819332E-4,2.6393393436298802E-4,3.5994132387996147E-3,2.29590643274856E-3,1.4500162662081143E-3,null,null,404,null,404,634,null,null,291]
[405,null,9.4454786483895402E-3,3.302802460697168E-3,1.0685537372843779E-3,1.3173391494002117E-2,7.7479338842975703E-3,635,5.5128899480069972E-2,3.9263002171030806E-2,2.5949431876343403E-2,5.5593527899591765E-4,3.6027870026697739E-4,2.6346716109248937E-4,3.5930445393532948E-3,2.2918855808523276E-3,1.4474599860821152E-3,null,null,405,null,405,635,null,null,292]
[406,null,9.4209258884163424E-3,3.294272995876593E-3,1.0657942045483096E-3,1.3139154129742784E-2,7.7277657266811772E-3,636,5.5032330615688026E-2,3.9194175725540702E-2,2.590329436769381E-2,5.549450549450555E-4,3.5964171032617701E-4,2.6300203590597662E-4,3.5866983372921917E-3,2.2878787878788096E-3,1.4449127031908487E-3,null,null,406,null,406,636,null,null,293]
[407,null,9.3965004433371139E-3,3.2857874721478578E-3,1.0630488880478365E-3,1.3105094268519616E-2,7.7077022933795388E-3,637,5.49360994775707E-2,3.9125590157719672E-2,2.5857320630775688E-2,5.5395835216827947E-4,3.5900696886720043E-4,2.6253855009024477E-4,3.5803745136187078E-3,2.2838859802210803E-3,1.4423743701169613E-3,null,null,407,null,407,637,null,null,294]
[408,null,9.3722013254523423E-3,3.2773455508275477E-3,1.0603176782089125E-3,1.3071210533509434E-2,7.6877427708243922E-3,638,5.484020429713661E-2,3.9057244205247046E-2,2.5811509795136921E-2,5.529751519162511E-4,3.5837446400580183E-4,2.6207669499340145E-4,3.5740729501729986E-3,2.2799070847851553E-3,1.439844939775716E-3,null,null,408,null,408,638,null,null,295]
[409,null,9.3480275572528377E-3,3.268946896703942E-3,1.0576004665806872E-3,1.3037501562091661E-2,7.667886353852826E-3,639,5.4744643318131614E-2,3.8989136614607039E-2,2.5765860996483109E-2,5.5199543557250591E-4,3.5774418394133976E-4,2.6161646202432895E-4,3.5677935296256212E-3,2.2759420289855288E-3,1.4373243654120787E-3,null,null,409,null,409,639,null,null,296]
[410,null,9.3239781712886379E-3,3.2605911779926442E-3,1.0548971458211494E-3,1.3003966005665658E-2,7.6481322455990196E-3,640,5.4649414796521648E-2,3.8921266141012115E-2,2.5720373376623251E-2,5.5101918465227874E-4,3.5711611695604282E-4,2.6115784265215089E-4,3.5615361354702454E-3,2.2719907407407623E-3,1.4348126005978381E-3,null,null,410,null,410,640,null,null,297]
[411,null,9.3000522100399555E-3,3.2522780662928887E-3,1.0522076096829934E-3,1.2970602529470871E-2,7.628479657387631E-3,641,5.4554517000386542E-2,3.8853631548327147E-2,2.5675046083415923E-2,5.500463808013412E-4,3.5649025141428408E-4,2.6070082840570557E-4,3.5553006520164516E-3,2.2680531484691149E-3,1.4323095992287559E-3,null,null,411,null,411,641,null,null,298]
[412,null,9.2762487257900851E-3,3.2440072365445202E-3,1.0495317529996978E-3,1.2937409812409748E-2,7.6089278086288407E-3,642,5.4459948209815104E-2,3.8786231608994359E-2,2.5629878270716097E-2,5.4907700579485085E-4,3.5586657576186195E-4,2.6024541087302439E-4,3.5490869643826019E-3,2.2641291810842202E-3,1.4298153155217449E-3,null,null,412,null,412,642,null,null,299]
[413,null,9.252566780500281E-3,3.2357783669856215E-3,1.0468694716718188E-3,1.2904386546873354E-2,7.5894759267150051E-3,643,5.4365706716801201E-2,3.8719065103959102E-2,2.5584869098322482E-2,5.4811104153621424E-4,3.5524507852528937E-4,2.5979158170081549E-4,3.5428949584887805E-3,2.2602187679908103E-3,1.4273297040120773E-3,null,null,413,null,413,643,null,null,300]
[414,null,9.2290054456865174E-3,3.2275911391107877E-3,1.04422066265349E-3,1.2871531438569665E-2,7.5701232469188775E-3,644,5.4271790825140873E-2,3.865213082259629E-2,2.5540017731925407E-2,5.4714847005595956E-4,3.5462574831109052E-4,2.5933933259395333E-4,3.5367245210498176E-3,2.2563218390804817E-3,1.4248527195506232E-3,null,null,414,null,414,644]
[415,null,9.2055638022981671E-3,3.2194452376300316E-3,1.0415852239391279E-3,1.2838843206354469E-2,7.5508690122933946E-3,645,5.417819885033065E-2,3.8585427562637727E-2,2.5495323343055296E-2,5.4618927351062299E-4,3.5400857380510407E-4,2.5888865531497289E-4,3.5305755395683763E-3,2.252438324727503E-3,1.4223843173011166E-3,null,null,415,null,415,645]
[416,null,9.1822409405984788E-3,3.2113403504283114E-3,1.0389630545503362E-3,1.2806320582064837E-2,7.5317124735729893E-3,646,5.408492911946676E-2,3.8518954130100092E-2,2.5450785109031652E-2,5.4523343418164615E-4,3.5339354377179465E-4,2.5843954168356981E-4,3.5244479023281176E-3,2.2485681557846723E-3,1.4199244527374503E-3,null,null,416,null,416,646]
[417,null,9.159035960046899E-3,3.2032761685256645E-3,1.0363540545230089E-3,1.2773962310355127E-2,7.5126528890763896E-3,647,5.3991979971145514E-2,3.8452709339213673E-2,2.540640221291255E-2,5.442809344742848E-4,3.5278064705357079E-4,2.579919835761056E-4,3.5183414983869354E-3,2.2447112635792096E-3,1.4174730816409974E-3,null,null,417,null,417,647]
[418,null,9.1359479691831644E-3,3.1952523860379438E-3,1.0337581248946288E-3,1.2741767148535456E-2,7.4936895246109038E-3,648,5.3899349755364631E-2,3.8386692012351925E-2,2.5362173843444743E-2,5.4333175691652932E-4,3.5216987257011007E-4,2.5754597292511729E-4,3.5122562175702583E-3,2.2408675799086976E-3,1.4150301600979634E-3,null,null,418,null,418,648]
[419,null,9.1129760855131418E-3,3.1872687001381424E-3,1.031175167691752E-3,1.2709733866412614E-2,7.4748216533781454E-3,649,5.3807036833425602E-2,3.8320900979961638E-2,2.5318099195014172E-2,5.4238588415803665E-4,3.5156120931769189E-4,2.5710150171883323E-4,3.5061919504644273E-3,2.2370370370370586E-3,1.4125956444967626E-3,null,null,419,null,419,649]
[420,null,9.0901194353963828E-3,3.1793248110182941E-3,1.0286050859176835E-3,1.2677861246133387E-2,7.4560485558811725E-3,650,5.3715039577837062E-2,3.8255335080493856E-2,2.5274177467597098E-2,5.4144329896907266E-4,3.5095464636853606E-4,2.566585620006931E-4,3.5001485884101355E-3,2.2332195676905793E-3,1.4101694915254234E-3,null,null,420,null,420,650]
[421,null,9.0673771539353729E-3,3.1714204218519461E-3,1.0260477835403355E-3,1.2646148082030195E-2,7.4373695198330352E-3,651,5.3623356372219128E-2,3.818999316033559E-2,2.5230407866711678E-2,5.4050398423946652E-4,3.5035017287014927E-4,2.5621714586887318E-4,3.4941260234959371E-3,2.2294151050539683E-3,1.40775165816902E-3,null,null,421,null,421,651]
[422,null,9.0447483848664356E-3,3.1635552387571839E-3,1.0235031654802654E-3,1.2614593180469081E-2,7.4187838400666898E-3,652,5.3531985611208761E-2,3.8124874073742078E-2,2.5186789603370053E-2,5.3956792297757481E-4,3.4974777804467754E-4,2.5577724547581638E-4,3.4881241485518293E-3,2.2256235827664617E-3,1.4053421017071299E-3,null,null,422,null,422,652]
[423,null,9.0222322804522637E-3,3.1557289707602153E-3,1.0209711375988933E-3,1.258319535969994E-2,7.4002908184462495E-3,653,5.3440925700366057E-2,3.8059976682769871E-2,2.514332189403096E-2,5.3863509830925709E-4,3.4914745118826569E-4,2.5533885302776737E-4,3.4821428571428889E-3,2.2218449349179618E-3,1.4029407797113175E-3,null,null,423,null,423,653]
[424,null,8.9998280013760621E-3,3.1479413297594815E-3,1.0184516066868911E-3,1.2551953449708997E-2,7.3818897637795778E-3,654,5.3350175056081486E-2,3.7995299857210514E-2,2.5100003960552789E-2,5.3770549347686243E-4,3.4854918167042369E-4,2.5490196078431217E-4,3.4761820435629852E-3,2.2180790960452195E-3,1.4005476500426445E-3,null,null,424,null,424,654]
[425,null,8.9775347166372518E-3,3.1401920304903073E-3,1.0159444804527466E-3,1.2520866292073473E-2,7.3635799917321715E-3,655,5.3259732105484112E-2,3.7930842474524967E-2,2.5056835030147172E-2,5.367790918382251E-4,3.4795295893339857E-4,2.5446656105792246E-4,3.4702416028285525E-3,2.2143260011280533E-3,1.3981626708492044E-3,null,null,425,null,425,655]
[426,null,8.9553516034487184E-3,3.1324807904900684E-3,1.0134496675114927E-3,1.24899327398184E-2,7.3453608247423191E-3,656,5.31695952863507E-2,3.7866603419778648E-2,2.5013814335333024E-2,5.3585587686567221E-4,3.4735877249155404E-4,2.5403264621350519E-4,3.4643214306724237E-3,2.2105855855856071E-3,1.3957858005636825E-3,null,null,426,null,426,656]
[427,null,8.9332778471355977E-3,3.1248073300638706E-3,1.0109670773736051E-3,1.2459151657275555E-2,7.3272315919375251E-3,657,5.3079763047015789E-2,3.7802581585577116E-2,2.4970941113891032E-2,5.3493583214504032E-4,3.4676661193075518E-4,2.5360020866795551E-4,3.4584214235377341E-3,2.2068577852726468E-3,1.3934169979009422E-3,null,null,427,null,427,657]
[428,null,8.91131264103554E-3,3.1171713722507343E-3,1.0084966204340611E-3,1.2428521919944487E-2,7.3091916290521633E-3,658,5.2990233846282632E-2,3.77387758720025E-2,2.4928214608818687E-2,5.3401894137470273E-4,3.4617646690776035E-4,2.5316924088971565E-4,3.4525414785718791E-3,2.2031425364758914E-3,1.3910562218556331E-3,null,null,428,null,428,658]
[429,null,8.8894551864004395E-3,3.1095726427902703E-3,1.006038207961558E-3,1.2398042414355565E-2,7.2912402783463443E-3,659,5.2901006153335095E-2,3.7675185186550456E-2,2.4885634068285693E-2,5.3310518836460709E-4,3.4558832714961905E-4,2.5273973539833748E-4,3.4466814936205399E-3,2.1994397759103859E-3,1.3887034316998261E-3,null,null,429,null,429,659]
[430,null,8.8677046922996192E-3,3.1020108700898462E-3,1.0035917520878914E-3,1.2367712037935059E-2,7.2733768885259774E-3,660,5.2812078447650339E-2,3.7611808444067835E-2,2.4843198745589868E-2,5.3219455703532189E-4,3.4500218245307545E-4,2.5231168476404946E-4,3.4408413672217674E-3,2.1957494407159051E-3,1.3863585869806707E-3,null,null,430,null,430,660]
[431,null,8.8460603755244217E-3,3.0944857851922243E-3,1.0011571657974844E-3,1.2337529698872186E-2,7.2556008146639987E-3,661,5.2723449218912512E-2,3.754864456669095E-2,2.4800907899113534E-2,5.3128703141709351E-4,3.444180226839787E-4,2.5188508160732873E-4,3.4350209986001249E-3,2.1920714684533996E-3,1.3840216475180763E-3,null,null,431,null,431,661]
[432,null,8.8245214604942123E-3,3.0869971217436778E-3,9.9873436291707252E-4,1.2307494315988097E-2,7.2379114181227609E-3,662,5.2635116966927242E-2,3.7485692483784472E-2,2.4758760792280253E-2,5.3038259564891282E-4,3.4383583777669878E-4,2.5145991859847652E-4,3.4292202876608949E-3,2.1884057971014708E-3,1.3816925734024177E-3,null,null,432,null,432,662]
[433,null,8.8030871791637162E-3,3.0795446159625622E-3,9.9632325810553491E-4,1.2277604818606779E-2,7.2203080664775491E-3,663,5.254708020153695E-2,3.7422951131880954E-2,2.4716756693512126E-2,5.2948123397759082E-4,3.4325561773354823E-4,2.5103618845719869E-4,3.4234391349843361E-3,2.1847523650528875E-3,1.3793713249922628E-3,null,null,433,null,433,663]
[434,null,8.7817567709317455E-3,3.0721280066083414E-3,9.9392376684387515E-4,1.2247860146427822E-2,7.2027901334412101E-3,664,5.2459337442537085E-2,3.7360419454620902E-2,2.4674894876187421E-2,5.2858293075684442E-4,3.4267735262421005E-4,2.5061388395219004E-4,3.4176774418200077E-3,2.1811111111111328E-3,1.377057862912124E-3,null,null,434,null,434,664]
[435,null,8.7605294825512155E-3,3.0647470349510651E-3,9.9153580542534446E-4,1.2218259249401056E-2,7.1853569987898793E-3,665,5.2371887219593155E-2,3.7298096402693534E-2,2.4633174618598687E-2,5.2768767044639067E-4,3.4210103258517104E-4,2.5019299790072298E-4,3.4119351100811448E-3,2.1774819744869878E-3,1.3747521480502311E-3,null,null,435,null,435,665]
[436,null,8.7394045680404906E-3,3.0574014447412789E-3,9.8915929094570794E-4,1.2188801087602962E-2,7.1680080482897828E-3,666,5.2284728072158601E-2,3.7235980933778071E-2,2.4591595203911288E-2,5.2679543761105117E-4,3.4152664781916093E-4,2.4977352316824024E-4,3.4062120423390915E-3,2.1738648947951487E-3,1.3724541415563274E-3,null,null,436,null,436,666]
[437,null,8.7183812885959881E-3,3.0500909821803718E-3,9.8679414129364956E-4,1.215948463111491E-2,7.1507426736250931E-3,667,5.2197858549393489E-2,3.7174072012485605E-2,2.455015592012233E-2,5.2590621691986437E-4,3.4095418859459743E-4,2.4935545266795188E-4,3.4005081418177941E-3,2.1702598120508783E-3,1.3701638048394884E-3,null,null,437,null,437,667]
[438,null,8.6974589125060463E-3,3.0428153958913431E-3,9.844402751413169E-4,1.2130308859903115E-2,7.1335602723268344E-3,668,5.2111277210083996E-2,3.7112368610301635E-2,2.4508856060020026E-2,5.2501999314520794E-4,3.4038364524503653E-4,2.4893877936043609E-4,3.3948233123883417E-3,2.1666666666666883E-3,1.3678810995659603E-3,null,null,438,null,438,668]
[439,null,8.6766367150660391E-3,3.0355744368899913E-3,9.8209761193499717E-4,1.2101272763700339E-2,7.1164602477027982E-3,669,5.20249826225627E-2,3.705086970552901E-2,2.4467694921143483E-2,5.2413675116192923E-4,3.3981500816862819E-4,2.4852349625324402E-4,3.389157458563568E-3,2.1630853994490571E-3,1.3656059876570226E-3,null,null,439,null,439,669]
[440,null,8.6559139784946962E-3,3.0283678585565077E-3,9.7976607188592904E-4,1.2072375341889272E-2,7.0994420087684747E-3,670,5.1938973364629694E-2,3.6989574283231637E-2,2.4426671805742838E-2,5.2325647594648507E-4,3.392482678275781E-4,2.4810959640050872E-4,3.383510485492707E-3,2.159515951595181E-3,1.363338431286869E-3,null,null,440,null,440,670]
[441,null,8.635289991851626E-3,3.0211954166074807E-3,9.7744557596124394E-4,1.2043615603387597E-2,7.0825049701789666E-3,671,5.1853248023474442E-2,3.6928481335178578E-2,2.4385786020739861E-2,5.2237915257608968E-4,3.3868341474761396E-4,2.4769707290255808E-4,3.3778822989560951E-3,2.1559582646897522E-3,1.3610783928805128E-3,null,null,{"$f":"IF($T$1=1,R323,IF($T$1=2,H323,IF($T$1=3,H323,IF($T$1=4,H323,IF($T$1=5,A323,IF($T$1=6,A323,IF($T$1=7,A323,IF($T$1=8,H323,IF($T$1=9,H323,IF($T$1=10,H323,IF($T$1=11,A323,IF($T$1=12,A323,IF($T$1=13,H323,IF($T$1=14,H323,IF($T$1=15,H323,IF($T$1=21,V323,IF($T$1=22,W323,0)))))))))))))))))","v":441},null,441,671]
[442,null,8.6147640509560107E-3,3.0140568690682919E-3,9.7513604587503569E-4,1.2014992566534688E-2,7.0656485521618803E-3,672,5.1767805195598426E-2,3.6867589859788802E-2,2.4345036877688922E-2,5.2150476622787162E-4,3.3812043951745788E-4,2.4728591890553091E-4,3.3722728053599362E-3,2.1524122807017759E-3,1.358825835111711E-3,null,null,442,null,442,672]
[443,null,8.5943354583064568E-3,3.0069519762459026E-3,9.7283740407955665E-4,1.1986505258979895E-2,7.0488721804511673E-3,673,5.1682643486738532E-2,3.6806898862076456E-2,2.4304423692738317E-2,5.2063330217803883E-4,3.3755933278830367E-4,2.46876127600998E-4,3.3666819117311097E-3,2.1488779419814117E-3,1.3565807209009084E-3,null,null,443,null,443,673]
[444,null,8.5740035230019943E-3,2.9998805007020284E-3,9.7054957375653839E-4,1.1958152717572463E-2,7.0321752862219098E-3,674,5.1597761511791233E-2,3.6746407353596626E-2,2.4263945786592064E-2,5.1976474580105235E-4,3.3700008527329912E-4,2.4646769222558571E-4,3.3611095257120352E-3,2.1453551912568522E-3,1.3543430134132046E-3,null,null,444,null,444,674]
[445,null,8.5537675606641803E-3,2.9928422072266862E-3,9.6827247880863375E-4,1.1929933988252966E-2,7.0155573060260322E-3,675,5.1513157894737489E-2,3.6686114352391726E-2,2.4223602484471977E-2,5.1889908256880788E-4,3.364426877470338E-4,2.4606060606060441E-4,3.3555555555555882E-3,2.1418439716312269E-3,1.3521126760563378E-3,null,null,445,null,445,675]
[446,null,8.5336268933603101E-3,2.9858368628121177E-3,9.6600604385097932E-4,1.19018481259463E-2,6.999017681728917E-3,676,5.1428831268568377E-2,3.6626018882938351E-2,2.4183393116080212E-2,5.1803629804982585E-4,3.358871310450317E-4,2.4565486243167966E-4,3.3500199101200619E-3,2.1383442265795419E-3,1.3498896724786914E-3,null,null,446,null,446,676]
[447,null,8.5135808495277101E-3,2.9788642366270742E-3,9.6375019420287685E-4,1.1873894194456168E-2,6.98255586044692E-3,677,5.1344780275211485E-2,3.6566119976094623E-2,2.4143317015562132E-2,5.1717637790844948E-4,3.3533340606324894E-4,2.4525045470838756E-4,3.3445024988641853E-3,2.1348558999456442E-3,1.3476739665673186E-3,null,null,447,null,447,677]
[448,null,8.4936287638990998E-3,2.9719240999914621E-3,9.6150485587959069E-4,1.184607126636106E-2,6.9661712944857615E-3,678,5.1261003565458013E-2,3.6506416669048164E-2,2.4103373521469521E-2,5.1631930790405089E-4,3.3478150375757686E-4,2.4484737630389383E-4,3.3390032318421827E-3,2.1313789359392178E-3,1.345465522445987E-3,null,null,448,null,448,678]
[449,null,8.4737699774289858E-3,2.9650162263513448E-3,9.5926995558425843E-4,1.1818378422911693E-2,6.9498634412797859E-3,679,5.1177499798890524E-2,3.6446908005264456E-2,2.4063561976724251E-2,5.1546507389024483E-4,3.3423141514334894E-4,2.4444562067459574E-4,3.333522019698889E-3,2.1279132791328132E-3,1.343264304473242E-3,null,null,449,null,449,679]
[450,null,8.4540038372211083E-3,2.9581403912542869E-3,9.5704542069991632E-4,1.1790814753929868E-2,6.9336317633320703E-3,680,5.109426764381151E-2,3.6387593034435756E-2,2.4023881728582192E-2,5.1461366181411038E-4,3.3368313129485377E-4,2.4404518131976847E-4,3.32805877366491E-3,2.124458874458896E-3,1.3410702772404897E-3,null,null,450,null,450,680]
[451,null,8.4343296964568791E-3,2.951296372325047E-3,9.5483117928163289E-4,1.1763379357708765E-2,6.9174757281553739E-3,681,5.1011305777172597E-2,3.6328470812430555E-2,2.3984332128597585E-2,5.1376505771542013E-4,3.3313664334485199E-4,2.4364605178121414E-4,3.3226134055518268E-3,2.1210156672069368E-3,1.3388834055700978E-3,null,null,451,null,451,681]
[452,null,8.4147469143248319E-3,2.9444839492416023E-3,9.5262716004875371E-4,1.1736071340914608E-2,6.9013948082139037E-3,682,5.0928612884504419E-2,3.626954040124343E-2,2.3944912532587688E-2,5.1291924772587803E-4,3.3259194248409833E-4,2.4324822564291473E-4,3.3171858277474559E-3,2.1175836030205178E-3,1.3367036545135166E-3,null,null,452,null,452,682]
[453,null,8.395254855951044E-3,2.9377029037115049E-3,9.5043329237725163E-4,1.1708889818489701E-2,6.885388480865901E-3,683,5.0846187659847192E-2,3.6210800868945479E-2,2.3905622300597812E-2,5.1207621806836283E-4,3.3204901996086863E-4,2.4285169653068839E-4,3.3117759532111453E-3,2.1141626278944753E-3,1.334530989349416E-3,null,null,453,null,453,683]
[454,null,8.375852892330532E-3,2.9309530194485674E-3,9.482495062921836E-4,1.1681833913556811E-2,6.8694562283070125E-3,684,5.0764028805681982E-2,3.6152251289635173E-2,2.38664607968667E-2,5.1123595505618027E-4,3.3150786708049045E-4,2.424564581118488E-4,3.306383695469125E-3,2.1107526881720645E-3,1.3323653755818422E-3,null,null,454,null,454,684]
[455,null,8.3565404002595798E-3,2.9242340821498672E-3,9.4607573246025109E-4,1.1654902757324876E-2,6.8535975375144604E-3,685,5.0682135032862619E-2,3.6093890743389694E-2,2.3827427389792214E-2,5.1039844509232315E-4,3.3096847520487947E-4,2.4206250409486828E-4,3.3010089686098987E-3,2.1073537305421582E-3,1.3302067789383925E-3,null,null,455,null,455,685]
[456,null,8.3373167622690196E-3,2.9175458794730631E-3,9.4391190218246152E-4,1.1628095488996008E-2,6.8378119001919696E-3,686,5.0600505060548251E-2,3.6035718316216797E-2,2.3788521451897391E-2,5.095636746687371E-4,3.3043083575207957E-4,2.4166982822904369E-4,3.2956516872796791E-3,2.1039657020364634E-3,1.3280551653684074E-3,null,null,456,null,456,686]
[457,null,8.3181813665584251E-3,2.9108882010140304E-3,9.4175794738689223E-4,1.1601411255673775E-2,6.8220988127154648E-3,687,5.0519137616136599E-2,3.5977733100007056E-2,2.3749742359796829E-2,5.0873163036559436E-4,3.2989494019580772E-4,2.4127842430416615E-4,3.2903117666778742E-3,2.1005885500267737E-3,1.3259105010411795E-3,null,null,457,null,457,687]
[458,null,8.2991336069311999E-3,2.9042608382847928E-3,9.3961380062155067E-4,1.157484921227275E-2,6.8064577760795098E-3,688,5.0438031435197761E-2,3.5919934192486638E-2,2.3711089494163368E-2,5.0790229885057533E-4,3.2936078006500359E-4,2.408882861501933E-4,3.2849891225526077E-3,2.0972222222222438E-3,1.3237727523441806E-3,null,null,458,null,458,688]
[459,null,8.2801728827305732E-3,2.8976635846917603E-3,9.3747939504733421E-4,1.1548408521429302E-2,6.7908882958444819E-3,689,5.035718526140881E-2,3.5862320697170477E-2,2.367256223969514E-2,5.0707566687815562E-4,3.2882834694338274E-4,2.4049940763692533E-4,3.2796836711962906E-3,2.0938666666666882E-3,1.3216418858813062E-3,null,null,459,null,459,689]
[460,null,8.2612985987764505E-3,2.8910962355142623E-3,9.3535466443108492E-4,1.1522088353413595E-2,6.7753898820844712E-3,690,5.0276597846488844E-2,3.580489172331594E-2,2.3634159985082923E-2,5.0625172128890164E-4,3.2829763246899484E-4,2.4011178267368391E-4,3.2743953294412341E-3,2.0905218317359107E-3,1.3195178684711352E-3,null,null,460,null,460,690]
[461,null,8.2425101653031407E-3,2.8845585878833711E-3,9.3323954313873764E-4,1.1495887886042794E-2,6.7599620493358917E-3,691,5.0196267950134779E-2,3.5747646385876929E-2,2.3595882122977776E-2,5.0543044900877175E-4,3.2776862833378575E-4,2.39725405208994E-4,3.2691240146553013E-3,2.0871876661350563E-3,1.3174006671452093E-3,null,null,461,null,461,691]
[462,null,8.2238069978979311E-3,2.8780504407610111E-3,9.3113396612856246E-4,1.1469806304595457E-2,6.74460431654679E-3,692,5.0116194339957711E-2,3.5690583805458385E-2,2.3557728049959061E-2,5.0461183704842479E-4,3.2724132628316415E-4,2.3934026923026923E-4,3.2638696447376044E-3,2.0838641188959876E-3,1.3152902491463257E-3,null,null,462,null,462,692]
[463,null,8.2051885174404884E-3,2.8715715949193541E-3,9.2903786894449694E-4,1.1443842801727087E-2,6.7293162070268496E-3,693,5.0036375791419889E-2,3.5633703108271297E-2,2.3519697166502707E-2,5.0379587250253574E-4,3.2671571811557221E-4,2.3895636876349971E-4,3.2586321381142432E-3,2.0805511393746905E-3,1.3131865819268483E-3,null,null,463,null,463,693]
[464,null,8.1866541500430767E-3,2.8651218529204868E-3,9.2695118770956921E-4,1.1417996577386815E-2,6.7140972483980665E-3,694,4.9956811087772286E-2,3.5577003426088077E-2,2.3481788876949818E-2,5.0298254254911676E-4,3.2619179568206026E-4,2.3857369787294325E-4,3.2534114137340812E-3,2.0772486772486988E-3,1.3110896331470349E-3,null,null,464,null,464,694]
[465,null,8.1682033269916098E-3,2.8587010190963564E-3,9.248738591194095E-4,1.1392266838735236E-2,6.6989469725460956E-3,695,4.9877499019992798E-2,3.5520483896198364E-2,2.3444002589475585E-2,5.0217183444884632E-4,3.2566955088586552E-4,2.3819225066081968E-4,3.2482073910645674E-3,2.0739566825145488E-3,1.3089993706733791E-3,null,null,465,null,465,695]
[466,null,8.1498354846874701E-3,2.8523088995289821E-3,9.2280582043584715E-4,1.1366652800063331E-2,6.6838649155722581E-3,696,4.9798438386724979E-2,3.5464143661365334E-2,2.3406337716058455E-2,5.0136373554440382E-4,3.2514897568199536E-4,2.3781202126700739E-4,3.2430199900875933E-3,2.0706751054852535E-3,1.3069157625769697E-3,null,null,466,null,466,696]
[467,null,8.1315500645901193E-3,2.8459453020309349E-3,9.2074700948059651E-4,1.1341153682712489E-2,6.6688506177461871E-3,697,4.9719627994217364E-2,3.5407981869782286E-2,2.3368793672449664E-2,5.0055823325981046E-4,3.2463006207681381E-4,2.3743300386874373E-4,3.2378491312953931E-3,2.0674038967878044E-3,1.3048387771318639E-3,null,null,467,null,467,697]
[468,null,8.113346513160492E-3,2.8396100361260715E-3,9.1869736462902327E-4,1.1315768714995601E-2,6.6539036234591203E-3,698,4.9641066656263444E-2,3.5351997675029764E-2,2.3331369878143018E-2,4.997553150997776E-4,3.2411280212763286E-4,2.3705519268032733E-4,3.2326947356864804E-3,2.0641430073606946E-3,1.3027683828134783E-3,null,null,468,null,468,698]
[469,null,8.0952242818051294E-3,2.8333029130305359E-3,9.1665682480399687E-4,1.129049713211922E-2,6.6390234811778102E-3,699,4.956275319414212E-2,3.5296190236033011E-2,2.3294065756344948E-2,4.9895496864905996E-4,3.2359718794230659E-4,2.3667858195282402E-4,3.2275567247616252E-3,2.0608923884514649E-3,1.3007045482969939E-3,null,null,469,null,469,699]
[470,null,8.0771828268210773E-3,2.8270237456340008E-3,9.1462532946982378E-4,1.1265338176106744E-2,6.6242097433990565E-3,700,4.948468643655874E-2,3.5240558717019838E-2,2.3256880733944912E-2,4.9815718157181622E-4,3.2308321167883033E-4,2.3630316597377511E-4,3.2224350205198693E-3,2.0576519916142774E-3,1.2986472424557751E-3,null,null,470,null,470,700]
[471,null,8.0592216093415027E-3,2.8207723484811684E-3,9.126028186262603E-4,1.1240291095722636E-2,6.6094619666048461E-3,701,4.9406865219586711E-2,3.518510228747896E-2,2.3219814241486027E-2,4.9736194161097483E-4,3.225708655449429E-4,2.3592893906690848E-4,3.2173295454545787E-3,2.0544217687075046E-3,1.2965964343598052E-3,null,null,471,null,471,701]
[472,null,8.0413400952820471E-3,2.8145485377535106E-3,9.1058923280260635E-4,1.1215355146397658E-2,6.5947797112180899E-3,702,4.9329288386609667E-2,3.5129820122118592E-2,2.3182865713136002E-2,4.9656923658760658E-4,3.2206014179773267E-4,2.3555589559185274E-4,3.2122402225495347E-3,2.0512016718913484E-3,1.2945520932741378E-3,null,null,472,null,472,702]
[473,null,8.023537755287892E-3,2.8083521312512508E-3,9.0858451305187522E-4,1.1190529590155084E-2,6.5801625415589432E-3,703,4.925195478826417E-2,3.5074711400825555E-2,2.314603458665835E-2,4.9577905440030263E-4,3.2155103274324789E-4,2.3518402994385357E-4,3.2071669752750582E-3,2.0479916536254778E-3,1.2925141886573591E-3,null,null,473,null,473,703]
[474,null,8.0058140646815119E-3,2.8021829483755862E-3,9.065886009450427E-4,1.1165813695537897E-2,6.565610025801717E-3,704,4.9174863282382908E-2,3.5019775308624719E-2,2.3109320303383859E-2,4.9499138302455887E-4,3.2104353073610981E-4,2.3481333655349325E-4,3.2021097275841781E-3,2.0447916666666882E-3,1.2904826901600692E-3,null,null,474,null,474,704]
[475,null,7.9881685034111378E-3,2.7960408101111406E-3,9.0460143856536902E-4,1.1141206737536954E-2,6.5511217359323489E-3,705,4.9098012733938511E-2,3.4965011035638788E-2,2.3072722308182362E-2,4.9420621051216615E-4,3.2053762817913037E-4,2.3444380988641241E-4,3.1970684039088287E-3,2.0416016640665839E-3,1.2884575676233737E-3,null,null,475,null,475,705]
[476,null,7.9706005559998881E-3,2.7899255390086476E-3,9.0262296850279766E-4,1.1116707997520089E-2,6.5366972477064423E-3,706,4.9021402014987836E-2,3.4910417777048577E-2,2.3036240049434737E-2,4.9342352499060556E-4,3.2003331752293297E-4,2.3407544444303482E-4,3.1920429291560858E-3,2.038421599169284E-3,1.2864387910773922E-3,null,null,476,null,476,706]
[477,null,7.9531097114955689E-3,2.7838369591678637E-3,9.0065313384842655E-4,1.109231676316216E-2,6.5223361406078553E-3,707,4.8945030004616738E-2,3.4855994733053501E-2,2.2999872979005208E-2,4.9264331466245057E-4,3.1953059126557686E-4,2.3370823475829443E-4,3.1870332287044388E-3,2.0352514256091452E-3,1.2844263307397797E-3,null,null,477,null,477,707]
[478,null,7.9356954634211465E-3,2.777774896220702E-3,8.9869187818905063E-4,1.1068032328376E-2,6.5080379978078376E-3,708,4.8868895588885478E-2,3.4801741108832593E-2,2.2963620552213897E-2,4.9186556780477419E-4,3.1902944195218527E-4,2.3334217540136503E-4,3.182039228400099E-3,2.03209109730851E-3,1.2824201570142625E-3,null,null,478,null,478,708]
[479,null,7.9183573097258465E-3,2.7717391773145854E-3,8.9673914560177773E-4,1.104385399324429E-2,6.4938024061246997E-3,709,4.8792997660774502E-2,3.474765611450574E-2,2.2927482227809604E-2,4.9109027276856133E-4,3.1852986217457708E-4,2.3297726097539273E-4,3.1770608545533354E-3,2.0289405684754736E-3,1.2804202404891859E-3,null,null,479,null,479,709]
[480,null,7.9010947527369188E-3,2.7657296310960185E-3,8.9479488064871202E-4,1.1019781063952313E-2,6.4796289559840127E-3,710,4.8717335120130822E-2,3.4693738965095415E-2,2.2891457467942897E-2,4.9031741797812812E-4,3.1803184457090126E-4,2.3261348611723054E-4,3.1720980339348575E-3,2.0257997936016727E-3,1.2784265519360785E-3,null,null,480,null,480,710]
[481,null,7.8839072991120137E-3,2.7597460876943717E-3,8.9285902837170838E-4,1.0995812852721587E-2,6.4655172413793285E-3,711,4.8641906873614832E-2,3.4639988880488651E-2,2.2855545738139429E-2,4.8954699193054464E-4,3.1753538182527574E-4,2.3225084549717578E-4,3.1671506937722186E-3,2.0226687274600935E-3,1.276439062308227E-3,null,null,481,null,481,711]
[482,null,7.8667944597921834E-3,2.7537883787058723E-3,8.909315342871941E-4,1.0971948677744363E-2,6.4514668598334114E-3,712,4.8566711834647662E-2,3.4586405085399452E-2,2.2819746507273482E-2,4.8877898319506534E-4,3.1704046666742892E-4,2.3188933381870962E-4,3.1622187617462616E-3,2.0195473251029021E-3,1.2744577427392669E-3,null,null,482,null,482,712]
[483,null,7.8497557499554969E-3,2.7478563371778108E-3,8.8901234438105645E-4,1.0948187863118974E-2,6.437477412359973E-3,713,4.8491748923358995E-2,3.4532986809331478E-2,2.2784059247541812E-2,4.8801338041256324E-4,3.1654709187234494E-4,2.3152894581823934E-4,3.1573021659875959E-3,2.0164355418592918E-3,1.2724825645417837E-3,null,null,483,null,483,713]
[484,null,7.8327906889712542E-3,2.7419497975929414E-3,8.8710140510359862E-4,1.0924529738786021E-2,6.4235485034259089E-3,714,4.8417017066535388E-2,3.4479733286541164E-2,2.2748483434437677E-2,4.8725017229496952E-4,3.1605525025991206E-4,2.3116967626484293E-4,3.1524008350731028E-3,2.0133333333333548E-3,1.2705134992059288E-3,null,null,484,null,484,714]
[485,null,7.8158988003547911E-3,2.7360685958540869E-3,8.8519866336455764E-4,1.0900973640465389E-2,6.4096797409140139E-3,715,4.8342515197569033E-2,3.4426643756001081E-2,2.2713018546725177E-2,4.8648934762471932E-4,3.1556493469457418E-4,2.3081151996001575E-4,3.147514698022482E-3,2.010240655401967E-3,1.268550518398048E-3,null,null,485,null,485,715]
[486,null,7.7990796117228733E-3,2.7302125692689463E-3,8.8330406652818846E-4,1.0877518909594073E-2,6.3958707360861917E-3,716,4.826824225640701E-2,3.4373717461363716E-2,2.2677664066413774E-2,4.8573089525420202E-4,3.150761380849859E-4,2.3045447173742015E-4,3.1426436842948205E-3,2.0071574642127003E-3,1.2665935939593226E-3,null,null,486,null,486,716]
[487,null,7.7823326547496532E-3,2.7243815565350868E-3,8.8141756240841054E-4,1.0854164893264798E-2,6.3821211035471311E-3,717,4.8194197189501041E-2,3.4320953650925537E-2,2.2642419478733071E-2,4.8497480410521649E-4,3.1458885338367067E-4,2.300985264626367E-4,3.1377877237852001E-3,2.0040837161817465E-3,1.2646426979044218E-3,null,null,487,null,487,717]
[488,null,7.7656574651232138E-3,2.7185753977251393E-3,8.7953909926401566E-4,1.0830910944165445E-2,6.3684304612084521E-3,718,4.8120378949757653E-2,3.4268351577591422E-2,2.2607284272107848E-2,4.8422106316843214E-4,3.1410307358668198E-4,2.297436790329183E-4,3.1329467468213354E-3,2.0010193679918663E-3,1.2626978024201704E-3,null,null,488,null,488,718]
[489,null,7.7490535825026456E-3,2.7127939342721716E-3,8.7766862579393779E-4,1.0807756420519234E-2,6.3547984302533139E-3,719,4.8046786496488816E-2,3.4215910498839382E-2,2.2572257938133292E-2,4.8346966150285427E-4,3.1361879173326808E-4,2.2938992437694631E-4,3.1281206841602379E-3,1.9979643765903519E-3,1.2607588798642256E-3,null,null,489,null,489,719]
[490,null,7.7325205504756925E-3,2.7070370089552561E-3,8.7580609113258284E-4,1.0784700686025692E-2,6.3412246351014735E-3,720,4.7973418795363064E-2,3.4163629676685611E-2,2.2537339971550475E-2,4.8272058823529463E-4,3.1313600090553898E-4,2.2903725745458881E-4,3.1233094669849189E-3,1.994918699187013E-3,1.2588259027637681E-3,null,null,490,null,490,720]
[491,null,7.7160579165169276E-3,2.7013044658852191E-3,8.7395144484521804E-4,1.0761743109802357E-2,6.3277087033747912E-3,721,4.7900274818357E-2,3.4111508377649917E-2,2.2502529870222079E-2,4.8197383255984741E-4,3.1265469422813759E-4,2.2868567325666153E-4,3.1185130269011144E-3,1.9918822932521773E-3,1.2568988438142043E-3,null,null,491,null,491,721]
[492,null,7.6996652319464651E-3,2.6955961504905668E-3,8.7210463692341869E-4,1.0738883066327237E-2,6.3142502658631817E-3,722,4.7827353543707291E-2,3.4059545872721364E-2,2.2467827135108288E-2,4.8122938373736899E-4,3.1217486486791299E-4,2.2833516680469029E-4,3.1137312959340479E-3,1.9888551165147123E-3,1.2549776758778806E-3,null,null,492,null,492,722]
[493,null,7.6833420518892005E-3,2.6899119095035937E-3,8.7026561778057437E-4,1.0716119935382001E-2,6.3008489564909918E-3,723,4.7754653955863119E-2,3.400774143732431E-2,2.2433231270242986E-2,4.8048723109496357E-4,3.1169650603359706E-4,2.2798573315067645E-4,3.1089642065252163E-3,1.9858371269600617E-3,1.2530623719828101E-3,null,null,493,null,493,723]
[494,null,7.6670879352345638E-3,2.6842515909466652E-3,8.6843433824745052E-4,1.0693453101995881E-2,6.2875044122838097E-3,724,4.7682175045439007E-2,3.3956094351284737E-2,2.2398741782710098E-2,4.7974736402547295E-4,3.1121961097548451E-4,2.2763736737686365E-4,3.1042116915292101E-3,1.982828282828304E-3,1.2511529053214098E-3,null,null,494,null,494,724]
[495,null,7.6509024445967824E-3,2.6786150441186723E-3,8.6661074956780569E-4,1.0670881956390292E-2,6.2742162733356926E-3,725,4.7609915809168089E-2,3.3904603898796848E-2,2.2364358182620187E-2,4.7900977198697122E-4,3.1074417298511479E-4,2.2729006459550733E-4,3.0994736842105608E-3,1.979828542612225E-3,1.2492492492492491E-3,null,null,495,null,495,725]
[496,null,7.6347851462756511E-3,2.6730021195816574E-3,8.6479480339406558E-4,1.0648405893924153E-2,6.2609841827768126E-3,726,4.7537875249855865E-2,3.3853269368390032E-2,2.2330079983087264E-2,4.782744445022642E-4,3.1027018539495793E-4,2.2694381994864629E-4,3.0947501182406146E-3,1.9768378650554088E-3,1.2473513772838121E-3,null,null,496,null,496,726]
[497,null,7.6187356102177944E-3,2.6674126691476063E-3,8.6298645178304928E-4,1.0626024315039898E-2,6.2478077867415046E-3,727,4.7466052376334292E-2,3.3802090052896069E-2,2.2295906700205793E-2,4.7754137115839303E-4,3.0979764157810277E-4,2.265986286078758E-4,3.0900409276944409E-3,1.973856209150348E-3,1.2454592631032692E-3,null,null,497,null,497,727]
[498,null,7.6027534099784109E-3,2.6618465458654104E-3,8.6118564719175038E-4,1.0603736625210152E-2,6.2346867343367274E-3,728,4.7394446203416353E-2,3.3751065249416672E-2,2.2261837853027946E-2,4.7681054160614284E-4,3.0932653494794804E-4,2.2625448577412346E-4,3.0853460470477634E-3,1.9708835341365671E-3,1.2435728805452585E-3,null,null,498,null,498,728]
[499,null,7.5868381226835094E-3,2.656303604007983E-3,8.5939234247317097E-4,1.05815422348851E-2,6.2216206776109072E-3,729,4.7323055751850973E-2,3.37001942592913E-2,2.2227872963541017E-2,4.7608194555955611E-4,3.088568589578966E-4,2.259113866774267E-4,3.0806654111739198E-3,1.9679197994987682E-3,1.2416922036056828E-3,null,null,499,null,499,729]
[500,null,7.5709893289926068E-3,2.6507836990595454E-3,8.5760649087220585E-4,1.0559440559440502E-2,6.208609271523188E-3,730,4.7251880048278419E-2,3.3649476388065265E-2,2.219401155664506E-2,4.7535557279544921E-4,3.0838860710105166E-4,2.2556932657671235E-4,3.0759989553408545E-3,1.9649649649649864E-3,1.2398172064375121E-3,null,null,500,null,500,730]
[null,null,null,null,null,null,null,731,4.7180918125186037E-2,3.3598910945458159E-2,2.2160253160130764E-2,4.7463141315293503E-4,3.0792177290991685E-4,2.2522830075957838E-4,3.0713466152081288E-3,1.9620189905047692E-3,1.2379478633496009E-3,null,null,0,null,null,731]
[null,null,null,null,null,null,null,732,4.7110169020864436E-2,3.3548497245332494E-2,2.2126597304657488E-2,4.7390945653294887E-4,3.0745634995609812E-4,2.2488830454207731E-4,3.0667083268239681E-3,1.9590818363273668E-3,1.2360841488055145E-3,null,null,0,null,null,732]
[null,null,null,null,null,null,null,733,4.7039631779364016E-2,3.3498234605662702E-2,2.2093043523731492E-2,4.7318969289777903E-4,3.0699233185000875E-4,2.2454933326850204E-4,3.0620840266223307E-3,1.9561534628799418E-3,1.2342260374223661E-3,null,null,0,null,null,733]
[null,null,null,null,null,null,null,734,4.6969305450451922E-2,3.3448122348504361E-2,2.2059591353684425E-2,4.7247211227060149E-4,3.0652971224057706E-4,2.2421138231117305E-4,3.0574736514200024E-3,1.9532338308457923E-3,1.2323735039696643E-3,null,null,0,null,null,734]
[null,null,null,null,null,null,null,735,4.6899189089569381E-2,3.339815979996371E-2,2.2026240333651918E-2,4.7175670473501919E-4,3.0606848481495646E-4,2.2387444707022792E-4,3.0528771384137204E-3,1.9503229011425946E-3,1.2305265233681715E-3,null,null,{"$f":"IF($T$1=1,R387,IF($T$1=2,H387,IF($T$1=3,H387,IF($T$1=4,H387,IF($T$1=5,A387,IF($T$1=6,A387,IF($T$1=7,A387,IF($T$1=8,H387,IF($T$1=9,H387,IF($T$1=10,H387,IF($T$1=11,A387,IF($T$1=12,A387,IF($T$1=13,H387,IF($T$1=14,H387,IF($T$1=15,H387,IF($T$1=21,V387,IF($T$1=22,W387,0)))))))))))))))))","v":0},null,null,735]
[null,null,null,null,null,null,null,736,4.6829281757789415E-2,3.3348346290167488E-2,2.1992990005552465E-2,4.7104346043460487E-4,3.0560864329823843E-4,2.2353852297341277E-4,3.0482944251773213E-3,1.9474206349206563E-3,1.2286850706887721E-3,null,null,0,null,null,736]
[null,null,null,null,null,null,null,737,4.6759582521774916E-2,3.3298681153232916E-2,2.1959839914066422E-2,4.7033236957244888E-4,3.0515018145316788E-4,2.2320360547587516E-4,3.043725449658914E-3,1.9445269935611902E-3,1.2268491211513506E-3,null,null,0,null,null,737]
[null,null,null,null,null,null,null,738,4.6690090453737128E-2,3.3249163727238081E-2,2.1926789606615225E-2,4.6962342241071026E-4,3.0469309307986118E-4,2.2286969005995942E-4,3.0391701501780808E-3,1.941641938674601E-3,1.2250186501236795E-3,null,null,0,null,null,738]
[null,null,null,null,null,null,null,739,4.6620804631394445E-2,3.3199793354192535E-2,2.1893838633340816E-2,4.6891660927017223E-4,3.0423737201552684E-4,2.2253677223500325E-4,3.0346284654230995E-3,1.9387654320987867E-3,1.2231936331203196E-3,null,null,0,null,null,739]
[null,null,null,null,null,null,null,740,4.6551724137931669E-2,3.3150569380008106E-2,2.1860986547085199E-2,4.6821192052980186E-4,3.0378301213418809E-4,2.2220484753713665E-4,3.0301003344481952E-3,1.935897435897457E-3,1.2213740458015265E-3,null,null,0,null,null,740]
[null,null,null,null,null,null,null,741,4.6482848061959493E-2,3.3101491154470059E-2,2.1828232903370243E-2,4.6750934662631355E-4,3.0333000734640895E-4,2.218739115290822E-4,3.0255856966708117E-3,1.9330379123584653E-3,1.2195598639721688E-3,null,null,0,null,null,741]
[null,null,null,null,null,null,null,742,4.6414175497474501E-2,3.3052558031208427E-2,2.1795577260377619E-2,4.6680887805373614E-4,3.0287835159902168E-4,2.2154395979995746E-4,3.0210844918689105E-3,1.9301868239921549E-3,1.2177510635806561E-3,null,null,0,null,null,742]
[null,null,null,null,null,null,null,743,4.6345705543819386E-2,3.3003769367669668E-2,2.1763019178928936E-2,4.6611050536298458E-4,3.0242803887485747E-4,2.2121498796507904E-4,3.0165966601782951E-3,1.9273441335297217E-3,1.2159476207178764E-3,null,null,0,null,null,743]
[null,null,null,null,null,null,null,744,4.6277437305643584E-2,3.2955124525088524E-2,2.1730558222466053E-2,4.6541421916143459E-4,3.0197906319247932E-4,2.2088699166576811E-4,3.0121221420899534E-3,1.9245098039215897E-3,1.2141495116161417E-3,null,null,0,null,null,744]
[null,null,null,null,null,null,null,745,4.6209369892864262E-2,3.2906622868460127E-2,2.1698193957031587E-2,4.647200101125021E-4,3.0153141860591681E-4,2.2055996656915829E-4,3.0076608784474299E-3,1.921683798335802E-3,1.2123567126481442E-3,null,null,0,null,null,745]
[null,null,null,null,null,null,null,746,4.6141502420627638E-2,3.2858263766512415E-2,2.1665925951249533E-2,4.6402786893522547E-4,3.0108509920440395E-4,2.2023390836800456E-4,3.0032128104442186E-3,1.9188660801564238E-3,1.2105692003259222E-3,null,null,0,null,null,746]
[null,null,null,null,null,null,null,747,4.607383400927062E-2,3.2810046591678674E-2,2.163375377630614E-2,4.63337786403852E-4,3.0064009911211887E-4,2.1990881278049419E-4,2.9987778796211773E-3,1.9160566129819635E-3,1.2087869512998331E-3,null,null,0,null,null,747]
[null,null,null,null,null,null,null,748,4.6006363784282807E-2,3.2761970720070463E-2,2.160167700593088E-2,4.6264975334742831E-4,3.0019641248792589E-4,2.1958467555005949E-4,2.9943560278639695E-3,1.9132553606238027E-3,1.2070099423575377E-3,null,null,0,null,null,748]
[null,null,null,null,null,null,null,749,4.5939090876268816E-2,3.2714035531450671E-2,2.1569695216377659E-2,4.6196376064939365E-4,2.997540335251204E-4,2.1926149244519178E-4,2.9899471974005219E-3,1.910462287104644E-3,1.205238150422992E-3,null,null,0,null,null,749]
[null,null,null,null,null,null,null,750,4.5872014420910948E-2,3.2666240409206827E-2,2.1537807986406126E-2,4.6127979924717749E-4,2.9931295645117486E-4,2.1893925925925751E-4,2.9855513307985139E-3,1.9076773566569696E-3,1.203471552555448E-3,null,null,0,null,null,750]
[null,null,null,null,null,null,null,751,4.5805133558932155E-2,3.261858474032471E-2,2.1506014897263188E-2,4.6059786013180035E-4,2.9887317552748822E-4,2.1861797181031551E-4,2.9811683709628778E-3,1.9049005337215155E-3,1.2017101259484649E-3,null,null,0,null,null,751]
[null,null,null,null,null,null,null,752,4.5738447436059371E-2,3.2571067915362073E-2,2.1474315532664691E-2,4.5991793434747852E-4,2.9843468504913687E-4,2.1829762594093629E-4,2.9767982611333312E-3,1.9021317829457575E-3,1.1999538479289256E-3,null,null,0,null,null,752]
[null,null,null,null,null,null,null,753,4.56719552029871E-2,3.2523689328422728E-2,2.1442709478777227E-2,4.5924001299123144E-4,2.9799747934462783E-4,2.1797821751802249E-4,2.9724409448819247E-3,1.8993710691824111E-3,1.1982026959560658E-3,null,null,0,null,null,753]
[null,null,null,null,null,null,null,754,4.560565601534141E-2,3.2476448377130762E-2,2.1411196324200153E-2,4.5856408721249369E-4,2.9756155277565463E-4,2.1765974243263128E-4,2.968096366110614E-3,1.8966183574879436E-3,1.1964566476205083E-3,null,null,0,null,null,754]
[null,null,null,null,null,null,null,755,4.5539549033644156E-2,3.2429344462605002E-2,2.1379775659947722E-2,4.5789014821272938E-4,2.9712689973685445E-4,2.1734219659979824E-4,2.9637644690488521E-3,1.8938736131211015E-3,1.1947156806433083E-3,null,null,0,null,null,755]
[null,null,null,null,null,null,null,756,4.5473633423277551E-2,3.2382376989433727E-2,2.1348447079431395E-2,4.572181872450508E-4,2.9669351465556822E-4,2.1702557595836241E-4,2.9594451982512034E-3,1.8911368015414468E-3,1.1929797728750045E-3,null,null,0,null,null,756]
[null,null,null,null,null,null,null,757,4.5407908354449078E-2,3.2335545365649566E-2,2.1317210178442299E-2,4.5654819561383956E-4,2.9626139199160218E-4,2.167098764707935E-4,2.9551384985949765E-3,1.8884078884079095E-3,1.191248902294681E-3,null,null,0,null,null,757]
[null,null,null,null,null,null,null,758,4.5342373002156607E-2,3.228884900270463E-2,2.1286064555133859E-2,4.5588016467437188E-4,2.9583052623699199E-4,2.1639509412302004E-4,2.9508443152778826E-3,1.8856868395773505E-3,1.1895230470090356E-3,null,null,0,null,null,758]
[null,null,null,null,null,null,null,759,4.5277026546153926E-2,3.2242287315445865E-2,2.1255009810004541E-2,4.5521408583244647E-4,2.9540091191576883E-4,2.1608122492425928E-4,2.946562593815706E-3,1.8829736211031386E-3,1.1878021852514558E-3,null,null,0,null,null,759]
[null,null,null,null,null,null,null,760,4.5211868170916499E-2,3.2195859722090603E-2,2.1224045545880792E-2,4.5454995054401633E-4,2.9497254358372697E-4,2.1576826490684868E-4,2.942293280040005E-3,1.8802681992337374E-3,1.1860862953811059E-3,null,null,0,null,null,760]
[null,null,null,null,null,null,null,761,4.5146897065607559E-2,3.2149565644202335E-2,2.1193171367900096E-2,4.5388775031482312E-4,2.9454541582819431E-4,2.1545621012607853E-4,2.9380363200958242E-3,1.8775705404113073E-3,1.1843753558820177E-3,null,null,0,null,null,761]
[null,null,null,null,null,null,null,762,4.5082112424044425E-2,3.2103404506666676E-2,2.1162386883494189E-2,4.5322747670003503E-4,2.9411952326780395E-4,2.1514505666002642E-4,2.9337916604394313E-3,1.8748806112703169E-3,1.1826693453621921E-3,null,null,0,null,null,762]
[null,null,null,null,null,null,null,763,4.5017513444665223E-2,3.2057375737667558E-2,2.1131691702372436E-2,4.525691213038881E-4,2.9369486055226855E-4,2.1483480060939268E-4,2.9295592478360711E-3,1.8721983786361678E-3,1.1809682425527079E-3,null,null,0,null,null,763]
[null,null,null,null,null,null,null,764,4.495309933049578E-2,3.2011478768663636E-2,2.1101085436505313E-2,4.5191267577932991E-4,2.9327142236215621E-4,2.145254380973377E-4,2.9253390293577423E-3,1.8695238095238305E-3,1.1792720263068372E-3,null,null,0,null,null,764]
[null,null,null,null,null,null,null,765,4.4888869289116874E-2,3.1965713034364844E-2,2.1070567700108074E-2,4.5125813182766717E-4,2.9284920340866814E-4,2.1421696526932046E-4,2.921130952380988E-3,1.8668568711364927E-3,1.1775806755991694E-3,null,null,0,null,null,765]
[null,null,null,null,null,null,null,766,4.4824822532631724E-2,3.1920077972709224E-2,2.1040138109624535E-2,4.5060548119821601E-4,2.9242819843341864E-4,2.1390937829293815E-4,2.9169349645847098E-3,1.8641975308642184E-3,1.1758941695247426E-3,null,null,0,null,null,766]
[null,null,null,null,null,null,null,767,4.4760958277633781E-2,3.1874573024839883E-2,2.1009796283711003E-2,4.4995471568795489E-4,2.9200840220821683E-4,2.1360267335776797E-4,2.9127510139480024E-3,1.8615457562826193E-3,1.1742124872981821E-3,null,null,0,null,null,767]
[null,null,null,null,null,null,null,768,4.4697275745174778E-2,3.1829197635082192E-2,2.0979541843220362E-2,4.4930582714118161E-4,2.9158980953485015E-4,2.1329684667520924E-4,2.9085790487479979E-3,1.8589015151515361E-3,1.1725356082528465E-3,null,null,0,null,null,768]
[null,null,null,null,null,null,null,769,4.4633774160733074E-2,3.1783951250921184E-2,2.0949374411186245E-2,4.4865880744917187E-4,2.9117241524486976E-4,2.1299189447832777E-4,2.9044190175577388E-3,1.8562647754137324E-3,1.1708635118399817E-3,null,null,0,null,null,769]
[null,null,null,null,null,null,null,770,4.4570452754182248E-2,3.173883332297911E-2,2.0919293612807414E-2,4.4801364854984212E-4,2.9075621419937816E-4,2.1268781302170107E-4,2.9002708692440638E-3,1.8536355051935996E-3,1.1691961776278805E-3,null,null,0,null,null,770]
[null,null,null,null,null,null,null,771,4.4507310759759965E-2,3.1693843304993204E-2,2.088929907543223E-2,4.4737034242741422E-4,2.9034120128881765E-4,2.1238459858126496E-4,2.8961345529655113E-3,1.8510136727958718E-3,1.1675335853010512E-3,null,null,0,null,null,771]
[null,null,null,null,null,null,null,772,4.4444347416037096E-2,3.1648980653793651E-2,2.0859390428543241E-2,4.4672888111208376E-4,2.8992737143276182E-4,2.120822474541617E-4,2.8920100181702457E-3,1.8483992467043522E-3,1.165875714659392E-3,null,null,0,null,null,772]
[null,null,null,null,null,null,null,773,4.438156196588712E-2,3.1604244829281695E-2,2.0829567303741955E-2,4.4608925667969089E-4,2.8951471957970799E-4,2.1178075595858903E-4,2.8878972145939936E-3,1.8457921955806508E-3,1.1642225456173735E-3,null,null,0,null,null,773]
[null,null,null,null,null,null,null,774,4.4318953656455808E-2,3.1559635294408014E-2,2.0799829334733691E-2,4.4545146125139399E-4,2.8910324070687156E-4,2.1148012043365095E-4,2.8837960922580052E-3,1.8431924882629316E-3,1.1625740582032265E-3,null,null,0,null,null,774]
[null,null,null,null,null,null,null,775,4.4256521739131062E-2,3.1515151515151191E-2,2.0770176157312602E-2,4.4481548699334592E-4,2.8869292981998263E-4,2.1118033723920943E-4,2.8797066014670282E-3,1.8406000937646716E-3,1.1609302325581391E-3,null,null,0,null,null,775]
[null,null,null,null,null,null,null,776,4.4194265469513133E-2,3.1470792960496409E-2,2.0740607409346801E-2,4.4418132611637401E-4,2.8828378195308336E-4,2.1088140275573745E-4,2.875628692807301E-3,1.8380149812734288E-3,1.1592910489354583E-3,null,null,0,null,null,776]
[null,null,null,null,null,null,null,777,4.4132184107385036E-2,3.1426559102414334E-2,2.0711122730763604E-2,4.4354897087566105E-4,2.8787579216832821E-4,2.1058331338417343E-4,2.8715623171445639E-3,1.8354371201496234E-3,1.1576564876998995E-3,null,null,0,null,null,777]
[null,null,null,null,null,null,null,778,4.4070276916683165E-2,3.1382449415840161E-2,2.0681721763534933E-2,4.4291841357043088E-4,2.8746895555578476E-4,2.1028606554577666E-4,2.8675074256220832E-3,1.8328664799253241E-3,1.1560265293267626E-3,null,null,0,null,null,778]
[null,null,null,null,null,null,null,779,4.4008543165468247E-2,3.1338463378652842E-2,2.0652404151662813E-2,4.4228964654363521E-4,2.8706326723323717E-4,2.0998965568198435E-4,2.8634639696586955E-3,1.830303030303051E-3,1.1544011544011542E-3,null,null,0,null,null,779]
[null,null,null,null,null,null,null,780,4.394698212589649E-2,3.129460047165445E-2,2.0623169541165016E-2,4.4166266218164399E-4,2.8665872234599071E-4,2.0969408025426917E-4,2.8594319009468674E-3,1.8277467411545833E-3,1.1527803436172175E-3,null,null,0,null,null,780]
[null,null,null,null,null,null,null,781,4.3885593074190946E-2,3.1250860178549805E-2,2.0594017580060801E-2,4.4103745291393804E-4,2.8625531606667805E-4,2.0939933574399896E-4,2.855411171450772E-3,1.8251975825197791E-3,1.1511640777773675E-3,null,null,0,null,null,781]
[null,null,null,null,null,null,null,782,4.3824375290613192E-2,3.1207241985926181E-2,2.0564947918356783E-2,4.4041401121280426E-4,2.8585304359506736E-4,2.0910541865229665E-4,2.8514017334043832E-3,1.8226555246054063E-3,1.1495523377915329E-3,null,null,0,null,null,782]
[null,null,null,null,null,null,null,783,4.3763328059435169E-2,3.1163745383233226E-2,2.0535960208032954E-2,4.3979232959303352E-4,2.8545190015787184E-4,2.0881232549990213E-4,2.8474035393095797E-3,1.82012053778398E-3,1.1479451046764043E-3,null,null,0,null,null,783]
[null,null,null,null,null,null,null,784,4.3702450668911298E-2,3.1120369862763047E-2,2.050705410302877E-2,4.3917240061162134E-4,2.8505188100856095E-4,2.0852005282703484E-4,2.8434165419342732E-3,1.8175925925926135E-3,1.1463423595546899E-3,null,null,0,null,null,784]
[null,null,null,null,null,null,null,785,4.3641742411250836E-2,3.1077114919630448E-2,2.0478229259229375E-2,4.385542168674704E-4,2.8465298142717324E-4,2.0822859719325752E-4,2.8394406943105465E-3,1.8150716597318747E-3,1.1447440836543752E-3,null,null,0,null,null,785]
[null,null,null,null,null,null,null,786,4.3581202582590399E-2,3.1033980051753347E-2,2.0449485334451973E-2,4.3793777100109647E-4,2.842551967201306E-4,2.0793795517734152E-4,2.8354759497328098E-3,1.8125577100646562E-3,1.1431502583079908E-3,null,null,0,null,null,786]
[null,null,null,null,null,null,null,787,4.3520830482966823E-2,3.0990964759833348E-2,2.0420821988432265E-2,4.3732305569433596E-4,2.8385852222005431E-4,2.0764812337713251E-4,2.8315222617559732E-3,1.8100507146150508E-3,1.1415608649518857E-3,null,null,0,null,null,787]
[null,null,null,null,null,null,null,788,4.346062541629013E-2,3.094806854733647E-2,2.0392238882811026E-2,4.3671006367005662E-4,2.8346295328558231E-4,2.0735909840941823E-4,2.8275795841936294E-3,1.8075506445672399E-3,1.1399758851255066E-3,null,null,0,null,null,788]
[null,null,null,null,null,null,null,789,4.3400586690316822E-2,3.0905290920474053E-2,2.0363735681120806E-2,4.3609878769187028E-4,2.8306848530118827E-4,2.0707087690979636E-4,2.8236478711162606E-3,1.8050574712643885E-3,1.1383953004706824E-3,null,null,0,null,null,789]
[null,null,null,null,null,null,null,790,4.334071361662329E-2,3.0862631388183799E-2,2.0335312048772699E-2,4.3548922056384795E-4,2.826751136770023E-4,2.0678345553254424E-4,2.8197270768494484E-3,1.8025711662075505E-3,1.1368190927309161E-3,null,null,0,null,null,790]
[null,null,null,null,null,null,null,791,4.3281005510579569E-2,3.0820089462110994E-2,2.0306967653043281E-2,4.348813551302378E-4,2.8228283384863247E-4,2.0649683095048951E-4,2.8158171559721111E-3,1.8000917010545828E-3,1.1352472437506818E-3,null,null,0,null,null,791]
[null,null,null,null,null,null,null,792,4.322146169132321E-2,3.0777664656589859E-2,2.0278702163061605E-2,4.3427518427518482E-4,2.8189164127698864E-4,2.0621099985488139E-4,2.8119180633147467E-3,1.7976190476190683E-3,1.1336797354747283E-3,null,null,0,null,null,792]
[null,null,null,null,null,null,null,793,4.316208148173338E-2,3.0735356488625069E-2,2.0250515249796337E-2,4.3367070092245315E-4,2.8150153144810712E-4,2.059259589552637E-4,2.8080297539576932E-3,1.795153177869248E-3,1.1321165499473854E-3,null,null,0,null,null,793]
[null,null,null,null,null,null,null,794,4.3102864208405235E-2,3.0693164477873444E-2,2.022240658604299E-2,4.3306789803515105E-4,2.8111249987297735E-4,2.0564170497934834E-4,2.804152183229405E-3,1.7926940639269614E-3,1.1305576693118814E-3,null,null,0,null,null,794]
[null,null,null,null,null,null,null,795,4.3043809201624435E-2,3.065108814662575E-2,2.0194375846411258E-2,4.3246676861545752E-4,2.807245420873695E-4,2.0535823467289022E-4,2.8002853067047428E-3,1.7902416780665961E-3,1.1290030758096615E-3,null,null,0,null,null,795]
[null,null,null,null,null,null,null,796,4.2984915795341909E-2,3.0609127019788674E-2,2.0166422707312458E-2,4.3186730570435165E-4,2.8033765365166374E-4,2.0507554479956306E-4,2.7964290802032737E-3,1.7877959927140462E-3,1.1274527517797128E-3,null,null,0,null,null,796]
[null,null,null,null,null,null,null,797,4.2926183327148822E-2,3.0567280624866942E-2,2.0138546846947086E-2,4.3126950238134396E-4,2.7995183015068085E-4,2.0479363214083608E-4,2.7925834597875921E-3,1.7853569804456779E-3,1.1259066796578973E-3,null,null,0,null,null,797]
[null,null,null,null,null,null,null,798,4.2867611138251716E-2,3.0525548491945585E-2,2.0110747945292461E-2,4.3067335176421022E-4,2.7956706719351441E-4,2.0451249349585218E-4,2.7887484017616493E-3,1.782924613987305E-3,1.1243648419762872E-3,null,null,0,null,null,798]
[null,null,null,null,null,null,null,799,4.28091985734479E-2,3.0483930153672355E-2,2.0083025684090487E-2,4.300788470087275E-4,2.7918336041336404E-4,2.0423212568130631E-4,2.7849238626690975E-3,1.7804988662131725E-3,1.1228272213625074E-3,null,null,{"$f":"IF($T$1=1,R451,IF($T$1=2,H451,IF($T$1=3,H451,IF($T$1=4,H451,IF($T$1=5,A451,IF($T$1=6,A451,IF($T$1=7,A451,IF($T$1=8,H451,IF($T$1=9,H451,IF($T$1=10,H451,IF($T$1=11,A451,IF($T$1=12,A451,IF($T$1=13,H451,IF($T$1=14,H451,IF($T$1=15,H451,IF($T$1=21,V451,IF($T$1=22,W451,0)))))))))))))))))","v":0},null,null,799]
[null,null,null,null,null,null,null,800,4.2750944981100998E-2,3.0442425145240277E-2,2.0055379746835487E-2,4.2948598130841171E-4,2.7880070546737039E-4,2.0395252553132584E-4,2.7811097992916528E-3,1.7780797101449482E-3,1.1212938005390831E-3,null,null,0,null,null,800]
[null,null,null,null,null,null,null,801,4.2692849713116744E-2,3.0401033004370335E-2,2.0027809818762191E-2,4.2889474789425844E-4,2.7841909803645121E-4,2.03673689897351E-4,2.7773061686474604E-3,1.7756671189507215E-3,1.1197645623227935E-3,null,null,0,null,null,801]
[null,null,null,null,null,null,null,802,4.263491212491894E-2,3.0359753271294317E-2,2.0000315586833763E-2,4.283051400344849E-4,2.7803853382513875E-4,2.0339561564801687E-4,2.7735129279894857E-3,1.7732610659440134E-3,1.1182394896240276E-3,null,null,0,null,null,802]
[null,null,null,null,null,null,null,803,4.2577131575425593E-2,3.0318585488737799E-2,1.9972896739729958E-2,4.277171510342747E-4,2.776590085614187E-4,2.0311829966903624E-4,2.7697300348039108E-3,1.7708615245827901E-3,1.1167185654461502E-3,null,null,0,null,null,803]
[null,null,null,null,null,null,null,804,4.2519507427025295E-2,3.0277529201903242E-2,1.9945552967835387E-2,4.2713077423552428E-4,2.7728051799657036E-4,2.0284173886308304E-4,2.7659574468085458E-3,1.7684684684684891E-3,1.1152017728848693E-3,null,null,0,null,null,804]
[null,null,null,null,null,null,null,805,4.2462039045553755E-2,3.0236583958453266E-2,1.9918283963227833E-2,4.2654600301659178E-4,2.7690305790500805E-4,2.0256593014967748E-4,2.7621951219512545E-3,1.7660818713450496E-3,1.11368909512761E-3,null,null,0,null,null,805]
[null,null,null,null,null,null,null,806,4.2404725800270562E-2,3.0195749308494012E-2,1.9891089419666726E-2,4.2596283079204757E-4,2.7652662408412382E-4,2.0229087046507121E-4,2.7584430184083917E-3,1.7637017070979537E-3,1.1121805154528925E-3,null,null,0,null,null,806]
[null,null,null,null,null,null,null,807,4.2347567063836064E-2,3.0155024804558686E-2,1.9863969032581662E-2,4.2538125101242733E-4,2.7615121235413149E-4,2.0201655676213418E-4,2.7547010945832518E-3,1.7613279497532726E-3,1.1106760172297175E-3,null,null,0,null,null,807]
[null,null,null,null,null,null,null,808,4.2290562212288517E-2,3.0114410001591211E-2,1.9836922499061022E-2,4.2480125716398649E-4,2.7577681855791203E-4,2.0174298601024208E-4,2.7509693091045339E-3,1.7589605734767222E-3,1.1091755839169539E-3,null,null,0,null,null,808]
[null,null,null,null,null,null,null,809,4.2233710625021362E-2,3.0073904456929999E-2,1.9809949517840725E-2,4.2422284276845727E-4,2.7540343856086001E-4,2.0147015519516459E-4,2.747247620824816E-3,1.7565995525727265E-3,1.1076791990627327E-3,null,null,0,null,null,809]
[null,null,null,null,null,null,null,810,4.2177011684760707E-2,3.0033507730291897E-2,1.9783049789293013E-2,4.2364600138280762E-4,2.7503106825073147E-4,2.011980613189548E-4,2.7435359888190428E-3,1.7542448614834866E-3,1.1061868463038466E-3,null,null,0,null,null,810]
[null,null,null,null,null,null,null,811,4.2120464777542985E-2,2.9993219383756195E-2,1.975622301541536E-2,4.2307072659900167E-4,2.7465970353749298E-4,2.0092670139983939E-4,2.7398343723830259E-3,1.7518964747880602E-3,1.1046985093651521E-3,null,null,0,null,null,811]
[null,null,null,null,null,null,null,812,4.206406929269281E-2,2.9953038981748847E-2,1.972946889981949E-2,4.2249701204376261E-4,2.7428934035317158E-4,2.0065607247210971E-4,2.7361427310319546E-3,1.749554367201445E-3,1.1032141720589792E-3,null,null,0,null,null,812]
[null,null,null,null,null,null,null,813,4.200782462280097E-2,2.991296609102673E-2,1.9702787147720436E-2,4.2192485137833736E-4,2.7391997465170685E-4,2.0038617158601359E-4,2.7324610244989218E-3,1.7472185135736726E-3,1.1017338182845436E-3,null,null,0,null,null,813]
[null,null,null,null,null,null,null,814,4.1951730163702614E-2,2.9873000280662108E-2,1.9676177465925725E-2,4.2135423829826299E-4,2.7355160240880288E-4,2.0011699580764844E-4,2.7287892127334581E-3,1.7448888888889074E-3,1.1002574320273652E-3,null,null,0,null,null,814]
[null,null,null,null,null,null,null,815,4.1895785314455661E-2,2.9833141122027167E-2,1.9649639562824641E-2,4.2078516653313544E-4,2.7318421962178272E-4,1.998485422188547E-4,2.7251272559000814E-3,1.7425654682645545E-3,1.0987849973586896E-3,null,null,0,null,null,815]
[null,null,null,null,null,null,null,816,4.1839989477319296E-2,2.9793388188778684E-2,1.9623173148377561E-2,4.2021762984637944E-4,2.7281782230944299E-4,1.9958080791711053E-4,2.7214751143768549E-3,1.7402482269503728E-3,1.0973164984349169E-3,null,null,0,null,null,816]
[null,null,null,null,null,null,null,817,4.178434205773271E-2,2.9753741056842854E-2,1.9596777934105407E-2,4.1965162203502098E-4,2.7245240651191019E-4,1.9931379001542713E-4,2.7178327487539585E-3,1.7379371403275965E-3,1.0958519194970318E-3,null,null,0,null,null,817]
[null,null,null,null,null,null,null,818,4.1728842464293939E-2,2.9714199304400182E-2,1.9570453633079139E-2,4.190871369294611E-4,2.7208796829049825E-4,1.9904748564224503E-4,2.7142001198322704E-3,1.7356321839080639E-3,1.0943912448700406E-3,null,null,0,null,null,818]
[null,null,null,null,null,null,null,819,4.1673490108738984E-2,2.9674762511870539E-2,1.954419995990939E-2,4.1852416839325207E-4,2.7172450372756659E-4,1.9878189194133102E-4,2.7105771886219627E-3,1.7333333333333508E-3,1.0929344589624126E-3,null,null,0,null,null,819]
[null,null,null,null,null,null,null,820,4.1618284405920962E-2,2.9635430261898309E-2,1.9518016630736122E-2,4.179627103228746E-4,2.7136200892638018E-4,1.9851700607167625E-4,2.706963916341106E-3,1.7310405643739151E-3,1.0914815462655237E-3,null,null,0,null,null,820]
[null,null,null,null,null,null,null,821,4.1563224773789521E-2,2.9596202139337693E-2,1.9491903363218412E-2,4.1740275664751752E-4,2.7100048001096996E-4,1.9825282520739471E-4,2.7033602644142844E-3,1.7287538529282425E-3,1.0900324913531074E-3,null,null,0,null,null,821]
[null,null,null,null,null,null,null,822,4.150831063337037E-2,2.9557077731238054E-2,1.9465859876524307E-2,4.1684430132885893E-4,2.7063991312599494E-4,1.9798934653762293E-4,2.6997661944712223E-3,1.7264731750220046E-3,1.0885872788807087E-3,null,null,0,null,null,822]
[null,null,null,null,null,null,null,823,4.1453541408744986E-2,2.9518056626829485E-2,1.9439885891320743E-2,4.1628733836084932E-4,2.7028030443660496E-4,1.977265672664201E-4,2.6961816683454252E-3,1.7241985068072194E-3,1.0871458935851422E-3,null,null,0,null,null,823]
[null,null,null,null,null,null,null,824,4.139891652703049E-2,2.9479138417508391E-2,1.9413981129763568E-2,4.1573186176949574E-4,2.6992165012830471E-4,1.9746448461266936E-4,2.6926066480728256E-3,1.7219298245614201E-3,1.0857083202839542E-3,null,null,0,null,null,824]
[null,null,null,null,null,null,null,825,4.1344435418359665E-2,2.9440322696823232E-2,1.9388145315487632E-2,4.1517786561264875E-4,2.6956394640681924E-4,1.9720309580997954E-4,2.6890410958904463E-3,1.7196671046868319E-3,1.0842745438748912E-3,null,null,0,null,null,825]
[null,null,null,null,null,null,null,826,4.1290097515861129E-2,2.9401609060460403E-2,1.9362378173596956E-2,4.146253439797903E-4,2.6920718949795957E-4,1.9694239810658782E-4,2.6854849742350665E-3,1.7174103237095526E-3,1.0828445493353692E-3,null,null,0,null,null,826]
[null,null,null,null,null,null,null,827,4.1235902255639709E-2,2.9362997106230155E-2,1.933667943065499E-2,4.1407429099182358E-4,2.6885137564749045E-4,1.9668238876526339E-4,2.6819382457419065E-3,1.7151594582787402E-3,1.0814183217219505E-3,null,null,0,null,null,827]
[null,null,null,null,null,null,null,828,4.1181849076756878E-2,2.93244864340527E-2,1.9311048814674936E-2,4.1352470080086441E-4,2.6849650112099839E-4,1.9642306506321126E-4,2.6784008732433158E-3,1.7129144851658099E-3,1.0799958461698222E-3,null,null,0,null,null,828]
[null,null,null,null,null,null,null,829,4.1127937421211458E-2,2.9286076645944369E-2,1.9285486055110143E-2,4.1297656759003445E-4,2.6814256220376111E-4,1.9616442429197769E-4,2.674872819767477E-3,1.7106753812636323E-3,1.0785771078922802E-3,null,null,0,null,null,829]
[null,null,null,null,null,null,null,830,4.1074166733920385E-2,2.9247767346003914E-2,1.9259990882844615E-2,4.1242988557325607E-4,2.6778955520061784E-4,1.9590646375735544E-4,2.6713540485371187E-3,1.7084421235857422E-3,1.0771620921802172E-3,null,null,0,null,null,830]
[null,null,null,null,null,null,null,831,4.1020536462699687E-2,2.9209558140398918E-2,1.9234563030183532E-2,4.1188464899504857E-4,2.6743747643584096E-4,1.9564918077929051E-4,2.6678445229682333E-3,1.7062146892655519E-3,1.0757507844016132E-3,null,null,0,null,null,831]
[null,null,null,null,null,null,null,832,4.0967046058245533E-2,2.9171448637352274E-2,1.9209202230843905E-2,4.1134085213032632E-4,2.6708632225300817E-4,1.9539257269178924E-4,2.6643442066688135E-3,1.7039930555555706E-3,1.0743431700010327E-3,null,null,0,null,null,832]
[null,null,null,null,null,null,null,833,4.0913694974115525E-2,2.91334384471288E-2,1.9183908219945273E-2,4.1079848928419837E-4,2.6673608901487593E-4,1.9513663684282622E-4,2.6608530634375919E-3,1.7017771998266297E-3,1.0729392344991228E-3,null,null,0,null,null,833]
[null,null,null,null,null,null,null,834,4.0860482666710086E-2,2.9095527182021973E-2,1.9158680734000486E-2,4.1025755479176946E-4,2.6638677310325402E-4,1.9488137059425295E-4,2.6573710572627939E-3,1.6995670995671145E-3,1.0715389634921178E-3,null,null,0,null,null,834]
[null,null,null,null,null,null,null,835,4.0807408595253968E-2,2.9057714456340721E-2,1.9133519510906548E-2,4.0971804301794326E-4,2.660383709188808E-4,1.946267713217071E-4,2.6538981523209007E-3,1.6973627323822022E-3,1.0701423426513459E-3,null,null,0,null,null,835]
[null,null,null,null,null,null,null,836,4.0754472221777964E-2,2.9019999886396367E-2,1.9108424289935543E-2,4.091799483572261E-4,2.6569087888129989E-4,1.9437283641452277E-4,2.650434312975417E-3,1.695164075993106E-3,1.0687493577227415E-3,null,null,0,null,null,836]
[null,null,null,null,null,null,null,837,4.0701673011100697E-2,2.8982383090489634E-2,1.9083394811725624E-2,4.0864326523353315E-4,2.6534429342873691E-4,1.9411956327564106E-4,2.6469795037756556E-3,1.692971108236323E-3,1.0673599945263588E-3,null,null,0,null,null,837]
[null,null,null,null,null,null,null,838,4.064901043081063E-2,2.8944863688897773E-2,1.9058430818272104E-2,4.0810798809999609E-4,2.6499861101797847E-4,1.938669493215216E-4,2.6435336894555278E-3,1.6907838070628911E-3,1.0659742389558917E-3,null,null,0,null,null,838]
[null,null,null,null,null,null,null,839,4.0596483951248132E-2,2.8907441303861782E-2,1.903353205291854E-2,4.0757411143877125E-4,2.6465382812425092E-4,1.9361499198205479E-4,2.6400968349323405E-3,1.6886021505376483E-3,1.064592076978196E-3,null,null,0,null,null,839]
[null,null,null,null,null,null,null,840,4.0544093045487735E-2,2.887011555957375E-2,1.9008698260347998E-2,4.070416297608508E-4,2.6430994124110085E-4,1.9336368870047447E-4,2.6366689053056096E-3,1.6864261168385017E-3,1.0632134946328162E-3,null,null,0,null,null,840]
[null,null,null,null,null,null,null,841,4.0491837189320527E-2,2.8832886082164239E-2,1.8983929186574273E-2,4.0651053760587416E-4,2.639669468802762E-4,1.9311303693327159E-4,2.6332498658558751E-3,1.6842556842556978E-3,1.0618384780315146E-3,null,null,0,null,null,841]
[null,null,null,null,null,null,null,842,4.0439715861236639E-2,2.8795752499689835E-2,1.8959224578933266E-2,4.0598082954194144E-4,2.6362484157160793E-4,1.9286303415010837E-4,2.6298396820435312E-3,1.6820908311911016E-3,1.0604670133578054E-3,null,null,0,null,null,842]
[null,null,null,null,null,null,null,843,4.0387728542407915E-2,2.8758714442120741E-2,1.8934584186074375E-2,4.0545250016542833E-4,2.6328362186289365E-4,1.9261367783373297E-4,2.6264383195076621E-3,1.6799315361574799E-3,1.0590990868664921E-3,null,null,0,null,null,843]
[null,null,null,null,null,null,null,844,4.0335874716670703E-2,2.8721771541328489E-2,1.8910007757951972E-2,4.0492554410080238E-4,2.6294328431978085E-4,1.9236496547989532E-4,2.6230457440648875E-3,1.6777777777777908E-3,1.0577346848832082E-3,null,null,0,null,null,844]
[null,null,null,null,null,null,null,845,4.0284153870508758E-2,2.8684923431073768E-2,1.888549504581695E-2,4.0439995600044049E-4,2.626038255256521E-4,1.9211689459726304E-4,2.6196619217082203E-3,1.6756295347844772E-3,1.0563737938039611E-3,null,null,0,null,null,845]
[null,null,null,null,null,null,null,846,4.023256549303629E-2,2.864816974699428E-2,1.8861045802208338E-2,4.0387573054444839E-4,2.6226524208151062E-4,1.9186946270733832E-4,2.6162868186059263E-3,1.6734867860187679E-3,1.0550164000946807E-3,null,null,0,null,null,846]
[null,null,null,null,null,null,null,847,4.0181109075981152E-2,2.8611510126592757E-2,1.883665978094495E-2,4.0335286244048063E-4,2.6192753060586671E-4,1.9162266734437547E-4,2.6129204011003993E-3,1.6713495104299827E-3,1.0536624902907701E-3,null,null,0,null,null,847]
[null,null,null,null,null,null,null,848,4.0129784113668146E-2,2.8574944209225038E-2,1.8812336737117144E-2,4.0283134642356294E-4,2.6159068773462524E-4,1.9137650605529879E-4,2.6095626357070414E-3,1.6692176870748423E-3,1.0523120509966608E-3,null,null,0,null,null,848]
[null,null,null,null,null,null,null,849,4.0078590103002458E-2,2.8538471636088251E-2,1.878807642707862E-2,4.0231117725591527E-4,2.6125471012097411E-4,1.911309763996216E-4,2.6062134891131523E-3,1.6670912951167851E-3,1.0509650688853706E-3,null,null,0,null,null,849]
[null,null,null,null,null,null,null,850,4.0027526543453214E-2,2.8502092050209055E-2,1.8763878608438266E-2,4.017923497267765E-4,2.60919594435273E-4,1.9088607594936529E-4,2.602872928176831E-3,1.6649703138252878E-3,1.0496215306980653E-3,null,null,0,null,null,850]
[null,null,null,null,null,null,null,851,3.9976592937037168E-2,2.8465805096432019E-2,1.8739743040052118E-2,4.0127485865223045E-4,2.60585337364944E-4,1.9064180228897952E-4,2.5995409199258764E-3,1.6628547225751918E-3,1.0482814232436245E-3,null,null,0,null,null,851]
[null,null,null,null,null,null,null,852,3.9925788788302524E-2,2.8429610421408041E-2,1.871566948201531E-2,4.0075869887503323E-4,2.6025193561436184E-4,1.9039815301526261E-4,2.596217431556708E-3,1.6607445008460355E-3,1.0469447333982078E-3,null,null,0,null,null,852]
[null,null,null,null,null,null,null,853,3.987511360431286E-2,2.8393507673582893E-2,1.869165769565417E-2,4.0024386526444191E-4,2.5991938590474593E-4,1.9015512573728293E-4,2.5929024304332869E-3,1.6586396282213887E-3,1.045611448104829E-3,null,null,0,null,null,853]
[null,null,null,null,null,null,null,854,3.9824566894631194E-2,2.8357496503185847E-2,1.8667707443518294E-2,3.9973035271604452E-4,2.5958768497405272E-4,1.899127180763005E-4,2.5895958840860471E-3,1.6565400843881971E-3,1.0442815543729286E-3,null,null,0,null,null,854]
[null,null,null,null,null,null,null,855,3.9774148171304133E-2,2.832157656221836E-2,1.8643818489372729E-2,3.9921815615159134E-4,2.5925682957686914E-4,1.8967092766568946E-4,2.5862977602108391E-3,1.6544458491361258E-3,1.0429550392779539E-3,null,null,0,null,null,855]
[null,null,null,null,null,null,null,856,3.9723856948846233E-2,2.8285747504442873E-2,1.8619990598190226E-2,3.9870727051882749E-4,2.5892681648430679E-4,1.8942975215086112E-4,2.5830080266678718E-3,1.6523569023569134E-3,1.0416318899609384E-3,null,null,0,null,null,856]
[null,null,null,null,null,null,null,857,3.9673692744224352E-2,2.8250008985371684E-2,1.8596223536143503E-2,3.981976907913269E-4,2.5859764248389676E-4,1.8918918918918738E-4,2.5797266514806733E-3,1.6502732240437268E-3,1.0403120936280882E-3,null,null,0,null,null,857]
[null,null,null,null,null,null,null,858,3.9623655076842228E-2,2.8214360662255914E-2,1.8572517070597618E-2,3.976894119683273E-4,2.5826930437948542E-4,1.8894923644992507E-4,2.5764536028350534E-3,1.6481947942905229E-3,1.0389956375503676E-3,null,null,0,null,null,858]
[null,null,null,null,null,null,null,859,3.9573743468525109E-2,2.8178802194074551E-2,1.8548870970102369E-2,3.9718242907456678E-4,2.5794179899113115E-4,1.8870989161414047E-4,2.573188849078074E-3,1.6461215932914153E-3,1.0376825090630921E-3,null,null,0,null,null,859]
[null,null,null,null,null,null,null,860,3.9523957443504516E-2,2.8143333241523551E-2,1.8525285004384759E-2,3.9667673716012141E-4,2.5761512315500133E-4,1.8847115237463475E-4,2.5699323587170327E-3,1.6440536013400441E-3,1.0363726955655206E-3,null,null,0,null,null,860]
[null,null,null,null,null,null,null,861,3.9474296528403167E-2,2.8107953467005085E-2,1.8501758944341529E-2,3.9617233130024405E-4,2.57289273723271E-4,1.8823301643586978E-4,2.5666841004184453E-3,1.6419907988289521E-3,1.0350661845204524E-3,null,null,0,null,null,861]
[null,null,null,null,null,null,null,862,3.9424760252219908E-2,2.8072662534616787E-2,1.8478292562031741E-2,3.9566920659520478E-4,2.5696424756402114E-4,1.8799548151389458E-4,2.5634440430070439E-3,1.6399331662489659E-3,1.0337629634538284E-3,null,null,0,null,null,862]
[null,null,null,null,null,null,null,863,3.9375348146314881E-2,2.8037460110141171E-2,1.8454885630669403E-2,3.9516735817013188E-4,2.5664004156113868E-4,1.8775854533627232E-4,2.5602121554647778E-3,1.637880684188579E-3,1.0324630199543331E-3,null,null,{"$f":"IF($T$1=1,R515,IF($T$1=2,H515,IF($T$1=3,H515,IF($T$1=4,H515,IF($T$1=5,A515,IF($T$1=6,A515,IF($T$1=7,A515,IF($T$1=8,H515,IF($T$1=9,H515,IF($T$1=10,H515,IF($T$1=11,A515,IF($T$1=12,A515,IF($T$1=13,H515,IF($T$1=14,H515,IF($T$1=15,H515,IF($T$1=21,V515,IF($T$1=22,W515,0)))))))))))))))))","v":0},null,null,863]
[null,null,null,null,null,null,null,864,3.932605974439473E-2,2.8002345861035026E-2,1.843153792461618E-2,3.9466678117485452E-4,2.5631665261421698E-4,1.8752220564200771E-4,2.5569884069298254E-3,1.6358333333333433E-3,1.0311663416730011E-3,null,null,0,null,null,864]
[null,null,null,null,null,null,null,865,3.9276894582497897E-2,2.796731945641899E-2,1.8408249219374125E-2,3.9416747078374663E-4,2.5599407763845665E-4,1.8728646018147536E-4,2.5537727666956121E-3,1.6337910944652615E-3,1.0298729163228254E-3,null,null,0,null,null,865]
[null,null,null,null,null,null,null,866,3.9227852198980111E-2,2.7932380567067126E-2,1.8385019291578507E-2,3.9366942219557172E-4,2.55672313564568E-4,1.8705130671634813E-4,2.5505652042098321E-3,1.6317539484621874E-3,1.0285827316783699E-3,null,null,0,null,null,866]
[null,null,null,null,null,null,null,867,3.9178932134499918E-2,2.7897528865396638E-2,1.8361847918990648E-2,3.9317263063332888E-4,2.5535135733867304E-4,1.8681674301952633E-4,2.5473656890734847E-3,1.6297218762972281E-3,1.0272957755753842E-3,null,null,0,null,null,867]
[null,null,null,null,null,null,null,868,3.9130133932004346E-2,2.7862764025457596E-2,1.8338734880490849E-2,3.9267709134410027E-4,2.5503120592220942E-4,1.8658276687506765E-4,2.5441741910399111E-3,1.6276948590381519E-3,1.0260120359104209E-3,null,null,0,null,null,868]
[null,null,null,null,null,null,null,869,3.9081457136714667E-2,2.7828085722922804E-2,1.8315679956071352E-2,3.921827995988996E-4,2.5471185629183423E-4,1.8634937607811704E-4,2.5409906800138425E-3,1.6256728778467999E-3,1.0247315006404569E-3,null,null,0,null,null,869]
[null,null,null,null,null,null,null,870,3.9032901296112255E-2,2.7793493635077698E-2,1.829268292682935E-2,3.916897506925213E-4,2.5439330543932889E-4,1.8611656843483775E-4,2.5378151260504554E-3,1.6236559139785037E-3,1.0234541577825156E-3,null,null,0,null,null,870]
[null,null,null,null,null,null,null,871,3.8984465959924608E-2,2.7758987440810342E-2,1.8269743574960081E-2,3.9119793994339149E-4,2.5407555037150486E-4,1.8588434176234237E-4,2.5346474993544299E-3,1.621643948781504E-3,1.0221799954132946E-3,null,null,0,null,null,871]
[null,null,null,null,null,null,null,872,3.8936150680111366E-2,2.7724566820601503E-2,1.8246861683749938E-2,3.9070736269342001E-4,2.5375858811010964E-4,1.8565269388862469E-4,2.5314877702790192E-3,1.6196369636963782E-3,1.0209090016687933E-3,null,null,0,null,null,872]
[null,null,null,null,null,null,null,873,3.8887955010850558E-2,2.7690231456514756E-2,1.8224037037569637E-2,3.9021801430785287E-4,2.5344241569173379E-4,1.8542162265249202E-4,2.5283359093251257E-3,1.6176349402554678E-3,1.0196411647439456E-3,null,null,0,null,null,873]
[null,null,null,null,null,null,null,874,3.8839878508524842E-2,2.7655981032186736E-2,1.8201269421867453E-2,3.8972989017512665E-4,2.5312703016771882E-4,1.8519112590349791E-4,2.5251918871403807E-3,1.6156378600823127E-3,1.0183764728922543E-3,null,null,0,null,null,874]
[null,null,null,null,null,null,null,875,3.879192073170791E-2,2.7621815232817374E-2,1.8178558623162509E-2,3.8924298570672364E-4,2.5281242860406505E-4,1.8496120150187555E-4,2.5220556745182364E-3,1.6136457048910892E-3,1.0171149144254277E-3,null,null,0,null,null,875]
[null,null,null,null,null,null,null,876,3.8744081241151002E-2,2.7587733745160319E-2,1.8155904429038069E-2,3.8875729633702782E-4,2.5249860808134117E-4,1.8473184731847137E-4,2.5189272423970584E-3,1.6116584564860508E-3,1.0158564777130203E-3,null,null,0,null,null,876]
[null,null,null,null,null,null,null,877,3.8696359599769456E-2,2.7553736257513287E-2,1.8133306628134966E-2,3.882728175231824E-4,2.5218556569459348E-4,1.8450306123467955E-4,2.5158065618592291E-3,1.6096760967609755E-3,1.0146011511820751E-3,null,null,0,null,null,877]
[null,null,null,null,null,null,null,878,3.864875537262942E-2,2.7519822459708618E-2,1.8110765010144969E-2,3.8778954474494797E-4,2.518732985532565E-4,1.8427484114237654E-4,2.512693604130257E-3,1.6076986076986155E-3,1.0133489233167688E-3,null,null,0,null,null,878]
[null,null,null,null,null,null,null,879,3.8601268126934637E-2,2.7485992043103816E-2,1.8088279365804316E-2,3.8730747350456215E-4,2.5156180378106392E-4,1.8404718494385649E-4,2.5095883405778924E-3,1.6057259713701507E-3,1.0120997826580593E-3,null,null,0,null,null,879]
[null,null,null,null,null,null,null,880,3.8553897432013318E-2,2.7452244700572181E-2,1.8065849486887203E-2,3.8682659932659985E-4,2.5125107851596036E-4,1.8382009055176697E-4,2.5064907427112502E-3,1.603758169934648E-3,1.0108537178033369E-3,null,null,0,null,null,880]
[null,null,null,null,null,null,null,881,3.8506642859305128E-2,2.7418580126493553E-2,1.8043475166199353E-2,3.8634691775783487E-4,2.5094111991001369E-4,1.8359355588904499E-4,2.5034007821799365E-3,1.6017951856385222E-3,1.0096107174060768E-3,null,null,0,null,null,881]
[null,null,null,null,null,null,null,882,3.8459503982348285E-2,2.7384998016745037E-2,1.8021156197571674E-2,3.8586842436710243E-4,2.5063192512932782E-4,1.8336757888885402E-4,2.5003184307731854E-3,1.599837000815003E-3,1.008370770175495E-3,null,null,0,null,null,882]
[null,null,null,null,null,null,null,883,3.8412480376766679E-2,2.7351498068691867E-2,1.7998892375853882E-2,3.8539111474516271E-4,2.503234913539567E-4,1.831421574945207E-4,2.4972436604189991E-3,1.5978835978836049E-3,1.0071338648762061E-3,null,null,0,null,null,883]
[null,null,null,null,null,null,null,884,3.8365571620257187E-2,2.7318079981178321E-2,1.7976683496908237E-2,3.8491498450456536E-4,2.5001581577781831E-4,1.8291728965947281E-4,2.4941764431832972E-3,1.5959349593496002E-3,1.0058999903278844E-3,null,null,0,null,null,884]
[null,null,null,null,null,null,null,885,3.831877729257701E-2,2.728474345451869E-2,1.7954529357603319E-2,3.8444002927951528E-4,2.4970889560860964E-4,1.8269297334717717E-4,2.4911167512690706E-3,1.5939910678034986E-3,1.0046691354049263E-3,null,null,0,null,null,885]
[null,null,null,null,null,null,null,886,3.8272096975531113E-2,2.7251488190488324E-2,1.7932429755807791E-2,3.8396624472573888E-4,2.4940272806772224E-4,1.8246920653107812E-4,2.4880645570155408E-3,1.5920519059205258E-3,1.0034412890361172E-3,null,null,0,null,null,886]
[null,null,null,null,null,null,null,887,3.8225530252959793E-2,2.7218313892314727E-2,1.7910384490384294E-2,3.8349362652035182E-4,2.4909731039015839E-4,1.8224598719453666E-4,2.4850198328973264E-3,1.5901174564601117E-3,1.0022164402042977E-3,null,null,0,null,null,887]
[null,null,null,null,null,null,null,888,3.8179076710726283E-2,2.7185220264668738E-2,1.7888393361183332E-2,3.8302217036172744E-4,2.4879263982444772E-4,1.8202331333076963E-4,2.481982551523616E-3,1.5881877022653785E-3,1.0009945779460359E-3,null,null,0,null,null,888]
[null,null,null,null,null,null,null,889,3.8132735936704514E-2,2.7152207013655769E-2,1.7866456169037204E-2,3.8255187196936641E-4,2.4848871363256493E-4,1.8180118294278984E-4,2.4789526856373477E-3,1.5862626262626324E-3,9.9977569135129918E-4,null,null,0,null,null,889]
[null,null,null,null,null,null,null,890,3.808650752076688E-2,2.7119273846807103E-2,1.7844572715753997E-2,3.820827270837669E-4,2.4818552908984723E-4,1.8157959404334613E-4,2.4759302081143932E-3,1.5843422114608615E-3,9.9855976956312979E-4,null,null,0,null,null,890]
[null,null,null,null,null,null,null,891,3.8040391054772173E-2,2.7086420473071256E-2,1.7822742804111624E-2,3.8161473146629629E-4,2.4788308348491338E-4,1.8135854465486424E-4,2.4729150919627465E-3,1.5824264409512354E-3,9.97346801777323E-4,null,null,0,null,null,891]
[null,null,null,null,null,null,null,892,3.7994386132553556E-2,2.70536466028054E-2,1.7800966237851896E-2,3.8114788089906325E-4,2.4758137411958273E-4,1.81138032809388E-4,2.4699073103217231E-3,1.580515297906608E-3,9.9613677724210564E-4,null,null,0,null,null,892]
[null,null,null,null,null,null,null,893,3.7948492349906639E-2,2.7020951947766856E-2,1.7779242821674635E-2,3.8068217118479141E-4,2.4728039830879497E-4,1.8091805654852082E-4,2.4669068364611617E-3,1.578608765581027E-3,9.9492968525782041E-4,null,null,0,null,null,893]
[null,null,null,null,null,null,null,894,3.7902709304577661E-2,2.6988336221104636E-2,1.7757572361231842E-2,3.8021759814669311E-4,2.4698015338053028E-4,1.8069861392336784E-4,2.4639136437806307E-3,1.5767068273092424E-3,9.9372551517660905E-4,null,null,0,null,null,894]
[null,null,null,null,null,null,null,895,3.7857036596251704E-2,2.6955799137351074E-2,1.7735954663121899E-2,3.7975415762834467E-4,2.4668063667573068E-4,1.8047970299447821E-4,2.4609277058086436E-3,1.5748094665062227E-3,9.9252425640209926E-4,null,null,0,null,null,895]
[null,null,null,null,null,null,null,896,3.7811473826541049E-2,2.6923340412413472E-2,1.7714389534883811E-2,3.7929184549356272E-4,2.4638184554822112E-4,1.8026132183178814E-4,2.4579489962018803E-3,1.5729166666666719E-3,9.9132589838909504E-4,null,null,0,null,null,896]
[null,null,null,null,null,null,null,897,3.7766020598973604E-2,2.6890959763565848E-2,1.7692876784991506E-2,3.7883065762628083E-4,2.4608377736463183E-4,1.8004346851456407E-4,2.4549774887444075E-3,1.5710284113645511E-3,9.9013043064326723E-4,null,null,0,null,null,897]
[null,null,null,null,null,null,null,898,3.7720676518981359E-2,2.6858656909440712E-2,1.7671416222848152E-2,3.7837058993042742E-4,2.4578642950432079E-4,1.7982614113134634E-4,2.4520131573469149E-3,1.5691446842526029E-3,9.8893784272084651E-4,null,null,0,null,null,898]
[null,null,null,null,null,null,null,899,3.7675441193889013E-2,2.6826431570020945E-2,1.7650007658780536E-2,3.7791163832980458E-4,2.4548979935929701E-4,1.7960933777989339E-4,2.4490559760459475E-3,1.5672654690618811E-3,9.8774812422832152E-4,null,null,0,null,null,899]
[null,null,null,null,null,null,null,900,3.7630314232902612E-2,2.6794283466631673E-2,1.7628650904033472E-2,3.7745379876796766E-4,2.4519388433414421E-4,1.7939305656712614E-4,2.4461059190031506E-3,1.5653907496012806E-3,9.8656126482213401E-4,null,null,0,null,null,900]
[null,null,null,null,null,null,null,901,3.7585295247098333E-2,2.6762212321932259E-2,1.7607345770764258E-2,3.7699706720810568E-4,2.4489868184594517E-4,1.7917729560907298E-4,2.4431629605045158E-3,1.5635205097570737E-3,9.8537725420838173E-4,null,null,0,null,null,901]
[null,null,null,null,null,null,null,902,3.7540383849411239E-2,2.6730217859908312E-2,1.7586092072037166E-2,3.7654143963292277E-4,2.446041893242068E-4,1.7896205303081499E-4,2.4402270749596341E-3,1.5616547334924469E-3,9.8419608214251903E-4,null,null,0,null,null,902]
[null,null,null,null,null,null,null,903,3.7495579654624266E-2,2.6698299805863777E-2,1.7564889621817976E-2,3.760869120445204E-4,2.4431040421078498E-4,1.7874732696643167E-4,2.4372982369009542E-3,1.5597934048470444E-3,9.8301773842906191E-4,null,null,0,null,null,903]
[null,null,null,null,null,null,null,904,3.745088227935716E-2,2.6666457886413083E-2,1.7543738234968537E-2,3.7563348046428039E-4,2.4401732395981104E-4,1.785331155589471E-4,2.4343764209830455E-3,1.5579365079365121E-3,9.8184221292129509E-4,null,null,0,null,null,904]
[null,null,null,null,null,null,null,905,3.7406291342055559E-2,2.6634691829473311E-2,1.7522637727241403E-2,3.7518114093274875E-4,2.4372494603761789E-4,1.783194169602762E-4,2.4314616019818682E-3,1.5560840269520453E-3,9.8066949552098035E-4,null,null,0,null,null,905]
[null,null,null,null,null,null,null,906,3.7361806462980131E-2,2.6603001364256466E-2,1.7501587915274459E-2,3.7472988950952064E-4,2.4343326792266711E-4,1.7810622933117187E-4,2.4285537547940475E-3,1.5542359461599407E-3,9.7949957617806771E-4,null,null,0,null,null,906]
[null,null,null,null,null,null,null,907,3.731742726419579E-2,2.6571386221261772E-2,1.7480588616585621E-2,3.7427972227312579E-4,2.4314228710547664E-4,1.7789355084117192E-4,2.4256528544361502E-3,1.5523922499011506E-3,9.7833244489040766E-4,null,null,0,null,null,907]
[null,null,null,null,null,null,null,908,3.7273153369561017E-2,2.6539846132268056E-2,1.7459639649567565E-2,3.7383063532091482E-4,2.4285200108854841E-4,1.7768137966854688E-4,2.4227588760439732E-3,1.5505529225908409E-3,9.771680917034667E-4,null,null,0,null,null,908]
[null,null,null,null,null,null,null,909,3.7228984404717204E-2,2.6508380830326118E-2,1.7438740833482479E-2,3.7338262476894687E-4,2.4256240738629726E-4,1.7746971400024801E-4,2.4198717948718303E-3,1.5487179487179523E-3,9.7600650671004444E-4,null,null,0,null,null,909]
[null,null,null,null,null,null,null,910,3.7184919997078104E-2,2.6476990049751237E-2,1.7417891988456877E-2,3.7293568675187712E-4,2.4227350352497978E-4,1.7725855203185544E-4,2.4169915862918469E-3,1.5468873128447632E-3,9.7484768004999184E-4,null,null,0,null,null,910]
[null,null,null,null,null,null,null,911,3.7140959775819368E-2,2.6445673526115682E-2,1.7397092935476442E-2,3.7248981742284593E-4,2.4198528704262397E-4,1.7704789196752713E-4,2.4141182257932632E-3,1.5450609996064575E-3,9.7369160190993319E-4,null,null,0,null,null,911]
[null,null,null,null,null,null,null,912,3.7097103371868154E-2,2.6414430996241276E-2,1.7376343496380883E-2,3.7204501295336841E-4,2.4169775548895929E-4,1.7683773201994786E-4,2.4112516889817329E-3,1.5432389937106951E-3,9.7253826252298838E-4,null,null,0,null,null,912]
[null,null,null,null,null,null,null,913,3.7053350417892775E-2,2.6383262198192054E-2,1.7355643493858867E-2,3.7160126953322467E-4,2.4141090642534722E-4,1.7662807041027864E-4,2.4083919515786385E-3,1.5414212799371842E-3,9.7138765216849801E-4,null,null,0,null,null,913]
[null,null,null,null,null,null,null,914,3.7009700548292439E-2,2.6352166871266906E-2,1.7334992751442971E-2,3.7115858337035144E-4,2.4112473742471228E-4,1.7641890536810665E-4,2.4055389894204024E-3,1.5396078431372578E-3,9.7023976117175087E-4,null,null,0,null,null,914]
[null,null,null,null,null,null,null,915,3.6966153399187095E-2,2.6321144755992329E-2,1.731439109350464E-2,3.7071695069073354E-4,2.4083924607147362E-4,1.7621023513139517E-4,2.4026927784578074E-3,1.5377986682334538E-3,9.6909457990371152E-4,null,null,0,null,null,915]
[null,null,null,null,null,null,null,916,3.6922708608407302E-2,2.6290195594115197E-2,1.7293838345249241E-2,3.7027636773829717E-4,2.4055442996147696E-4,1.7600205794643443E-4,2.3998532947553225E-3,1.535993740219095E-3,9.6795209878075246E-4,null,null,0,null,null,916]
[null,null,null,null,null,null,null,917,3.6879365815484184E-2,2.6259319128595627E-2,1.7273334332711093E-2,3.6983683077480281E-4,2.4027028670192739E-4,1.7579437206779224E-4,2.3970205144904291E-3,1.5341930441578769E-3,9.6681230826438575E-4,null,null,0,null,null,917]
[null,null,null,null,null,null,null,918,3.6836124661639477E-2,2.6228515103599817E-2,1.7252878882748582E-2,3.6939833607974005E-4,2.3998681391132194E-4,1.7558717575826525E-4,2.3941944139529566E-3,1.5323965651834529E-3,9.6567519886099824E-4,null,null,0,null,null,918]
[null,null,null,null,null,null,null,919,3.67929847897756E-2,2.6197783264493017E-2,1.7232471823039268E-2,3.6896087995022227E-4,2.3970400921938338E-4,1.7538046728883059E-4,2.3913749695444195E-3,1.5306042884990277E-3,9.6454076112158758E-4,null,null,0,null,null,919]
[null,null,null,null,null,null,null,920,3.6749945844465885E-2,2.6167123357832479E-2,1.7212112982075058E-2,3.6852445870088263E-4,2.3942187026699396E-4,1.7517424493859762E-4,2.3885621577773622E-3,1.5288161993769493E-3,9.634089856415004E-4,null,null,0,null,null,920]
[null,null,null,null,null,null,null,921,3.6707007471944726E-2,2.6136535131360529E-2,1.7191802189157397E-2,3.680890686637703E-4,2.3914039470612989E-4,1.7496850699476045E-4,2.3857559552747068E-3,1.5270322831583063E-3,9.6227986306017305E-4,null,null,0,null,null,921]
[null,null,null,null,null,null,null,922,3.6664169320097972E-2,2.6106018333997623E-2,1.7171539274392491E-2,3.6765470618824804E-4,2.3885958019979634E-4,1.7476325175255018E-4,2.3829563387691042E-3,1.5252525252525274E-3,9.611533840608728E-4,null,null,0,null,null,922]
[null,null,null,null,null,null,null,923,3.6621431038453257E-2,2.6075572715835479E-2,1.7151324068686587E-2,3.6722136764088989E-4,2.3857942442196247E-4,1.7455847751518809E-4,2.3801632851022905E-3,1.5234769111369829E-3,9.6002953937044191E-4,null,null,0,null,null,923]
[null,null,null,null,null,null,null,924,3.6578792278170451E-2,2.6045198028130261E-2,1.713115640374125E-2,3.6678904940538003E-4,2.382999250574974E-4,1.7435418259383875E-4,2.3773767712244511E-3,1.521705426356591E-3,9.5890831975904321E-4,null,null,0,null,null,924]
[null,null,null,null,null,null,null,925,3.6536252692032159E-2,2.60148940232958E-2,1.71110361120487E-2,3.6635774788241202E-4,2.380210798021064E-4,1.7415036530756361E-4,2.3745967741935835E-3,1.5199380565234239E-3,9.5778971603990761E-4,null,null,0,null,null,925]
[null,null,null,null,null,null,null,926,3.649381193443433E-2,2.5984660454896877E-2,1.7090963026887184E-2,3.6592745948958922E-4,2.3774288636226753E-4,1.739470239832749E-4,2.3718232711748711E-3,1.5181747873163202E-3,9.566737190690826E-4,null,null,0,null,null,926]
[null,null,null,null,null,null,null,927,3.6451469661376842E-2,2.5954497077642528E-2,1.7070936982316362E-2,3.6549818066132516E-4,2.3746534245516892E-4,1.7374415695568983E-4,2.3690562394400546E-3,1.5164156044804959E-3,9.5556031974518361E-4,null,null,{"$f":"IF($T$1=1,R579,IF($T$1=2,H579,IF($T$1=3,H579,IF($T$1=4,H579,IF($T$1=5,A579,IF($T$1=6,A579,IF($T$1=7,A579,IF($T$1=8,H579,IF($T$1=9,H579,IF($T$1=10,H579,IF($T$1=11,A579,IF($T$1=12,A579,IF($T$1=13,H579,IF($T$1=14,H579,IF($T$1=15,H579,IF($T$1=21,V579,IF($T$1=22,W579,0)))))))))))))))))","v":0},null,null,927]
[null,null,null,null,null,null,null,928,3.6409225530454267E-2,2.5924403647379426E-2,1.7050957813172722E-2,3.6506990784874533E-4,2.3718844580864604E-4,1.7354176256728523E-4,2.3662956563668129E-3,1.5146604938271618E-3,9.5444950900914658E-4,null,null,0,null,null,928]
[null,null,null,null,null,null,null,929,3.6367079200846607E-2,2.5894379921085273E-2,1.7031025355065069E-2,3.6464263751958951E-4,2.3691219416111995E-4,1.7333983916825225E-4,2.3635414994381473E-3,1.5129094412331418E-3,9.5334127784398178E-4,null,null,0,null,null,929]
[null,null,null,null,null,null,null,930,3.6325030333310117E-2,2.5864425656862276E-2,1.7011139444369987E-2,3.6421636615811424E-4,2.3663658526153555E-4,1.7313838511645168E-4,2.3607937462417667E-3,1.5111624326404937E-3,9.5223561727453049E-4,null,null,0,null,null,930]
[null,null,null,null,null,null,null,931,3.6283078590168251E-2,2.5834540613930659E-2,1.6991299918227377E-2,3.6379109026499684E-4,2.363616168693006E-4,1.729373987773693E-4,2.3580523744694834E-3,1.5094194540561331E-3,9.5113251836722223E-4,null,null,0,null,null,931]
[null,null,null,null,null,null,null,932,3.6241223635302564E-2,2.5804724552622175E-2,1.6971506614536017E-2,3.6336680635723934E-4,2.3608728675422492E-4,1.7273687852407179E-4,2.3553173619166052E-3,1.5076804915514603E-3,9.5003197222983445E-4,null,null,0,null,null,932]
[null,null,null,null,null,null,null,933,3.6199465134143793E-2,2.5774977234373737E-2,1.6951759371949121E-2,3.6294351096807364E-4,2.3581359269646E-4,1.7253682273716281E-4,2.3525886864813393E-3,1.5059455312619878E-3,9.4893397001125318E-4,null,null,0,null,null,933]
[null,null,null,null,null,null,null,934,3.6157802753662885E-2,2.5745298421721026E-2,1.6932058029869992E-2,3.6252120064686672E-4,2.3554053248643934E-4,1.7233722980473928E-4,2.349866326164195E-3,1.5042145593869738E-3,9.4783850290123617E-4,null,null,0,null,null,934]
[null,null,null,null,null,null,null,935,3.6116236162362196E-2,2.5715687878292204E-2,1.6912402428447632E-2,3.6209987195902739E-4,2.3526810392481877E-4,1.7213809812234831E-4,2.3471502590673926E-3,1.5024875621890553E-3,9.4674556213017729E-4,null,null,0,null,null,935]
[null,null,null,null,null,null,null,936,3.6074765030266659E-2,2.5686145368801604E-2,1.6892792408572447E-2,3.6167952148591267E-4,2.3499630482241751E-4,1.7193942609294399E-4,2.3444404633942784E-3,1.5007645259938842E-3,9.4565513896887189E-4,null,null,0,null,null,936]
[null,null,null,null,null,null,null,937,3.6033389028915071E-2,2.5656670659043531E-2,1.6873227811871935E-2,3.6126014582473566E-4,2.3472513300015961E-4,1.7174121212684481E-4,2.341736917448739E-3,1.4990454371897675E-3,9.4456722472828524E-4,null,null,0,null,null,937]
[null,null,null,null,null,null,null,938,3.5992107831351434E-2,2.562726351588604E-2,1.6853708480706431E-2,3.6084174158847366E-4,2.3445458628901556E-4,1.7154345464169129E-4,2.3390395996346221E-3,1.4973302822273078E-3,9.4348181075932114E-4,null,null,0,null,null,938]
[null,null,null,null,null,null,null,939,3.5950921112116306E-2,2.5597923707264814E-2,1.6834234258164875E-2,3.6042430540577682E-4,2.341846625299445E-4,1.7134615206240372E-4,2.336348488455165E-3,1.4956190476190477E-3,9.4239888845259274E-4,null,null,0,null,null,939]
[null,null,null,null,null,null,null,940,3.590982854723828E-2,2.5568651002177062E-2,1.6814804988060598E-2,3.6000783392087791E-4,2.3391535957383684E-4,1.7114930282114058E-4,2.3336635625124187E-3,1.4939117199391171E-3,9.4131844923819549E-4,null,null,0,null,null,940]
[null,null,null,null,null,null,null,941,3.5868829814225477E-2,2.553944517067543E-2,1.6795420514927158E-2,3.5959232379350193E-4,2.3364667528145717E-4,1.7095290535725676E-4,2.3309848005066847E-3,1.4922082858228808E-3,9.4024048458548021E-4,null,null,0,null,null,941]
[null,null,null,null,null,null,null,942,3.5827924592057109E-2,2.5510305983862003E-2,1.6776080684014191E-2,3.5917777169877733E-4,2.3337860752338773E-4,1.7075695811726249E-4,2.3283121812359502E-3,1.4905087319665904E-3,9.3916498600282933E-4,null,null,0,null,null,942]
[null,null,null,null,null,null,null,943,3.5787112561175123E-2,2.548123321388231E-2,1.6756785341283272E-2,3.5876417432714687E-4,2.3311115417997194E-4,1.7056145955478231E-4,2.3256456835953278E-3,1.488813045127038E-3,9.3809194503743324E-4,null,null,0,null,null,943]
[null,null,null,null,null,null,null,944,3.5746393403475824E-2,2.5452226633919418E-2,1.6737534333403865E-2,3.5835152838427999E-4,2.3284431314125875E-4,1.7036640813051441E-4,2.3229852865765017E-3,1.4871212121212118E-3,9.3702135327506958E-4,null,null,0,null,null,944]
[null,null,null,null,null,null,null,945,3.5705766802301676E-2,2.5423286018187982E-2,1.6718327507749233E-2,3.5793983059098481E-4,2.3257808230694703E-4,1.7017180231219018E-4,2.3203309692671746E-3,1.4854332198259547E-3,9.3595320233988281E-4,null,null,0,null,null,945]
[null,null,null,null,null,null,null,946,3.5665232442433047E-2,2.5394411141928426E-2,1.6699164712392401E-2,3.5752907768312186E-4,2.323124595863304E-4,1.6997764057453423E-4,2.317682710850521E-3,1.4837490551776258E-3,9.3488748389416565E-4,null,null,0,null,null,946]
[null,null,null,null,null,null,null,947,3.5624790010080086E-2,2.5365601781401105E-2,1.6680045796102175E-2,3.5711926641151718E-4,2.3204744289824278E-4,1.6978392139922434E-4,2.3150404906046424E-3,1.4820687051717621E-3,9.3382418963814284E-4,null,null,0,null,null,947]
[null,null,null,null,null,null,null,948,3.5584439192874594E-2,2.5336857713880532E-2,1.6660970608339137E-2,3.5671039354187735E-4,2.3178303017100374E-4,1.6959064327485204E-4,2.3124042879020261E-3,1.4803921568627442E-3,9.3276331130975486E-4,null,null,0,null,null,948]
[null,null,null,null,null,null,null,949,3.5544179679862009E-2,2.5308178717649656E-2,1.6641938999251711E-2,3.5630245585470383E-4,2.3151921934236468E-4,1.6939780469688319E-4,2.3097740822090092E-3,1.4787193973634643E-3,9.3170484068444447E-4,null,null,0,null,null,949]
[null,null,null,null,null,null,null,950,3.5504011161493418E-2,2.5279564571994127E-2,1.6622950819672241E-2,3.558954501452086E-4,2.3125600835945508E-4,1.6920540416761901E-4,2.3071498530852453E-3,1.4770504138449951E-3,9.3064876957494377E-4,null,null,0,null,null,950]
[null,null,null,null,null,null,null,951,3.54639333296176E-2,2.5251015057196659E-2,1.6604005921113069E-2,3.5548937322323049E-4,2.3099339517872942E-4,1.6901344019615739E-4,2.3045315801831765E-3,1.4753851935362635E-3,9.2959508983106367E-4,null,null,0,null,null,951]
[null,null,null,null,null,null,null,952,3.5423945877473176E-2,2.5222529954531385E-2,1.6585104155762694E-2,3.5508422191315146E-4,2.3073137776591417E-4,1.6882191129835415E-4,2.3019192432475041E-3,1.4737237237237224E-3,9.2854379333948361E-4,null,null,0,null,null,952]
[null,null,null,null,null,null,null,953,3.5384048499680756E-2,2.5194109046258309E-2,1.6566245376481922E-2,3.5467999305381414E-4,2.3046995409595536E-4,1.68630815996785E-4,2.2993128221146688E-3,1.4720659917510299E-3,9.2749487202354382E-4,null,null,0,null,null,953]
[null,null,null,null,null,null,null,954,3.5344240892235181E-2,2.5165752115617713E-2,1.6547429436800026E-2,3.5427668349843937E-4,2.3020912215296634E-4,1.6844015282070743E-4,2.296712296712332E-3,1.4704119850187253E-3,9.2644831784303799E-4,null,null,0,null,null,954]
[null,null,null,null,null,null,null,955,3.5304522752497791E-2,2.5137458946824679E-2,1.6528656190910981E-2,3.538742901145447E-4,2.299488799301759E-4,1.6824992030602307E-4,2.2941176470588583E-3,1.4687616909839117E-3,9.2540412279400837E-4,null,null,0,null,null,955]
[null,null,null,null,null,null,null,956,3.5264893779188768E-2,2.5109229325063601E-2,1.6509925493669676E-2,3.5347280978386325E-4,2.2968922542987698E-4,1.6806011699524017E-4,2.2915288532628078E-3,1.4671150971599385E-3,9.2436227890854131E-4,null,null,0,null,null,956]
[null,null,null,null,null,null,null,957,3.5225353672379514E-2,2.5081063036482738E-2,1.6491237200588201E-2,3.5307223940226311E-4,2.2943015666337534E-4,1.6787074143743633E-4,2.2889458955224228E-3,1.4654721911160863E-3,9.233227782545646E-4,null,null,0,null,null,957]
[null,null,null,null,null,null,null,958,3.5185902133485075E-2,2.505295986818885E-2,1.6472591167832097E-2,3.5267257587966741E-4,2.2917167165093909E-4,1.6768179218822158E-4,2.2863687541251274E-3,1.4638329604772539E-3,9.2228561293564669E-4,null,null,0,null,null,958]
[null,null,null,null,null,null,null,959,3.5146538865256628E-2,2.5024919608241797E-2,1.6453987252216692E-2,3.5227381613997484E-4,2.2891376842174789E-4,1.6749326780970164E-4,2.283797409447022E-3,1.4621973929236478E-3,9.212507750907961E-4,null,null,0,null,null,959]
[null,null,null,null,null,null,null,960,3.5107263571774038E-2,2.4996942045649225E-2,1.6435425311203431E-2,3.5187595712098059E-4,2.2865644501384315E-4,1.6730516687044156E-4,2.2812318419523879E-3,1.4605654761904742E-3,9.2021825689426312E-4,null,null,0,null,null,960]
[null,null,null,null,null,null,null,961,3.5068075958438402E-2,2.4969026970361276E-2,1.6416905202896223E-2,3.5147899577429832E-4,2.2839969947407808E-4,1.6711748794542925E-4,2.2786720321931937E-3,1.4589371980676309E-3,9.191880505553425E-4,null,null,0,null,null,961]
[null,null,null,null,null,null,null,962,3.5028975731964715E-2,2.4941174173265333E-2,1.6398426786037836E-2,3.510829290652818E-4,2.2814352985806846E-4,1.6693022961603973E-4,2.2761179608086E-3,1.4573125463994037E-3,9.1816014831817751E-4,null,null,0,null,null,962]
[null,null,null,null,null,null,null,963,3.4989962600374555E-2,2.4913383446180791E-2,1.6379989920006315E-2,3.5068775397294817E-4,2.2788793423014349E-4,1.6674339046999923E-4,2.2735696085244735E-3,1.4556915090841653E-3,9.1713454246156536E-4,null,null,0,null,null,963]
[null,null,null,null,null,null,null,964,3.4951036272988789E-2,2.4885654581853874E-2,1.6361594464811387E-2,3.5029346748990063E-4,2.2763291066329691E-4,1.6655696910134976E-4,2.2710269561529023E-3,1.4540740740740716E-3,9.1611122529876353E-4,null,null,0,null,null,964]
[null,null,null,null,null,null,null,965,3.4912196460420368E-2,2.4857987373952482E-2,1.6343240281090951E-2,3.4990006662225231E-4,2.273784572391387E-4,1.6637096411041387E-4,2.2684899845917144E-3,1.4524602293747662E-3,9.1509018917729841E-4,null,null,0,null,null,965]
[null,null,null,null,null,null,null,966,3.4873442874567173E-2,2.4830381617061074E-2,1.632492723010753E-2,3.4950754838955061E-4,2.2712457204784699E-4,1.6618537410375951E-4,2.265958674823999E-3,1.4508499630450824E-3,9.1407142647877387E-4,null,null,0,null,null,966]
[null,null,null,null,null,null,null,967,3.4834775228604842E-2,2.4802837106675593E-2,1.6306655173744789E-2,3.4911590982470185E-4,2.2687125318812017E-4,1.6600019769416537E-4,2.2634330079176306E-3,1.4492432631967487E-3,9.1305492961868222E-4,null,null,0,null,null,967]
[null,null,null,null,null,null,null,968,3.4796193236979765E-2,2.4775353639198399E-2,1.6288423974504071E-2,3.4872514797389641E-4,2.2661849876712958E-4,1.6581543350058619E-4,2.2609129650247978E-3,1.4476401179940976E-3,9.1204069104621561E-4,null,null,0,null,null,968]
[null,null,null,null,null,null,null,969,3.4757696615401984E-2,2.4747931011933261E-2,1.6270233495500927E-2,3.483352598965346E-4,2.2636630690047222E-4,1.6563108014811849E-4,2.2583985273815351E-3,1.4460405156537723E-3,9.1102870324407954E-4,null,null,0,null,null,969]
[null,null,null,null,null,null,null,970,3.4719285080838269E-2,2.4720569023080369E-2,1.6252083600461712E-2,3.4794624266515286E-4,2.26114675712124E-4,1.6544713626796652E-4,2.2558896763072555E-3,1.4444444444444416E-3,9.1001895872830666E-4,null,null,0,null,null,970]
[null,null,null,null,null,null,null,971,3.4680958351505135E-2,2.4693267471731405E-2,1.623397415372016E-2,3.4755809336535053E-4,2.2586360333439319E-4,1.652636004974083E-4,2.2533863932042899E-3,1.4428518926865093E-3,9.0901145004807253E-4,null,null,0,null,null,971]
[null,null,null,null,null,null,null,972,3.4642716146861985E-2,2.46660261578646E-2,1.6215905020214024E-2,3.4717080909571702E-4,2.2561308790787417E-4,1.6508047147976198E-4,2.2508886595574251E-3,1.4412628487518323E-3,9.0800616978551241E-4,null,null,0,null,null,972]
[null,null,null,null,null,null,null,973,3.4604558187604245E-2,2.4638844882339854E-2,1.6197876065481707E-2,3.4678438696775948E-4,2.2536312758140173E-4,1.6489774786435237E-4,2.2483964569334496E-3,1.4396773010634364E-3,9.070031105555392E-4,null,null,0,null,null,973]
[null,null,null,null,null,null,null,974,3.4566484195656569E-2,2.4611723446893892E-2,1.6179887155658927E-2,3.4639882410583098E-4,2.2511372051200521E-4,1.6471542830647789E-4,2.2459097669806994E-3,1.4380952380952346E-3,9.0600226500566232E-4,null,null,0,null,null,974]
[null,null,null,null,null,null,null,975,3.4528493894166096E-2,2.4584661654135441E-2,1.6161938157475408E-2,3.4601411764705931E-4,2.2486486486486331E-4,1.6453351146737745E-4,2.2434285714286063E-3,1.4365166483717492E-3,9.0500362581580828E-4,null,null,0,null,null,975]
[null,null,null,null,null,null,null,976,3.4490587007495715E-2,2.4557659307540447E-2,1.6144028938251592E-2,3.4563026474127608E-4,2.2461655881325914E-4,1.6435199601419766E-4,2.2409528520872528E-3,1.4349415204678328E-3,9.0400718569814248E-4,null,null,0,null,null,976]
[null,null,null,null,null,null,null,977,3.445276326121742E-2,2.4530716211447295E-2,1.6126159365895357E-2,3.4524726255094618E-4,2.2436880053853546E-4,1.6417088061996038E-4,2.2384825908469256E-3,1.4333698430083934E-3,9.0301293739689125E-4,null,null,0,null,null,977]
[null,null,null,null,null,null,null,978,3.4415022382105691E-2,2.450383217105211E-2,1.6108329308898776E-2,3.44865108251098E-4,2.2412158823005037E-4,1.6399016396353034E-4,2.2360177696776748E-3,1.4318016046681219E-3,9.0202087368816642E-4,null,null,0,null,null,978]
[null,null,null,null,null,null,null,979,3.4377364098130893E-2,2.4477006992404043E-2,1.6090538636334899E-2,3.4448379902925403E-4,2.2387492008513307E-4,1.6380984472958297E-4,2.2335583706288749E-3,1.4302367941712165E-3,9.0103098737979006E-4,null,null,0,null,null,979]
[null,null,null,null,null,null,null,980,3.4339788138452752E-2,2.4450240482400628E-2,1.6072787217854542E-2,3.4410333208536177E-4,2.2362879430904014E-4,1.6362992160857257E-4,2.2311043758287902E-3,1.428675400291117E-3,9.0004327131112038E-4,null,null,0,null,null,980]
[null,null,null,null,null,null,null,981,3.4302294233413869E-2,2.442353244878312E-2,1.6055074923683094E-2,3.4372370463172508E-4,2.2338320911491195E-4,1.6345039329670056E-4,2.22865576748414E-3,1.4271174118502322E-3,8.9905771835287987E-4,null,null,0,null,null,981]
[null,null,null,null,null,null,null,982,3.4264882114533254E-2,2.4396882700131912E-2,1.6037401624617371E-2,3.4334491389293635E-4,2.2313816272372946E-4,1.63271258495884E-4,2.2262125278796705E-3,1.4255628177196763E-3,8.9807432140698296E-4,null,null,0,null,null,982]
[null,null,null,null,null,null,null,983,3.4227551514499938E-2,2.4370291045861962E-2,1.6019767192022461E-2,3.4296695710580867E-4,2.2289365336427132E-4,1.6309251591372419E-4,2.2237746393777252E-3,1.4240116068190021E-3,8.9709307340636569E-4,null,null,0,null,null,983]
[null,null,null,null,null,null,null,984,3.4190302167166578E-2,2.4343757296218235E-2,1.6002171497828621E-2,3.4258983151930867E-4,2.2264967927307109E-4,1.6291416426347593E-4,2.2213420844178237E-3,1.4224637681159377E-3,8.9611396731481725E-4,null,null,0,null,null,984]
[null,null,null,null,null,null,null,985,3.4153133807543166E-2,2.4317281262271208E-2,1.5984614414528146E-2,3.4221353439448993E-4,2.2240623869437478E-4,1.6273620226401621E-4,2.2189148455162367E-3,1.4209192906261268E-3,8.9513699612681086E-4,null,null,0,null,null,985]
[null,null,null,null,null,null,null,986,3.4116046171790718E-2,2.4290862755912371E-2,1.5967095815172323E-2,3.418380630044264E-4,2.2216332988009901E-4,1.625586286398138E-4,2.2164929052655696E-3,1.4193781634128659E-3,8.9416215286733706E-4,null,null,0,null,null,986]
[null,null,null,null,null,null,null,987,3.4079038997215039E-2,2.4264501589849781E-2,1.594961557336835E-2,3.4146341463414686E-4,2.2192095108978884E-4,1.6238144212089872E-4,2.2140762463343454E-3,1.4178403755868499E-3,8.9318943059173779E-4,null,null,0,null,null,987]
[null,null,null,null,null,null,null,988,3.4042112022260533E-2,2.4238197577603628E-2,1.5932173563276301E-2,3.4108958658056904E-4,2.2167910059057644E-4,1.6220464144283192E-4,2.2116648514665911E-3,1.4163059163059119E-3,8.9221882238554125E-4,null,null,0,null,null,988]
[null,null,null,null,null,null,null,989,3.4005264986504018E-2,2.4211950533501853E-2,1.5914769659606112E-2,3.4071657615243514E-4,2.2143777665713972E-4,1.6202822534667531E-4,2.2092587034814272E-3,1.4147747747747699E-3,8.9125032136429835E-4,null,null,0,null,null,989]
[null,null,null,null,null,null,null,990,3.3968497630648624E-2,2.4185760272675758E-2,1.5897403737614568E-2,3.403443806702467E-4,2.2119697757166121E-4,1.6185219257896176E-4,2.2068577852726594E-3,1.4132469402447756E-3,8.9028392067341962E-4,null,null,0,null,null,990]
[null,null,null,null,null,null,null,991,3.3931809696517698E-2,2.4159626611055675E-2,1.5880075673102338E-2,3.3997299746620107E-4,2.2095670162378743E-4,1.6167654189166544E-4,2.2044620798083747E-3,1.4117224020136591E-3,8.8931961348801382E-4,null,null,{"$f":"IF($T$1=1,R643,IF($T$1=2,H643,IF($T$1=3,H643,IF($T$1=4,H643,IF($T$1=5,A643,IF($T$1=6,A643,IF($T$1=7,A643,IF($T$1=8,H643,IF($T$1=9,H643,IF($T$1=10,H643,IF($T$1=11,A643,IF($T$1=12,A643,IF($T$1=13,H643,IF($T$1=14,H643,IF($T$1=15,H643,IF($T$1=21,V643,IF($T$1=22,W643,0)))))))))))))))))","v":0},null,null,991]
[null,null,null,null,null,null,null,992,3.3895200927048778E-2,2.4133549365366668E-2,1.5862785342411014E-2,3.3960242388412696E-4,2.2071694711058831E-4,1.6150127204217236E-4,2.202071570130536E-3,1.4102011494252823E-3,8.8835739301272717E-4,null,null,0,null,null,992]
[null,null,null,null,null,null,null,993,3.3858671066287573E-2,2.410752835312422E-2,1.5845532622420142E-2,3.3923265727942172E-4,2.2047771233651707E-4,1.6132638179325106E-4,2.1996862393545841E-3,1.4086831718693887E-3,8.8739725248158333E-4,null,null,0,null,null,993]
[null,null,null,null,null,null,null,994,3.382221985938199E-2,2.4081563392630012E-2,1.5828317390544338E-2,3.3886369501898807E-4,2.2023899561337011E-4,1.6115186991302351E-4,2.1973060706690396E-3,1.4071684587813567E-3,8.8643918515782564E-4,null,null,0,null,null,994]
[null,null,null,null,null,null,null,995,3.3785847052576229E-2,2.4055654302967657E-2,1.5811139524730362E-2,3.3849553448117163E-4,2.2000079526024739E-4,1.6097773517493617E-4,2.1949310473351074E-3,1.4056569996419568E-3,8.8548318433375871E-4,null,null,0,null,null,995]
[null,null,null,null,null,null,null,996,3.3749552393204887E-2,2.4029800903998519E-2,1.5793998903454239E-2,3.381281730556991E-4,2.1976310960351291E-4,1.6080397635773118E-4,2.192561152686285E-3,1.4041487839771046E-3,8.8452924333059266E-4,null,null,0,null,null,996]
[null,null,null,null,null,null,null,997,3.3713335629687098E-2,2.4004003016357529E-2,1.5776895405718389E-2,3.3776160814361626E-4,2.1952593697675555E-4,1.6063059224541795E-4,2.1901963701279727E-3,1.4026438013576223E-3,8.8357735549828649E-4,null,null,0,null,null,997]
[null,null,null,null,null,null,null,998,3.3677196511520742E-2,2.3978260461449064E-2,1.5759828911048785E-2,3.3739583715722672E-4,2.1928927572075025E-4,1.6045758162724468E-4,2.1878366831370854E-3,1.4011420413989953E-3,8.8262751421539485E-4,null,null,0,null,null,998]
[null,null,null,null,null,null,null,999,3.3641134789276633E-2,2.3952573061442779E-2,1.5742799299492127E-2,3.3703085752003126E-4,2.1905312418341903E-4,1.6028494329767029E-4,2.1854820752616692E-3,1.3996434937611352E-3,8.8167971288891382E-4,null,null,0,null,null,999]
[null,null,null,null,null,null,null,1000,3.3605150214592823E-2,2.3926940639269548E-2,1.5725806451613023E-2,3.3666666666666713E-4,2.1881748071979283E-4,1.6011267605633628E-4,2.1831325301205169E-3,1.3981481481481425E-3,8.8073394495412816E-4,null,null,0,null,null,1000]
[null,null,null,null,null,null,null,null,null,null,null,null,null,null,null,null,null,null,null,0,null,null,0]