{"text_format":"1","workbook":"xlsx","n_sheets":16,"sheets":["Nabídka","Půdorys","stěna A","stěna B","stěna C","stěna D","stěna E","stěna F","stěna G","stěna H","Rekapitulace","Předávací protokol","Faktura","Data_podpora","Předávací_protokol_data","List1"],"not_rendered":{"charts":65,"images":0,"macros":1,"external_links":0,"defined_names":11,"comments":0,"pivot_tables":0},"unopened":[],"bounds":{"document_bytes":16777216,"sheet_cells":100000,"rows_first":2000,"rows_last":500,"rows_between":2000,"halvings":0,"cell_chars":16384,"cell_head_chars":4096},"cells_cut":0,"cells_raw":0,"read":"whole","date_system":"1900"}

{"sheet":"Nabídka","index":0,"n_rows":40,"n_cols":8,"rows_kept":40,"cut":false,"hidden":false,"merged":[[15,0,15,1],[0,3,0,5],[6,0,6,5],[8,0,8,1],[9,0,9,1],[10,0,10,1],[11,0,11,1],[12,0,12,1],[13,0,13,1],[14,0,14,1],[22,0,25,3],[27,0,28,5],[30,0,32,5],[34,0,37,5],[16,0,16,1],[17,0,17,1],[18,0,18,1],[19,0,19,1],[20,0,20,1],[21,0,21,1]]}
["Cenová nabídka",null,null,"email I telefon",null,null,null,"Červené písmo přepsat a změnit na černé"]
["Název společnosti"]
["Ulice a číslo popisné"]
["PSČ a Město"]
["IČO:"]
["DIČ: "]
["Akce:",null,null,null,null,null,{"$f":"IF(A7=0,\"<--Zde vyplnit název akce\",\"\")","v":""}]
["Označení dodávky",null,"množství","mj","cena mj. ","cena bez DPH"]
["Montáž/demontáž lešení",null,{"$f":"Rekapitulace!C8","v":1593},"m2",0,{"$f":"C9*E9","v":0}]
["Pronájem lešení",null,21,"den",0,{"$f":"C10*E10","v":0}]
["Doprava",null,440,"km",0,{"$f":"C11*E11","v":0}]
[]
[]
[]
[]
[]
[]
[]
[]
[]
[]
[]
["Celková nabídková cena je orientační. Finální fakturace probíhá v souladu s reálnými výměrami pohledové plochy lešení a počty dnů pronájmu.",null,null,null,"Celkem bez DPH",{"$f":"SUM(F9:F22)","v":0}]
[null,null,null,null,"DPH 21%",{"$f":"F23*0.21","v":0}]
[]
[null,null,null,null,"Celkem",{"$f":"F23+F24","v":0}]
[]
["Výpočet plochy lešení: Za pohledovou plochu lešení se považuje součin celkové výšky lešení, přičemž k výšce poslední podlahy je přičteno 2m, a celkové délky lešení včetně nároží."]
[]
[]
["Výpočet doby pronájmu: Dobou pronájmu lešení se rozumí interval mezi předáním lešení (oboustraně potvrzený předávací protokol) a dnem demontáže. Při pronájmu přesahujícím poslední kalendářní den v měsící fakturujeme měsíčně. V ostatních případech po demontáži lešení."]
[]
[]
[]
["Dodatečné informace: V případě ztráty či poškození použitých komponent účtujeme katalogovou cenu materiálu. Fakturace montáže/demontáže probíhá vždy po dokončení. Doprava lešení je kalkulována za každý kilometr v závislosti na množství dopraveného materiálu, v okolí do 15 km je účtována paušálně. Manipulace s lešením je v rámci skladovacích prostor a do 30m na stavbě zahrnuta v ceně."]
[]
[]
[]
[]
["V případě jakýchkoliv dotazů Vám rádi poskytneme další informace."]

{"sheet":"Půdorys","index":1,"n_rows":22,"n_cols":25,"rows_kept":22,"cut":false,"hidden":false,"merged":[[2,1,2,4],[2,5,2,8]]}
[null,"Rozhraní pro náčrt půdorysu objektu",null,null,"Výkres:",null,null,null,null,null,null,null,null,null,null,null,"Data grafu:"]
["-","náčrt bude začínat z bodu [0;0]",null,null,null,null,null,null,null,null,null,null,null,null,null,null,null,null,null,null,null,"Výpočetní data:"]
[null,"STĚNA",null,null,null,"LEŠENÍ",null,null,null,null,null,null,null,null,null,null,"stěna","bod X","bod Y",null,null,null,"X","Y","délka"]
["→","název","délka ","načrtnout jako...","odkaz","orientace","vlevo","vpravo","Poznámky",null,null,null,null,null,null,null,"počátek",0,0,null,null,"lešení A",{"$f":"IF($R$4=$R$5,$R$5+1,$R$4)-1","v":-1},{"$f":"IF(S4=S5,S5-1,S5)","v":-1},{"$f":"ABS(W5-W4)","v":21}]
["→","A",20,"vodorovná zleva doprava",{"$f":"B5","v":"A"},null,null,null,null,null,null,null,null,null,null,null,"A",{"$f":"IF(D5=Data_podpora!$B$2,R4+Půdorys!C5,IF(Půdorys!D5=Data_podpora!$B$3,R4-Půdorys!C5,Půdorys!R4))","v":20},{"$f":"IF(D5=Data_podpora!$B$4,Půdorys!C5,IF(Půdorys!D5=Data_podpora!$B$5,-Půdorys!C5,Půdorys!S4))","v":0},null,null,null,{"$f":"IF($R$4=$R$5,$R$5+1,$R$5)","v":20},{"$f":"IF(S4=S5,S5-1,S5)","v":-1}]
["→",{"$f":"IF(C6>0,Q6,\"\")","v":"B"},5,"svislá shora dolu",{"$f":"B6","v":"B"},null,null,null,"2m sestava",null,null,null,null,null,null,null,"B",{"$f":"IF(D6=Data_podpora!$B$2,R4+Půdorys!C6,IF(Půdorys!D6=Data_podpora!$B$3,R4-Půdorys!C6,Půdorys!R5))","v":20},{"$f":"IF(D6=Data_podpora!$B$4,S5+Půdorys!C6,IF(Půdorys!D6=Data_podpora!$B$5,S5-Půdorys!C6,Půdorys!S5))","v":-5},null,null,"lešení B",{"$f":"W7","v":19},{"$f":"$S$5-1","v":-1},{"$f":"ABS(X7-X6)","v":5}]
["→","C",21.5,"vodorovná zleva doprava",{"$f":"B7","v":"C"},null,null,null,null,null,null,null,null,null,null,null,"C",{"$f":"IF(D7=Data_podpora!$B$2,R5+Půdorys!C7,IF(Půdorys!D7=Data_podpora!$B$3,R5-Půdorys!C7,Půdorys!R6))","v":41.5},{"$f":"IF(D7=Data_podpora!$B$4,S6+Půdorys!C7,IF(Půdorys!D7=Data_podpora!$B$5,S6-Půdorys!C7,Půdorys!S6))","v":-5},null,null,null,{"$f":"IF(R5=R6,R6-1,R6)","v":19},{"$f":"IF(S5=S6,S6-1,S6)-1","v":-6}]
["→","D",16.399999999999999,"svislá zdora nahoru","D",null,null,null,null,null,null,null,null,null,null,null,"D",{"$f":"IF(D8=Data_podpora!$B$2,R6+Půdorys!C8,IF(Půdorys!D8=Data_podpora!$B$3,R6-Půdorys!C8,Půdorys!R7))","v":41.5},{"$f":"IF(D8=Data_podpora!$B$4,S7+Půdorys!C8,IF(Půdorys!D8=Data_podpora!$B$5,S7-Půdorys!C8,Půdorys!S7))","v":11.399999999999999},null,null,"lešení C",{"$f":"$R$6","v":20},{"$f":"$X$9","v":-6},{"$f":"ABS(W9-W8)","v":22.5}]
["→","E",21,"vodorovná zprava doleva","E",null,null,null,null,null,null,null,null,null,null,null,"E",{"$f":"IF(D9=Data_podpora!$B$2,R7+Půdorys!C9,IF(Půdorys!D9=Data_podpora!$B$3,R7-Půdorys!C9,IF(C9=0,0,Půdorys!R8)))","v":20.5},{"$f":"IF(D9=Data_podpora!$B$4,S8+Půdorys!C9,IF(Půdorys!D9=Data_podpora!$B$5,S8-Půdorys!C9,IF(C9=0,0,Půdorys!S8)))","v":11.399999999999999},null,null,null,{"$f":"IF($R$6=$R$7,$R$7+1,$R$7)+1","v":42.5},{"$f":"IF(S6=S7,S7-1,S7)","v":-6}]
["→","F",2.25,"svislá zdora nahoru","F",null,null,null,null,null,null,null,null,null,null,null,"F",{"$f":"IF(D10=Data_podpora!$B$2,R8+Půdorys!C10,IF(Půdorys!D10=Data_podpora!$B$3,R8-Půdorys!C10,IF(C10=0,0,Půdorys!R9)))","v":20.5},{"$f":"IF(D10=Data_podpora!$B$4,S9+Půdorys!C10,IF(Půdorys!D10=Data_podpora!$B$5,S9-Půdorys!C10,IF(C10=0,0,Půdorys!S9)))","v":13.649999999999999},null,null,"lešení D",{"$f":"$W$11","v":42.5},{"$f":"$S$7-1","v":-6},{"$f":"ABS(X11-X10)","v":18.399999999999999}]
["→","G",20.5,"vodorovná zprava doleva","G",null,null,null,null,null,null,null,null,null,null,null,"G",{"$f":"IF(D11=Data_podpora!$B$2,R9+Půdorys!C11,IF(Půdorys!D11=Data_podpora!$B$3,R9-Půdorys!C11,IF(C11=0,0,Půdorys!R10)))","v":0},{"$f":"IF(D11=Data_podpora!$B$4,S10+Půdorys!C11,IF(Půdorys!D11=Data_podpora!$B$5,S10-Půdorys!C11,IF(C11=0,0,Půdorys!S10)))","v":13.649999999999999},null,null,null,{"$f":"IF(R7=R8,R8+1,\"\")","v":42.5},{"$f":"IF($S$7=$S$8,$S$8+1,$S$8)+1","v":12.399999999999999}]
["→","H",13.25,"svislá shora dolu","H",null,null,null,null,null,null,null,null,null,null,null,"H",{"$f":"IF(D12=Data_podpora!$B$2,R10+Půdorys!C12,IF(Půdorys!D12=Data_podpora!$B$3,R10-Půdorys!C12,IF(C12=0,0,Půdorys!R11)))","v":0},{"$f":"IF(D12=Data_podpora!$B$4,S11+Půdorys!C12,IF(Půdorys!D12=Data_podpora!$B$5,S11-Půdorys!C12,IF(C12=0,0,Půdorys!S11)))","v":0.39999999999999858},null,null,"lešení E",{"$f":"$R$8+1","v":42.5},{"$f":"$X$13","v":12.399999999999999},{"$f":"ABS(W13-W12)","v":21}]
["→","",null,null,null,null,null,null,null,null,null,null,null,null,null,null,"I",{"$f":"IF(D13=Data_podpora!$B$2,R11+Půdorys!C13,IF(Půdorys!D13=Data_podpora!$B$3,R11-Půdorys!C13,IF(C13=0,0,Půdorys!R12)))","v":0},{"$f":"IF(D13=Data_podpora!$B$4,S12+Půdorys!C13,IF(Půdorys!D13=Data_podpora!$B$5,S12-Půdorys!C13,IF(C13=0,0,Půdorys!S12)))","v":0},null,null,null,{"$f":"IF($R$8=$R$9,$R$9+1,$R$9)+1","v":21.5},{"$f":"IF(S8=S9,S9+1,S9)","v":12.399999999999999}]
["→","",null,null,null,null,null,null,null,null,null,null,null,null,null,null,"J",{"$f":"IF(D14=Data_podpora!$B$2,R12+Půdorys!C14,IF(Půdorys!D14=Data_podpora!$B$3,R12-Půdorys!C14,IF(C14=0,0,Půdorys!R13)))","v":0},{"$f":"IF(D14=Data_podpora!$B$4,S13+Půdorys!C14,IF(Půdorys!D14=Data_podpora!$B$5,S13-Půdorys!C14,IF(C14=0,0,Půdorys!S13)))","v":0},null,null,"lešení F",{"$f":"$W$15","v":21.5},{"$f":"$S$9","v":11.399999999999999},{"$f":"ABS(X15-X14)","v":3.25}]
[null,{"$f":"IF(C15>0,U15,\"\")","v":""},null,null,null,null,null,null,null,null,null,null,null,null,null,null,null,null,null,null,null,null,{"$f":"IF(R9=R10,R10+1,R10)","v":21.5},{"$f":"IF($S$9=$S$10,$S$10+1,$S$10)+1","v":14.649999999999999}]
[null,"Obvod [m]:",{"$f":"SUM(C5:C12)","v":119.9},"[m]",null,null,null,null,null,null,null,null,null,null,null,null,null,null,null,null,null,"lešení G",{"$f":"$R$10","v":20.5},{"$f":"$X$17","v":14.649999999999999},{"$f":"ABS(W17-W16)","v":20.5}]
[null,null,null,null,null,null,null,null,null,null,null,null,null,null,null,null,null,null,null,null,null,null,{"$f":"IF($R$10=$R$11,$R$11+1,$R$11)","v":0},{"$f":"IF(S10=S11,S11+1,S11)","v":14.649999999999999}]
[null,null,null,null,null,null,null,null,null,null,null,null,null,null,null,null,null,null,null,null,null,"lešení H",{"$f":"$W$19","v":-1},{"$f":"$S$11+1","v":14.649999999999999},{"$f":"ABS(X19-X18)","v":15.25}]
[null,null,null,null,null,null,null,null,null,null,null,null,null,null,null,null,null,null,null,null,null,null,{"$f":"IF(R11=R12,R12-1,R12)","v":-1},{"$f":"IF($S$11=$S$12,$S$12+1,$S$12)-1","v":-0.60000000000000142}]
[null,null,null,null,null,null,null,null,null,null,null,null,null,null,null,null,null,null,null,null,null,"lešení I"]
[]
[null,null,null,null,null,null,null,null,null,null,null,null,null,null,null,null,null,null,null,null,null,"lešení J"]

{"sheet":"stěna A","index":2,"n_rows":128,"n_cols":34,"rows_kept":128,"cut":false,"hidden":false,"merged":[[2,28,2,30],[2,31,2,33],[3,21,4,22],[3,23,4,23],[3,24,4,24],[3,25,4,25],[43,20,43,21],[42,20,42,21],[42,22,42,23],[43,22,43,23],[42,18,42,19],[47,14,47,15],[42,24,42,25],[47,26,47,27],[47,16,47,17],[47,18,47,19],[47,20,47,21],[47,22,47,23],[47,24,47,25],[42,14,42,15],[42,16,42,17],[43,24,43,25],[42,26,42,27],[43,26,43,27],[43,16,43,17],[43,18,43,19],[43,14,43,15],[89,0,93,0],[81,0,84,0],[0,4,1,6],[42,10,42,11],[42,12,42,13],[47,8,47,9],[43,12,43,13],[43,10,43,11],[47,10,47,11],[47,12,47,13],[70,3,70,4],[43,8,43,9],[42,8,42,9]]}
[null,null,"Stěna A","Výkres:",null,null,null,"Data grafu:"]
[null,null,"Nastavení parametrů výpočtu:",null,null,null,null,null,"Tvar střechy",null,"Tvar terénu",null,"úhel alfa",null,null,null,null,null,null,null,null,"NAKLÁDACÍ LIST:",null,{"$f":"$C$1","v":"Stěna A"},{"$f":"IF(AD6=0,\"(BUDE NAKLÁDÁNO POUZE AUTO)\",\"\")","v":""},null,null,"VYTÍŽENOST ODVOZNÍHO PROSTŘEDKU:"]
[null,null,"Terén: absolutní výška (±0,00 = svislice od hřebene střechy na terén)",null,null,null,null,null,"osa x","osa y","osa x","osa y","tg A",{"$f":"($D$14-$J$4)/($D$12/2)","v":0},null,null,null,null,null,null,null,"obestavběná plocha lešení [m2]",null,null,{"$f":"IF(K41>=1,SUM(I48,K48,M48,O48,Q48,S48,U48,W48,Y48,AA48)+SUM(I44,K44,M44,O44,Q44,S44,U44,W44,Y44,AA44)*2+SUM(I44,K44,M44,O44,Q44,S44,U44,W44,Y44,AA44),SUM(I48,K48,M48,O48,Q48,S48,U48,W48,Y48,AA48)+SUM(I44,K44,M44,O44,Q44,S44,U44,W44,Y44,AA44)*2)","v":252},"[m2]",null,"[kg]","1. cesta",null,null,"2.cesta"]
[null,"→","Výška terénu v levém rohu [m]",0,"[m]",null,null,"vlevo",0,{"$f":"IF($D$13=Data_podpora!$B$9,$D$14,$D$15+$D$4)","v":11.759999999999991},0,{"$f":"$D$4","v":0},"A",{"$f":"DEGREES(ATAN(N3))","v":0},null,null,null,null,null,null,null,"Komponenta",null,"počet kusů [ks]","jednotková hmotnost [kg/ks]","hmotnost [kg]",null,null,"KAPACITA","VYUŽITO","ZBÝVÁ","KAPACITA","VYUŽITO","ZBÝVÁ"]
[null,"→","Výška terénu v pravém rohu [m]",0,"[m]",null,null,"max",{"$f":"$D$9","v":0},{"$f":"IF($D$12/2<I5,-$N$3*I5+$J$4+$N$3*$D$12,$N$3*I5+$J$4)","v":11.759999999999991},{"$f":"$D$9","v":0},{"$f":"$D$8","v":0},"tg A",{"$f":"TAN(RADIANS($N$4))","v":0},null,null,null,null,null,null,null,null,null,null,null,null,null,"AUTO",2500,{"$f":"IF(Z30<=AC5,SUM(Z6:Z29),SUM(Z6:Z9,Z26:Z29,Z15:Z23,Z13/2,Z14/2))","v":1196.2},{"$f":"IF((AC5-AD5)<=0,0,AC5-AD5)","v":1303.8},2500,{"$f":"IF(AC5-AD5<=0,-(AC5-AD5),0)","v":0},{"$f":"AF5-AG5","v":2500}]
[null,"→","Výška nejnižšího bodu terénu [m]",0,"[m]",null,null,"min",{"$f":"$D$7","v":0},{"$f":"IF($D$12/2>I6,$N$3*I6+$J$4,-$N$3*I6+$J$4+$N$3*$D$12)","v":11.759999999999991},{"$f":"$D$7","v":0},{"$f":"$D$6","v":0},"sklon",{"$f":"$N$5","v":0},null,null,null,null,null,null,null,"stavitelná patka 0,5m",null,{"$f":"IF(X7>0,(COUNT(I46:AB46)+2)-X7,(COUNT(I46:AB46)+2))","v":16},3.1,{"$f":"Y7*X6","v":75.2},null,"ZÁVĚS",3500,{"$f":"IF(Z30<=AC5,0,SUM(Z10:Z12,Z24:Z25,Z13/2,Z14/2))","v":1899.25},{"$f":"IF((AC6-AD6)<=0,0,AC6-AD6)","v":1600.75},3500,{"$f":"IF(AC6-AD6<=0,-(AC6-AD6),0)","v":0},{"$f":"AF6-AG6","v":3500}]
[null,"→","Místo nejnižšího bodu (zleva) [m]",0,"[m]",null,null,"top",{"$f":"$D$12/2","v":10},{"$f":"$D$14","v":11.759999999999991},{"$f":"$D$12/2","v":10},{"$f":"0","v":0},null,null,null,null,null,null,null,null,null,"stavitelná patka 1m",null,0,4.7,{"$f":"Y9*X7","v":0}]
[null,"→","Výška nejvyššího bodu terénu [m]",0,"[m]",null,null,"vpravo",{"$f":"$D$12","v":20},{"$f":"$J$4","v":11.759999999999991},{"$f":"$D$12","v":20},{"$f":"$D$5","v":0},null,null,null,null,null,null,null,null,null,"rám 2m",null,{"$f":"IF(X9>0,SUM(J46-I46,L46-K46,N46-M46,P46-O46,R46-Q46,T46-S46,V46-U46,X46-W46,Z46-Y46,AB46-AA46)+MIN(J46-I46,L46-K46,N46-M46,P46-O46,R46-Q46,T46-S46,V46-U46,X46-W46,Z46-Y46,AB46-AA46)+MAX(J46-I46,L46-K46,N46-M46,P46-O46,R46-Q46,T46-S46,V46-U46,X46-W46,Z46-Y46,AB46-AA46)-MIN(J46-I46,L46-K46,N46-M46,P46-O46,R46-Q46,T46-S46,V46-U46,X46-W46,Z46-Y46,AB46-AA46)-X9,SUM(J46-I46,L46-K46,N46-M46,P46-O46,R46-Q46,T46-S46,V46-U46,X46-W46,Z46-Y46,AB46-AA46)+MIN(J46-I46,L46-K46,N46-M46,P46-O46,R46-Q46,T46-S46,V46-U46,X46-W46,Z46-Y46,AB46-AA46)+MAX(J46-I46,L46-K46,N46-M46,P46-O46,R46-Q46,T46-S46,V46-U46,X46-W46,Z46-Y46,AB46-AA46)-MIN(J46-I46,L46-K46,N46-M46,P46-O46,R46-Q46,T46-S46,V46-U46,X46-W46,Z46-Y46,AB46-AA46))","v":40},16.5,{"$f":"Y8*X8","v":660}]
[null,"→","Místo nejvyššího bodu (zleva) [m]",0,"[m]",null,null,null,null,null,null,null,null,null,null,null,null,null,null,null,null,"rám 1m",null,0,11.3,0]
[null,null,null,null,null,null,null,null,"Tvar střechy",null,"Tvar terénu",null,"úhel alfa",null,null,null,null,null,null,null,null,"podlaha 3m",null,{"$f":"((IF(I44=3,J46-I46,0)+IF(K44=3,L46-K46,0)+IF(M44=3,N46-M46,0)+IF(O44=3,P46-O46,0)+IF(Q44=3,R46-Q46,0)+IF(S44=3,T46-S46,0)+IF(U44=3,V46-U46,0)+IF(W44=3,X46-W46,0)+IF(Y44=3,Z46-Y46,0)+IF(AA44=3,AB46-AA46,0))-X12)*2","v":60},22,1320]
[null,null,"Střecha:",null,null,null,null,null,"osa x","osa y","osa x","osa y","tg A",{"$f":"($D$14-$J$4)/($D$17)","v":{"$error":"#DIV/0!"}},null,null,null,null,null,null,null,"podlaha 2m",null,{"$f":"(IF(I44=2,J46-I46,0)+IF(K44=2,L46-K46,0)+IF(M44=2,N46-M46,0)+IF(O44=2,P46-O46,0)+IF(Q44=2,R46-Q46,0)+IF(S44=2,T46-S46,0)+IF(U44=2,V46-U46,0)+IF(W44=2,X46-W46,0)+IF(Y44=2,Z46-Y46,0)+IF(AA44=2,AB46-AA46,0))*2","v":0},14.5,0]
[null,null,"Délka strany [m]",{"$f":"Půdorys!$C$5","v":20},"[m]",null,null,"vlevo",0,{"$f":"$D$15+$D$4","v":11.759999999999991},0,{"$f":"$D$4","v":0},"A",{"$f":"DEGREES(ATAN(N11))","v":{"$error":"#DIV/0!"}},null,null,null,null,null,null,null,"průlezová podlaha 3m",null,{"$f":"MAX(J46:AB46)","v":5},28,140]
[null,"→","Tvar střechy:","sedlová",null,null,null,"max",{"$f":"$D$9","v":0},{"$f":"IF($I$17<I13,-$N$3*I13+$J$4+$N$11*$D$12,IF(I13<$I$14,$N$11*I13+$J$4,J14))","v":{"$error":"#DIV/0!"}},{"$f":"$D$9","v":0},{"$f":"$D$8","v":0},"tg A",{"$f":"TAN(RADIANS($N$12))","v":{"$error":"#DIV/0!"}},null,null,null,null,null,null,null,"zábradlí 3m",null,{"$f":"IF(I44=3,2*(J46-I46)+1,0)+IF(K44=3,2*(L46-K46)+1,0)+IF(M44=3,2*(N46-M46)+1,0)+IF(O44=3,2*(P46-O46)+1,0)+IF(Q44=3,2*(R46-Q46)+1,0)+IF(S44=3,2*(T46-S46)+1,0)+IF(U44=3,2*(V46-U46)+1,0)+IF(W44=3,2*(X46-W46)+1,0)+IF(Y44=3,2*(Z46-Y46)+1,0)+IF(AA44=3,2*(AB46-AA46)+1,0)","v":77},5.5,423.5]
[null,"→",{"$f":"IF('stěna A'!$D$13=Data_podpora!$B$9,\"Výška stěny [m]\",\"Výška uprostřed stěny [m]\")","v":"Výška uprostřed stěny [m]"},{"$f":"507.76-496","v":11.759999999999991},"[m]",null,null,"min",{"$f":"$D$7","v":0},{"$f":"IF($I$13>=I14,$N$11*I14+$J$4,IF(I14<=$I$16,J12,-$N$11*I14+$J$12+$N$11*$D$12))","v":{"$error":"#DIV/0!"}},{"$f":"$D$7","v":0},{"$f":"$D$6","v":0},"sklon",{"$f":"$N$13","v":{"$error":"#DIV/0!"}},null,null,null,null,null,null,null,"zábradlí 2m",null,{"$f":"IF(I44=2,2*(J46-I46)+1,0)+IF(K44=2,2*(L46-K46)+1,0)+IF(M44=2,2*(N46-M46)+1,0)+IF(O44=2,2*(P46-O46)+1,0)+IF(Q44=2,2*(R46-Q46)+1,0)+IF(S44=2,2*(T46-S46)+1,0)+IF(U44=2,2*(V46-U46)+1,0)+IF(W44=2,2*(X46-W46)+1,0)+IF(Y44=2,2*(Z46-Y46)+1,0)+IF(AA44=2,2*(AB46-AA46)+1,0)","v":0},3.5,0]
[null,{"$f":"IF($D$13=Data_podpora!B9,\"\",\"→\")","v":"→"},{"$f":"IF($D$13=Data_podpora!$B$9,\"\",\"Výška od terénu k okapu (levý) [m]\")","v":"Výška od terénu k okapu (levý) [m]"},{"$f":"507.76-496","v":11.759999999999991},{"$f":"IF($D$13=Data_podpora!$B$9,\"\",\"[m]\")","v":"[m]"},null,null,"polov1",{"$f":"$D$17","v":0},{"$f":"$D$14","v":11.759999999999991},{"$f":"$D$17","v":0},{"$f":"$D$18","v":0},null,null,null,null,null,null,null,null,null,"diagonální úchyt",null,{"$f":"X16/MAX(I46:AB46)","v":2},0.5,1]
[null,null,{"$f":" IF(D13=Data_podpora!B10,\"Upřesňující parametry pro polovalbovou střechu:\",\"\")","v":""},null,null,null,null,"top",{"$f":"$D$12/2","v":10},{"$f":"$D$14","v":11.759999999999991},{"$f":"$D$12/2","v":10},{"$f":"0","v":0},null,null,null,null,null,null,null,null,null,"diagonála 3m",null,{"$f":"MAX(J46-I46,L46-K46,N46-M46,P46-O46,R46-Q46,T46-S46,V46-U46,X46-W46,Z46-Y46,AB46-AA46)*ROUNDUP((IF(I44=3,I44,0)+IF(K44=3,K44,0)+IF(M44=3,M44,0)+IF(O44=3,O44,0)+IF(Q44=3,Q44,0)+IF(S44=3,S44,0)+IF(U44=3,U44,0)+IF(W44=3,W44,0)+IF(Y44=3,Y44,0)+IF(AA44=3,AA44,0))/20,0)","v":10},11,110]
[null,{"$f":"IF($D$13=Data_podpora!$B$10,'stěna A'!$B$15,\"\")","v":""},{"$f":"IF($D$13=Data_podpora!$B$10,\"Vzdálenost polovalby zleva  [m]\",\"\")","v":""},null,{"$f":"IF($D$13=Data_podpora!$B$10,\"[m]\",\"\")","v":""},null,null,"polov2",{"$f":"$D$12-$D$17","v":20},{"$f":"$D$14","v":11.759999999999991},{"$f":"$D$12-$D$17","v":20},{"$f":"$D$19","v":0},null,null,null,null,null,null,null,null,null,"diagonála 2m",null,{"$f":"IF(X16=0,MAX(J46-I46,L46-K46,N46-M46,P46-O46,R46-Q46,T46-S46,V46-U46,X46-W46,Z46-Y46,AB46-AA46)*ROUNDUP((IF(I44=2,I44,0)+IF(K44=2,K44,0)+IF(M44=2,M44,0)+IF(O44=2,O44,0)+IF(Q44=2,Q44,0)+IF(S44=2,S44,0)+IF(U44=2,U44,0)+IF(W44=2,W44,0)+IF(Y44=2,Y44,0)+IF(AA44=2,AA44,0))/12,0),0)","v":0},8,0]
[null,{"$f":"IF($D$13=Data_podpora!$B$10,'stěna A'!$B$15,\"\")","v":""},{"$f":"IF($D$13=Data_podpora!$B$10,\"Výška terénu v místě levé polovalby [m]\",\"\")","v":""},null,{"$f":"IF($D$13=Data_podpora!$B$10,\"[m]\",\"\")","v":""},null,null,"vpravo",{"$f":"$D$12","v":20},{"$f":"$J$4","v":11.759999999999991},{"$f":"$D$12","v":20},{"$f":"$D$5","v":0},null,null,null,null,null,null,null,null,null,"kotva 0,5 m",null,{"$f":"IF(X19=0,ROUNDUP(X8*0.45,0),ROUNDUP(X8*0.45,0)-X19)","v":18},2,36]
[null,{"$f":"IF($D$13=Data_podpora!$B$10,'stěna A'!$B$15,\"\")","v":""},{"$f":"IF($D$13=Data_podpora!$B$10,\"Výška terénu v místě pravé polovalby [m]\",\"\")","v":""},null,{"$f":"IF($D$13=Data_podpora!$B$10,\"[m]\",\"\")","v":""},null,null,null,null,null,null,null,null,null,null,null,null,null,null,null,null,"kotva dlouhá 1 m",null,0,3.8,0]
[null,null,null,null,null,null,null,"Patra lešení",null,null,null,null,null,null,null,null,null,null,null,null,null,"eLko / sloupek",null,{"$f":"IF(X22=0,COUNT(J46,L46,N46,P46,R46,T46,V46,X46,Z46,AB46)+1,(COUNT(J46,L46,N46,P46,R46,T46,V46,X46,Z46,AB46)+1)-X22)","v":8},5,40]
[null,null,null,null,null,null,null,null,null,null,null,null,null,null,null,null,null,null,null,null,null,"eLko 2 m",null,null,11.5,0]
[null,{"$f":"IF($D$21=Data_podpora!B30,\"→\",\"\")","v":""},{"$f":"IF(D21=Data_podpora!B30,\"Vzdálenost od levého rohu [m]\",\"\")","v":""},null,{"$f":"IF(D21=Data_podpora!B30,\"[m]\",\"\")","v":""},null,null,"-0,5",{"$f":"I26-1","v":-0.6},{"$f":"J26-1","v":-0.6},{"$f":"K26-1","v":-0.6},{"$f":"L26-1","v":-0.6},{"$f":"M26-1","v":-0.6},null,null,null,null,null,null,null,null,"Háčko",null,{"$f":"2*(MAX(I46:AB46)-MIN(J46,L46,N46,P46,R46,T46,V46,X46,Z46,AB46))","v":0},9.6999999999999993,0]
[null,{"$f":"IF($D$21=Data_podpora!$B$30,\"→\",\"\")","v":""},{"$f":"IF(D21=Data_podpora!B30,\"Výška od terénu (zleva) [m]\",\"\")","v":""},null,{"$f":"IF(D21=Data_podpora!B30,\"[m]\",\"\")","v":""},null,null,"-3",{"$f":"I24-2","v":-5.6},-5.9,-5.9,-5.9,-5.9,null,null,null,null,null,null,null,null,"boční zábradlí",null,{"$f":"IF(X22=0,(MAX(J46-I46,L46-K46,N46-M46,P46-O46,R46-Q46,T46-S46,V46-U46,X46-W46,Z46-Y46,AB46-AA46)+1)*2,(MAX(J46-I46,L46-K46,N46-M46,P46-O46,R46-Q46,T46-S46,V46-U46,X46-W46,Z46-Y46,AB46-AA46)+1)*2-X22)","v":12},3,36]
[null,{"$f":"IF($D$21=Data_podpora!$B$30,\"→\",\"\")","v":""},{"$f":"IF(D21=Data_podpora!B30,\"Šířka [m]\",\"\")","v":""},null,{"$f":"IF(D21=Data_podpora!B30,\"[m]\",\"\")","v":""},null,null,"-2",-3.6,-3.9,-3.9,-3.9,-3.9,null,null,null,null,null,null,null,null,"okopové prkno 3m",null,{"$f":"IF(I44=3,J46-I46,0)+IF(K44=3,L46-K46,0)+IF(M44=3,N46-M46,0)+IF(O44=3,P46-O46,0)+IF(Q44=3,R46-Q46,0)+IF(S44=3,T46-S46,0)+IF(U44=3,V46-U46,0)+IF(W44=3,X46-W46,0)+IF(Y44=3,Z46-Y46,0)+IF(AA44=3,AB46-AA46,0)","v":35},6.5,227.5]
[null,null,null,null,null,null,null,"-1",{"$f":"I26-2","v":-1.6},{"$f":"$D$85-2","v":-1.9},{"$f":"$D$85-2","v":-1.9},{"$f":"$D$85-2","v":-1.9},{"$f":"$D$85-2","v":-1.9},null,null,null,null,null,null,null,null,"okopové prkno 2m",null,{"$f":"IF(I44=2,J46-I46,0)+IF(K44=2,L46-K46,0)+IF(M44=2,N46-M46,0)+IF(O44=2,P46-O46,0)+IF(Q44=2,R46-Q46,0)+IF(S44=2,T46-S46,0)+IF(U44=2,V46-U46,0)+IF(W44=2,X46-W46,0)+IF(Y44=2,Z46-Y46,0)+IF(AA44=2,AB46-AA46,0)","v":0},4.5,0]
[null,null,null,null,null,null,null,"0",{"$f":"$K$41","v":0.4},{"$f":"$K$41","v":0.4},{"$f":"$K$41","v":0.4},{"$f":"$K$41","v":0.4},{"$f":"$K$41","v":0.4},null,null,null,null,null,null,null,null,"konzola",null,null,10,0]
[null,null,null,null,null,null,null,"1",{"$f":"I26+$D$86","v":2.4},{"$f":"J26+$D$86","v":2.4},{"$f":"K26+$D$86","v":2.4},{"$f":"L26+$D$86","v":2.4},{"$f":"M26+$D$86","v":2.4},null,null,null,null,null,null,null,null,"pevna spojka",null,{"$f":"J46*2","v":10},1.1499999999999999,11.5]
[null,null,null,null,null,null,null,"2",4.4000000000000004,4.4000000000000004,4.4000000000000004,4.4000000000000004,4.4000000000000004,null,null,null,null,null,null,null,null,"otočná spojka",null,{"$f":"J46","v":5},1.35,6.75]
[null,null,null,null,null,null,null,"3",6.4,6.4,6.4,6.4,6.4,null,null,null,null,null,null,null,null,"závlačná spojka",null,{"$f":"J46*2","v":10},0.8,8]
[null,null,null,null,null,null,null,"4",8.4,8.4,8.4,8.4,8.4,null,null,null,null,null,null,null,null,"CELKOVÁ HMOTNOST [kg]",null,null,null,{"$f":"SUM(Z6:Z29)","v":3095.45}]
[null,null,null,null,null,null,null,"5",10.4,10.4,10.4,10.4,10.4]
[null,null,null,null,null,null,null,"6",12.4,12.4,12.4,12.4,12.4]
[null,null,null,null,null,null,null,"7",14.4,14.4,14.4,14.4,14.4]
[null,null,null,null,null,null,null,"8",16.399999999999999,16.399999999999999,16.399999999999999,16.399999999999999,16.399999999999999]
[null,null,null,null,null,null,null,"9",18.399999999999999,18.399999999999999,18.399999999999999,18.399999999999999,18.399999999999999]
[null,null,null,null,null,null,null,"10",20.399999999999999,20.399999999999999,20.399999999999999,20.399999999999999,20.399999999999999]
[null,null,null,null,null,null,null,"11",22.4,22.4,22.4,22.4,22.4]
[null,null,null,null,null,null,null,"12",24.4,24.4,24.4,24.4,24.4]
[null,null,null,null,null,null,null,"13",26.4,26.4,26.4,26.4,26.4]
[]
[null,null,null,null,null,null,null,"LEŠENÍ","výška založení [m]",null,0.4,"[m]","nepsat nuly v kolonce \"patro\",pokud není sestava lešení využita",null,null,null,null,null,"Poznámka:",{"$f":"IF(Půdorys!I5=0,\"\",Půdorys!I5)","v":""}]
[null,null,null,null,null,null,null,null,"ZALOŽENÍ","VÝŠKA P.P.","ZALOŽENÍ","VÝŠKA P.P.","ZALOŽENÍ","VÝŠKA P.P.","ZALOŽENÍ","VÝŠKA P.P.","ZALOŽENÍ","VÝŠKA P.P.","ZALOŽENÍ","VÝŠKA P.P.","ZALOŽENÍ","VÝŠKA P.P.","ZALOŽENÍ","VÝŠKA P.P.","ZALOŽENÍ","VÝŠKA P.P.","ZALOŽENÍ","VÝŠKA P.P."]
[null,null,null,null,null,null,null,"SESTAVA",1,null,2,null,3,null,4,null,5,null,6,null,7,null,8,null,9,null,10]
[null,null,null,null,null,null,null,"DÉLKA SESTAVY",3,null,3,null,3,null,3,null,3,null,3,null,3,null,0,null,0,null,0]
[null,null,null,null,null,null,null,"\"potvrdit\""]
[null,null,null,null,null,null,null,"PATRO",0,5,0,5,0,5,0,5,0,5,0,5,0,5]
[null,null,null,null,null,null,null,"POSUN"]
[null,null,null,null,null,null,null,"plocha [m2]",{"$f":"(J46-I46)*$D$86*I44","v":30},null,{"$f":"L46*$D$86*K44","v":30},null,{"$f":"N46*$D$86*M44","v":30},null,{"$f":"P46*$D$86*O44","v":30},null,{"$f":"R46*$D$86*Q44","v":30},null,{"$f":"T46*$D$86*S44","v":30},null,{"$f":"V46*$D$86*U44","v":30},null,{"$f":"X46*$D$86*W44","v":0},null,{"$f":"Z46*$D$86*Y44","v":0},null,{"$f":"AB46*$D$86*AA44","v":0}]
[null,null,null,null,null,null,null,"výška",{"$f":"IF(I46=-0.5,M22,INDEX($M$23:$M$39,I46+4))","v":0.4},{"$f":"INDEX($M$23:$M$39,J46+4)","v":10.4},{"$f":"IF(K46=-0.5,M22,INDEX($M$23:$M$39,K46+4))","v":0.4},{"$f":"INDEX($M$23:$M$39,L46+4)","v":10.4},{"$f":"IF(M46=-0.5,M22,INDEX($M$23:$M$39,M46+4))","v":0.4},{"$f":"INDEX($M$23:$M$39,N46+4)","v":10.4},{"$f":"IF(O46=-0.5,M22,INDEX($M$23:$M$39,O46+4))","v":0.4},{"$f":"INDEX($M$23:$M$39,P46+4)","v":10.4},{"$f":"IF(Q46=-0.5,M22,INDEX($M$23:$M$39,Q46+4))","v":0.4},{"$f":"INDEX($M$23:$M$39,R46+4)","v":10.4},{"$f":"IF(S46=-0.5,M22,INDEX($M$23:$M$39,S46+4))","v":0.4},{"$f":"INDEX($M$23:$M$39,T46+4)","v":10.4},{"$f":"IF(U46=-0.5,M22,INDEX($M$23:$M$39,U46+4))","v":0.4},{"$f":"INDEX($M$23:$M$39,V46+4)","v":10.4},{"$f":"IF(W46=-0.5,M22,INDEX($M$23:$M$39,W46+4))","v":0.4},{"$f":"INDEX($M$23:$M$39,X46+4)","v":0.4},{"$f":"IF(Y46=-0.5,M22,INDEX($M$23:$M$39,Y46+4))","v":0.4},{"$f":"INDEX($M$23:$M$39,Z46+4)","v":0.4},{"$f":"IF(AA46=-0.5,M22,INDEX($M$23:$M$39,AA46+4))","v":0.4},{"$f":"INDEX($M$23:$M$39,AB46+4)","v":0.4}]
[]
[]
[]
[]
[]
[null,null,null,null,null,null,null,-1,{"$f":"$I$49","v":0.4},{"$f":"$J$49","v":10.4}]
[null,null,null,null,null,null,null,0,{"$f":"$I$49","v":0.4},{"$f":"$J$49","v":10.4}]
[null,null,null,null,null,null,null,1,{"$f":"$I$49","v":0.4},{"$f":"$J$49","v":10.4}]
[null,null,null,null,null,null,null,2,{"$f":"$I$49","v":0.4},{"$f":"$J$49","v":10.4},{"$f":"$K$49","v":0.4},{"$f":"$L$49","v":10.4}]
[null,null,null,null,null,null,null,3,null,null,{"$f":"$K$49","v":0.4},{"$f":"$L$49","v":10.4}]
[null,null,null,null,null,null,null,4,null,null,{"$f":"$K$49","v":0.4},{"$f":"$L$49","v":10.4}]
[null,null,null,null,null,null,null,5,null,null,{"$f":"$K$49","v":0.4},{"$f":"$L$49","v":10.4},{"$f":"$M$49","v":0.4},{"$f":"$N$49","v":10.4}]
[null,null,null,null,null,null,null,6,null,null,null,null,{"$f":"$M$49","v":0.4},{"$f":"$N$49","v":10.4}]
[null,null,null,null,null,null,null,7,null,null,null,null,{"$f":"$M$49","v":0.4},{"$f":"$N$49","v":10.4}]
[null,null,null,null,null,null,null,8,null,null,null,null,{"$f":"$M$49","v":0.4},{"$f":"$N$49","v":10.4},{"$f":"$O$49","v":0.4},{"$f":"$P$49","v":10.4}]
[null,null,null,null,null,null,null,9,null,null,null,null,null,null,{"$f":"$O$49","v":0.4},{"$f":"$P$49","v":10.4}]
[null,null,null,null,null,null,null,10,null,null,null,null,null,null,{"$f":"$O$49","v":0.4},{"$f":"$P$49","v":10.4}]
[null,null,null,null,null,null,null,11,null,null,null,null,null,null,{"$f":"$O$49","v":0.4},{"$f":"$P$49","v":10.4},{"$f":"$Q$49","v":0.4},{"$f":"$R$49","v":10.4}]
[null,null,null,null,null,null,null,12,null,null,null,null,null,null,null,null,{"$f":"$Q$49","v":0.4},{"$f":"$R$49","v":10.4}]
[null,null,"Pomocný výpočet počtu sestav lešení:",null,null,null,null,13,null,null,null,null,null,null,null,null,{"$f":"$Q$49","v":0.4},{"$f":"$R$49","v":10.4}]
[null,null,"Délka:",null,null,null,null,14,null,null,null,null,null,null,null,null,{"$f":"$Q$49","v":0.4},{"$f":"$R$49","v":10.4},{"$f":"$S$49","v":0.4},{"$f":"$T$49","v":10.4}]
[null,null,"přesah za roh objektu:","Ne",null,null,null,15,null,null,null,null,null,null,null,null,null,null,{"$f":"$S$49","v":0.4},{"$f":"$T$49","v":10.4}]
[null,null,"Požadovaná minimální délka lešení [m]",{"$f":"IF(D71=Data_podpora!B17,'stěna A'!D12+2,IF('stěna A'!D71=Data_podpora!B14,'stěna A'!D12+0.5,IF(D71=Data_podpora!B13,'stěna A'!D12,'stěna A'!D12+1)))","v":20},"[m]",null,null,16,null,null,null,null,null,null,null,null,null,null,{"$f":"$S$49","v":0.4},{"$f":"$T$49","v":10.4}]
[null,null,"Počet sestav lešení (3m) [-]",{"$f":"ROUNDDOWN(D72/E73,0)","v":6},"3",{"$f":"D73*E73","v":18},"[m]",17,null,null,null,null,null,null,null,null,null,null,{"$f":"$S$49","v":0.4},{"$f":"$T$49","v":10.4},{"$f":"$U$49","v":0.4},{"$f":"$V$49","v":10.4}]
[null,null,"Počet sestav lešení (2m) [-]",{"$f":"ROUNDDOWN(MOD(D72,E73)/E74,0)","v":1},"2",{"$f":"D74*E74","v":2},"[m]",18,null,null,null,null,null,null,null,null,null,null,null,null,{"$f":"$U$49","v":0.4},{"$f":"$V$49","v":10.4}]
[null,null,"Počet sestav lešení (0,75m) [-]",{"$f":"ROUNDUP(D72-(D73*E73+D74*E74),0)","v":0},"0,75",{"$f":"D75*E75","v":0},"[m]",19,null,null,null,null,null,null,null,null,null,null,null,null,{"$f":"$U$49","v":0.4},{"$f":"$V$49","v":10.4}]
[null,null,"Reálná délka lešení [m]",{"$f":"D73*E73+D74*E74+D75*E75","v":20},"[m]",null,null,20,null,null,null,null,null,null,null,null,null,null,null,null,{"$f":"$U$49","v":0.4},{"$f":"$V$49","v":10.4}]
[null,null,null,null,null,null,null,21,null,null,null,null,null,null,null,null,null,null,null,null,null,null,{"$f":"$W$49","v":0.4},{"$f":"$X$49","v":0.4}]
[null,null,"Výška:",null,null,null,null,22,null,null,null,null,null,null,null,null,null,null,null,null,null,null,{"$f":"$W$49","v":0.4},{"$f":"X77","v":0.4}]
[null,null,"Lešení pro:","Fasádu",null,null,null,23,null,null,null,null,null,null,null,null,null,null,null,null,null,null,{"$f":"$W$49","v":0.4},{"$f":"X78","v":0.4}]
[null,null,"Výška zábradlí posledního patra [m]",1,"[m]",null,null,24,null,null,null,null,null,null,null,null,null,null,null,null,null,null,{"$f":"$W$49","v":0.4},{"$f":"X79","v":0.4},{"$f":"$Y$49","v":0.4},{"$f":"$Z$49","v":0.4}]
[null,null,"Požadovaná výška [m]",{"$f":"IF(D79=Data_podpora!B22,'stěna A'!D14+D80,'stěna A'!D14)","v":11.759999999999991},"[m]",null,null,25,null,null,null,null,null,null,null,null,null,null,null,null,null,null,null,null,{"$f":"$Y$49","v":0.4},{"$f":"Z80","v":0.4}]
["Založení",null,"Výška nejnižžšího bodu terénu [m]",{"$f":"MIN(D4,D5,D6,D8)","v":0},"[m]",null,null,26,null,null,null,null,null,null,null,null,null,null,null,null,null,null,null,null,{"$f":"$Y$49","v":0.4},{"$f":"Z81","v":0.4}]
[null,null,"Výška nejvyššího  bodu terénu [m]",{"$f":"D8","v":0},"[m]",null,null,27,null,null,null,null,null,null,null,null,null,null,null,null,null,null,null,null,{"$f":"$Y$49","v":0.4},{"$f":"Z82","v":0.4},{"$f":"$AA$49","v":0.4},{"$f":"$AB$49","v":0.4}]
[null,null,"Rozdíl max a min [m]",{"$f":"D83-D82","v":0},"[m]",{"$f":"IF(D84<0.4,\"(Patky 0,4m)\",IF(D84<=1,\"(Patky 1m)\",IF(2>=D84>1,\"(Rám 1m)\",IF(5>D84>2,\"(Rám 2m)\",\"\"))))","v":"(Patky 0,4m)"},null,28,null,null,null,null,null,null,null,null,null,null,null,null,null,null,null,null,null,null,{"$f":"$AA$49","v":0.4},{"$f":"AB83","v":0.4}]
[null,"#","Výška založení [m]",{"$f":"D8+0.1","v":0.1},"[m]",null,null,29,null,null,null,null,null,null,null,null,null,null,null,null,null,null,null,null,null,null,{"$f":"$AA$49","v":0.4},{"$f":"AB84","v":0.4}]
[null,null,"Modulová výška patra lešení [m]",2,"[m]",null,null,30,null,null,null,null,null,null,null,null,null,null,null,null,null,null,null,null,null,null,{"$f":"$AA$49","v":0.4},{"$f":"AB85","v":0.4}]
[null,null,"Počet pater lešení [-]; výška [m])",{"$f":"IF(D81-D85<11,ROUNDDOWN((D81-D85)/2.15,0),ROUNDDOWN((D81-D85)/2.1,0))","v":5},"pater",{"$f":"INDEX(M27:M39,D87)","v":10.4},"[m]",31]
[null,null,"Reálná výška lešení [m]",{"$f":"D87*D86+D85+D80","v":11.1},"[m]"]
[]
["Uskočení pater","→","Hranice posouzení uskočení","4",null,{"$f":"INDEX(M27:M39,D90)","v":8.4},"[m]"]
[null,null,"Zbývající výška do hřebene",{"$f":"$D$14-F90","v":3.3599999999999905},"[m]"]
[null,null,"Počet uskočených pater",{"$f":"IF(D91<11,ROUNDDOWN((D91)/2.6,0),ROUNDDOWN((D91)/2.6,0))","v":1},{"$f":"IF(D92=1,\"patro\",IF(D92<=4,\"patra\",\"pater\"))","v":"patro"}]
[null,null,"Rozdíl výšky okapu a nejbližšího patra",{"$f":"$J$4-(INDEX(M27:M39,D90))","v":3.3599999999999905},"[m]"]
[null,null,"Rozdíl výšek na 3 m sestavu",{"$f":"$N$5*$E$73","v":0},"[m]"]
[null,{"$f":"IF($D$92>=1,1,\"\")","v":1},"První sestava",{"$f":"D93+D94","v":3.3599999999999905},"[m]",{"$f":"IF(D$95<=2,\"posoudit další\",IF(D$95<=3.2,\"ponechat\",\"pokračuje patrem\"))","v":"pokračuje patrem"}]
[null,{"$f":"IF(1<=$D$92,2,\"X\")","v":2},"Druhá sestava",{"$f":"IF(F95=\"ponechat\",$D$93+$D$94*B96,$D$93+$D$94*B96-2)","v":1.3599999999999905},"[m]",{"$f":"IF(D96<2,\"posoudit další\",IF(D96<=3.2,\"ponechat\",IF(D96>3.2,\"pokračuje patrem\",\"\")))","v":"posoudit další"}]
[null,{"$f":"IF(2<=$D$92,3,\"X\")","v":"X"},"Třetí sestava",{"$f":"IF(F96=\"ponechat\",$D$93+$D$94*B97,$D$93+$D$94*B97-2)","v":{"$error":"#VALUE!"}},"[m]",{"$f":"IF(D97<2,\"posoudit další\",IF(D97<=3.2,\"ponechat\",IF(D97>3.2,\"pokračuje patrem\",\"\")))","v":{"$error":"#VALUE!"}}]
[null,{"$f":"IF(3<=$D$92,4,\"X\")","v":"X"},"Čtvrtá sestava",{"$f":"IF(F97=\"ponechat\",$D$93+$D$94*B98,$D$93+$D$94*B98-2)","v":{"$error":"#VALUE!"}},"[m]",{"$f":"IF(D98<2,\"posoudit další\",IF(D98<=3.2,\"ponechat\",IF(D98>3.2,\"pokračuje patrem\",\"\")))","v":{"$error":"#VALUE!"}}]
[]
[]
[]
[]
[null,null,"NAKLÁDACÍ LIST"]
[]
[null,null,"stavitelná patka 0,5m","počet kusů"]
[null,null,"stavitelná patka 1m",{"$f":"IF(D107>=0,($D$73+$D$74+$D$75)*2+2-D107,($D$73+$D$74+$D$75)*2+2)","v":14}]
[null,null,"rám 2m",2]
[null,null,"rám 1m",{"$f":"(($D$73+$D$74+$D$75)+1)*$D$87","v":40}]
[null,null,"podlaha 3m",{"$f":"IF(D85>=1,($D$73+$D$74+$D$75)+1,0)","v":0}]
[null,null,"podlaha 2m",{"$f":"(D73*D87-$D112)*2","v":50}]
[null,null,"průlezová podlaha 3m",{"$f":"D74*D87","v":5}]
[null,null,"zábradlí 3m",{"$f":"D87","v":5}]
[null,null,"zábradlí 2m",{"$f":"(1+$D$87*2)*D73","v":66}]
[null,null,"diagonální úchyt",{"$f":"(1+$D$87*2)*D74","v":11}]
[null,null,"diagonála 3m"]
[null,null,"diagonála 2m",{"$f":"$D$87*(ROUNDUP((D73+D74+D75)/4,0))","v":10}]
[null,null,"kotva 0,5 m",{"$f":"IF(D116=0,$D$87*ROUNDUP(D74/4,0),0)","v":0}]
[null,null,"kotva dlouhá 1 m",{"$f":"(($D$87-1)*SUM(D73:D75))/2","v":14}]
[null,null,"eLko / sloupek"]
[null,null,"eLko 2 m",{"$f":"SUM(D73:D75)+1","v":8}]
[null,null,"Háčko"]
[null,null,"boční zábradlí"]
[null,null,"okopové prkno 3m",{"$f":"D87*2","v":10}]
[null,null,"okopové prkno 2m",{"$f":"D73*D87","v":30}]
[null,null,"konzola",{"$f":"D74*D87","v":5}]
[null,null,"pevna spojka"]
[null,null,"otočná spojka"]
[null,null,"závlačná spojka"]

{"sheet":"stěna B","index":3,"n_rows":128,"n_cols":34,"rows_kept":128,"cut":false,"hidden":false,"merged":[[0,4,1,6],[2,28,2,30],[2,31,2,33],[3,21,4,22],[3,23,4,23],[3,24,4,24],[3,25,4,25],[42,20,42,21],[42,22,42,23],[42,24,42,25],[42,26,42,27],[43,8,43,9],[43,10,43,11],[43,12,43,13],[43,14,43,15],[43,16,43,17],[43,18,43,19],[42,8,42,9],[42,10,42,11],[42,12,42,13],[42,14,42,15],[42,16,42,17],[42,18,42,19],[43,20,43,21],[43,22,43,23],[43,24,43,25],[43,26,43,27],[47,8,47,9],[47,10,47,11],[47,12,47,13],[47,14,47,15],[47,16,47,17],[47,18,47,19],[89,0,93,0],[47,20,47,21],[47,22,47,23],[47,24,47,25],[47,26,47,27],[70,3,70,4],[81,0,84,0]]}
[null,null,"Stěna B","Výkres:",null,null,null,"Data grafu:"]
[null,null,"Nastavení parametrů výpočtu:",null,null,null,null,null,"Tvar střechy",null,"Tvar terénu",null,"úhel alfa",null,null,null,null,null,null,null,null,"NAKLÁDACÍ LIST:",null,{"$f":"$C$1","v":"Stěna B"},{"$f":"IF(AD6=0,\"(BUDE NAKLÁDÁNO POUZE AUTO)\",\"\")","v":"(BUDE NAKLÁDÁNO POUZE AUTO)"},null,null,"VYTÍŽENOST ODVOZNÍHO PROSTŘEDKU:"]
[null,null,"Terén: absolutní výška (±0,00 = svislice od hřebene střechy na terén)",null,null,null,null,null,"osa x","osa y","osa x","osa y","tg A",{"$f":"($D$14-$J$4)/($D$12/2)","v":0},null,null,null,null,null,null,null,"obestavběná plocha lešení [m2]",null,null,{"$f":"IF(K41>=1,SUM(I48,K48,M48,O48,Q48,S48,U48,W48,Y48,AA48)+SUM(I44,K44,M44,O44,Q44,S44,U44,W44,Y44,AA44)*2+SUM(I44,K44,M44,O44,Q44,S44,U44,W44,Y44,AA44),SUM(I48,K48,M48,O48,Q48,S48,U48,W48,Y48,AA48)+SUM(I44,K44,M44,O44,Q44,S44,U44,W44,Y44,AA44)*2)","v":60},"[m2]",null,"[kg]","1. cesta",null,null,"2.cesta"]
[null,"→","Výška terénu v levém rohu [m]",0,"[m]",null,null,"vlevo",0,{"$f":"IF($D$13=Data_podpora!$B$9,$D$14,$D$15+$D$4)","v":11.759999999999991},0,{"$f":"$D$4","v":0},"A",{"$f":"DEGREES(ATAN(N3))","v":0},null,null,null,null,null,null,null,"Komponenta",null,"počet kusů [ks]","jednotková hmotnost [kg/ks]","hmotnost [kg]",null,null,"KAPACITA","VYUŽITO","Zbývá","KAPACITA","VYUŽITO","ZBÝVÁ"]
[null,"→","Výška terénu v pravém rohu [m]",0,"[m]",null,null,"max",{"$f":"$D$9","v":0},{"$f":"IF($D$12/2<I5,-$N$3*I5+$J$4+$N$3*$D$12,$N$3*I5+$J$4)","v":11.759999999999991},{"$f":"$D$9","v":0},{"$f":"$D$8","v":0},"tg A",{"$f":"TAN(RADIANS($N$4))","v":0},null,null,null,null,null,null,null,null,null,null,null,null,null,"AUTO",2500,{"$f":"IF(Z30<=AC5,SUM(Z6:Z29),SUM(Z6:Z9,Z26:Z29,Z15:Z23,Z13/2,Z14/2))","v":941.45},{"$f":"IF((AC5-AD5)<=0,0,AC5-AD5)","v":1558.55},2500,{"$f":"IF(AC5-AD5<=0,-(AC5-AD5),0)","v":0},{"$f":"AF5-AG5","v":2500}]
[null,"→","Výška nejnižšího bodu terénu [m]",0,"[m]",null,null,"min",{"$f":"$D$7","v":0},{"$f":"IF($D$12/2>I6,$N$3*I6+$J$4,-$N$3*I6+$J$4+$N$3*$D$12)","v":11.759999999999991},{"$f":"$D$7","v":0},{"$f":"$D$6","v":0},"sklon",{"$f":"$N$5","v":0},null,null,null,null,null,null,null,"stavitelná patka 0,5m",null,{"$f":"IF(X7>0,(COUNT(I46:AB46)+2)-X7,(COUNT(I46:AB46)+2))","v":6},3.1,{"$f":"Y7*X6","v":28.200000000000003},null,"ZÁVĚS",3500,{"$f":"IF(Z30<=AC5,0,SUM(Z10:Z12,Z24:Z25,Z13/2,Z14/2))","v":0},{"$f":"IF((AC6-AD6)<=0,0,AC6-AD6)","v":3500},3500,{"$f":"IF(AC6-AD6<=0,-(AC6-AD6),0)","v":0},{"$f":"AF6-AG6","v":3500}]
[null,"→","Místo nejnižšího bodu (zleva) [m]",0,"[m]",null,null,"top",{"$f":"$D$12/2","v":2.5},{"$f":"$D$14","v":11.759999999999991},{"$f":"$D$12/2","v":2.5},{"$f":"0","v":0},null,null,null,null,null,null,null,null,null,"stavitelná patka 1m",null,0,4.7,{"$f":"Y9*X7","v":0}]
[null,"→","Výška nejvyššího bodu terénu [m]",0,"[m]",null,null,"vpravo",{"$f":"$D$12","v":5},{"$f":"$J$4","v":11.759999999999991},{"$f":"$D$12","v":5},{"$f":"$D$5","v":0},null,null,null,null,null,null,null,null,null,"rám 2m",null,{"$f":"IF(X9>0,SUM(J46-I46,L46-K46,N46-M46,P46-O46,R46-Q46,T46-S46,V46-U46,X46-W46,Z46-Y46,AB46-AA46)+MIN(J46-I46,L46-K46,N46-M46,P46-O46,R46-Q46,T46-S46,V46-U46,X46-W46,Z46-Y46,AB46-AA46)+MAX(J46-I46,L46-K46,N46-M46,P46-O46,R46-Q46,T46-S46,V46-U46,X46-W46,Z46-Y46,AB46-AA46)-MIN(J46-I46,L46-K46,N46-M46,P46-O46,R46-Q46,T46-S46,V46-U46,X46-W46,Z46-Y46,AB46-AA46)-X9,SUM(J46-I46,L46-K46,N46-M46,P46-O46,R46-Q46,T46-S46,V46-U46,X46-W46,Z46-Y46,AB46-AA46)+MIN(J46-I46,L46-K46,N46-M46,P46-O46,R46-Q46,T46-S46,V46-U46,X46-W46,Z46-Y46,AB46-AA46)+MAX(J46-I46,L46-K46,N46-M46,P46-O46,R46-Q46,T46-S46,V46-U46,X46-W46,Z46-Y46,AB46-AA46)-MIN(J46-I46,L46-K46,N46-M46,P46-O46,R46-Q46,T46-S46,V46-U46,X46-W46,Z46-Y46,AB46-AA46))","v":15},16.5,{"$f":"Y8*X8","v":247.5}]
[null,"→","Místo nejvyššího bodu (zleva) [m]",0,"[m]",null,null,null,null,null,null,null,null,null,null,null,null,null,null,null,null,"rám 1m",null,0,11.3,0]
[null,null,null,null,null,null,null,null,"Tvar střechy",null,"Tvar terénu",null,"úhel alfa",null,null,null,null,null,null,null,null,"podlaha 3m",null,{"$f":"((IF(I44=3,J46-I46,0)+IF(K44=3,L46-K46,0)+IF(M44=3,N46-M46,0)+IF(O44=3,P46-O46,0)+IF(Q44=3,R46-Q46,0)+IF(S44=3,T46-S46,0)+IF(U44=3,V46-U46,0)+IF(W44=3,X46-W46,0)+IF(Y44=3,Z46-Y46,0)+IF(AA44=3,AB46-AA46,0))-X12)*2","v":10},22,220]
[null,null,"Střecha:",null,null,null,null,null,"osa x","osa y","osa x","osa y","tg A",{"$f":"($D$14-$J$4)/($D$17)","v":{"$error":"#DIV/0!"}},null,null,null,null,null,null,null,"podlaha 2m",null,{"$f":"(IF(I44=2,J46-I46,0)+IF(K44=2,L46-K46,0)+IF(M44=2,N46-M46,0)+IF(O44=2,P46-O46,0)+IF(Q44=2,R46-Q46,0)+IF(S44=2,T46-S46,0)+IF(U44=2,V46-U46,0)+IF(W44=2,X46-W46,0)+IF(Y44=2,Z46-Y46,0)+IF(AA44=2,AB46-AA46,0))*2","v":10},14.5,145]
[null,null,"Délka strany [m]",{"$f":"Půdorys!C6","v":5},"[m]",null,null,"vlevo",0,{"$f":"$D$15+$D$4","v":11.759999999999991},0,{"$f":"$D$4","v":0},"A",{"$f":"DEGREES(ATAN(N11))","v":{"$error":"#DIV/0!"}},null,null,null,null,null,null,null,"průlezová podlaha 3m",null,0,28,0]
[null,"→","Tvar střechy:","sedlová",null,null,null,"max",{"$f":"$D$9","v":0},{"$f":"IF($I$17<I13,-$N$3*I13+$J$4+$N$11*$D$12,IF(I13<$I$14,$N$11*I13+$J$4,J14))","v":{"$error":"#DIV/0!"}},{"$f":"$D$9","v":0},{"$f":"$D$8","v":0},"tg A",{"$f":"TAN(RADIANS($N$12))","v":{"$error":"#DIV/0!"}},null,null,null,null,null,null,null,"zábradlí 3m",null,{"$f":"IF(I44=3,2*(J46-I46)+1,0)+IF(K44=3,2*(L46-K46)+1,0)+IF(M44=3,2*(N46-M46)+1,0)+IF(O44=3,2*(P46-O46)+1,0)+IF(Q44=3,2*(R46-Q46)+1,0)+IF(S44=3,2*(T46-S46)+1,0)+IF(U44=3,2*(V46-U46)+1,0)+IF(W44=3,2*(X46-W46)+1,0)+IF(Y44=3,2*(Z46-Y46)+1,0)+IF(AA44=3,2*(AB46-AA46)+1,0)","v":11},5.5,60.5]
[null,"→",{"$f":"IF('stěna B'!$D$13=Data_podpora!$B$9,\"Výška stěny [m]\",\"Výška uprostřed stěny [m]\")","v":"Výška uprostřed stěny [m]"},{"$f":"507.76-496","v":11.759999999999991},"[m]",null,null,"min",{"$f":"$D$7","v":0},{"$f":"IF($I$13>=I14,$N$11*I14+$J$4,IF(I14<=$I$16,J12,-$N$11*I14+$J$12+$N$11*$D$12))","v":{"$error":"#DIV/0!"}},{"$f":"$D$7","v":0},{"$f":"$D$6","v":0},"sklon",{"$f":"$N$13","v":{"$error":"#DIV/0!"}},null,null,null,null,null,null,null,"zábradlí 2m",null,{"$f":"IF(I44=2,2*(J46-I46)+1,0)+IF(K44=2,2*(L46-K46)+1,0)+IF(M44=2,2*(N46-M46)+1,0)+IF(O44=2,2*(P46-O46)+1,0)+IF(Q44=2,2*(R46-Q46)+1,0)+IF(S44=2,2*(T46-S46)+1,0)+IF(U44=2,2*(V46-U46)+1,0)+IF(W44=2,2*(X46-W46)+1,0)+IF(Y44=2,2*(Z46-Y46)+1,0)+IF(AA44=2,2*(AB46-AA46)+1,0)","v":11},3.5,38.5]
[null,{"$f":"IF($D$13=Data_podpora!B9,\"\",\"→\")","v":"→"},{"$f":"IF($D$13=Data_podpora!$B$9,\"\",\"Výška od terénu k okapu (levý) [m]\")","v":"Výška od terénu k okapu (levý) [m]"},{"$f":"507.76-496","v":11.759999999999991},{"$f":"IF($D$13=Data_podpora!$B$9,\"\",\"[m]\")","v":"[m]"},null,null,"polov1",{"$f":"$D$17","v":0},{"$f":"$D$14","v":11.759999999999991},{"$f":"$D$17","v":0},{"$f":"$D$18","v":0},null,null,null,null,null,null,null,null,null,"diagonální úchyt",null,{"$f":"X16/MAX(I46:AB46)","v":1},0.5,0.5]
[null,null,{"$f":" IF(D13=Data_podpora!B10,\"Upřesňující parametry pro polovalbovou střechu:\",\"\")","v":""},null,null,null,null,"top",{"$f":"$D$12/2","v":2.5},{"$f":"$D$14","v":11.759999999999991},{"$f":"$D$12/2","v":2.5},{"$f":"0","v":0},null,null,null,null,null,null,null,null,null,"diagonála 3m",null,{"$f":"MAX(J46-I46,L46-K46,N46-M46,P46-O46,R46-Q46,T46-S46,V46-U46,X46-W46,Z46-Y46,AB46-AA46)*ROUNDUP((IF(I44=3,I44,0)+IF(K44=3,K44,0)+IF(M44=3,M44,0)+IF(O44=3,O44,0)+IF(Q44=3,Q44,0)+IF(S44=3,S44,0)+IF(U44=3,U44,0)+IF(W44=3,W44,0)+IF(Y44=3,Y44,0)+IF(AA44=3,AA44,0))/20,0)","v":5},11,55]
[null,{"$f":"IF($D$13=Data_podpora!$B$10,'stěna B'!$B$15,\"\")","v":""},{"$f":"IF($D$13=Data_podpora!$B$10,\"Místo polovalby [m]\",\"\")","v":""},null,{"$f":"IF($D$13=Data_podpora!$B$10,\"[m]\",\"\")","v":""},null,null,"polov2",{"$f":"$D$12-$D$17","v":5},{"$f":"$D$14","v":11.759999999999991},{"$f":"$D$12-$D$17","v":5},{"$f":"$D$19","v":0},null,null,null,null,null,null,null,null,null,"diagonála 2m",null,{"$f":"IF(X16=0,MAX(J46-I46,L46-K46,N46-M46,P46-O46,R46-Q46,T46-S46,V46-U46,X46-W46,Z46-Y46,AB46-AA46)*ROUNDUP((IF(I44=2,I44,0)+IF(K44=2,K44,0)+IF(M44=2,M44,0)+IF(O44=2,O44,0)+IF(Q44=2,Q44,0)+IF(S44=2,S44,0)+IF(U44=2,U44,0)+IF(W44=2,W44,0)+IF(Y44=2,Y44,0)+IF(AA44=2,AA44,0))/12,0),0)","v":0},8,0]
[null,{"$f":"IF($D$13=Data_podpora!$B$10,'stěna B'!$B$15,\"\")","v":""},{"$f":"IF($D$13=Data_podpora!$B$10,\"Výška terénu v místě levé polovalby [m]\",\"\")","v":""},null,{"$f":"IF($D$13=Data_podpora!$B$10,\"[m]\",\"\")","v":""},null,null,"vpravo",{"$f":"$D$12","v":5},{"$f":"$J$4","v":11.759999999999991},{"$f":"$D$12","v":5},{"$f":"$D$5","v":0},null,null,null,null,null,null,null,null,null,"kotva 0,5 m",null,{"$f":"IF(X19=0,ROUNDUP(X8*0.45,0),ROUNDUP(X8*0.45,0)-X19)","v":7},2,14]
[null,{"$f":"IF($D$13=Data_podpora!$B$10,'stěna B'!$B$15,\"\")","v":""},{"$f":"IF($D$13=Data_podpora!$B$10,\"Výška terénu v místě pravé polovalby [m]\",\"\")","v":""},null,{"$f":"IF($D$13=Data_podpora!$B$10,\"[m]\",\"\")","v":""},null,null,null,null,null,null,null,null,null,null,null,null,null,null,null,null,"kotva dlouhá 1 m",null,0,3.8,0]
[null,null,null,null,null,null,null,"Patra lešení",null,null,null,null,null,null,null,null,null,null,null,null,null,"eLko / sloupek",null,{"$f":"IF(X22=0,COUNT(J46,L46,N46,P46,R46,T46,V46,X46,Z46,AB46)+1,(COUNT(J46,L46,N46,P46,R46,T46,V46,X46,Z46,AB46)+1)-X22)","v":3},5,15]
[null,null,null,null,null,null,null,null,null,null,null,null,null,null,null,null,null,null,null,null,null,"eLko 2 m",null,null,11.5,0]
[null,{"$f":"IF($D$21=Data_podpora!B30,\"→\",\"\")","v":""},{"$f":"IF(D21=Data_podpora!B30,\"Vzdálenost od levého rohu [m]\",\"\")","v":""},null,{"$f":"IF(D21=Data_podpora!B30,\"[m]\",\"\")","v":""},null,null,"-0,5",{"$f":"I26-1","v":-0.19999999999999996},{"$f":"J26-1","v":-0.19999999999999996},{"$f":"K26-1","v":-0.19999999999999996},{"$f":"L26-1","v":-0.19999999999999996},{"$f":"M26-1","v":-0.19999999999999996},null,null,null,null,null,null,null,null,"Háčko",null,{"$f":"2*(MAX(I46:AB46)-MIN(J46,L46,N46,P46,R46,T46,V46,X46,Z46,AB46))","v":0},9.6999999999999993,0]
[null,{"$f":"IF($D$21=Data_podpora!$B$30,\"→\",\"\")","v":""},{"$f":"IF(D21=Data_podpora!B30,\"Výška od terénu (zleva) [m]\",\"\")","v":""},null,{"$f":"IF(D21=Data_podpora!B30,\"[m]\",\"\")","v":""},null,null,"-3",{"$f":"I24-2","v":-5.2},-5.9,-5.9,-5.9,-5.9,null,null,null,null,null,null,null,null,"boční zábradlí",null,{"$f":"IF(X22=0,(MAX(J46-I46,L46-K46,N46-M46,P46-O46,R46-Q46,T46-S46,V46-U46,X46-W46,Z46-Y46,AB46-AA46)+1)*2,(MAX(J46-I46,L46-K46,N46-M46,P46-O46,R46-Q46,T46-S46,V46-U46,X46-W46,Z46-Y46,AB46-AA46)+1)*2-X22)","v":12},3,36]
[null,{"$f":"IF($D$21=Data_podpora!$B$30,\"→\",\"\")","v":""},{"$f":"IF(D21=Data_podpora!B30,\"Šířka [m]\",\"\")","v":""},null,{"$f":"IF(D21=Data_podpora!B30,\"[m]\",\"\")","v":""},null,null,"-2",-3.2,-3.9,-3.9,-3.9,-3.9,null,null,null,null,null,null,null,null,"okopové prkno 3m",null,{"$f":"IF(I44=3,J46-I46,0)+IF(K44=3,L46-K46,0)+IF(M44=3,N46-M46,0)+IF(O44=3,P46-O46,0)+IF(Q44=3,R46-Q46,0)+IF(S44=3,T46-S46,0)+IF(U44=3,V46-U46,0)+IF(W44=3,X46-W46,0)+IF(Y44=3,Z46-Y46,0)+IF(AA44=3,AB46-AA46,0)","v":5},6.5,32.5]
[null,null,null,null,null,null,null,"-1",{"$f":"I26-2","v":-1.2},{"$f":"$D$85-2","v":-1.9},{"$f":"$D$85-2","v":-1.9},{"$f":"$D$85-2","v":-1.9},{"$f":"$D$85-2","v":-1.9},null,null,null,null,null,null,null,null,"okopové prkno 2m",null,{"$f":"IF(I44=2,J46-I46,0)+IF(K44=2,L46-K46,0)+IF(M44=2,N46-M46,0)+IF(O44=2,P46-O46,0)+IF(Q44=2,R46-Q46,0)+IF(S44=2,T46-S46,0)+IF(U44=2,V46-U46,0)+IF(W44=2,X46-W46,0)+IF(Y44=2,Z46-Y46,0)+IF(AA44=2,AB46-AA46,0)","v":5},4.5,22.5]
[null,null,null,null,null,null,null,"0",{"$f":"$K$41","v":0.8},{"$f":"$K$41","v":0.8},{"$f":"$K$41","v":0.8},{"$f":"$K$41","v":0.8},{"$f":"$K$41","v":0.8},null,null,null,null,null,null,null,null,"konzola",null,null,10,0]
[null,null,null,null,null,null,null,"1",{"$f":"I26+$D$86","v":2.8},{"$f":"J26+$D$86","v":2.8},{"$f":"K26+$D$86","v":2.8},{"$f":"L26+$D$86","v":2.8},{"$f":"M26+$D$86","v":2.8},null,null,null,null,null,null,null,null,"pevna spojka",null,{"$f":"J46*2","v":10},1.1499999999999999,11.5]
[null,null,null,null,null,null,null,"2",4.8,4.8,4.8,4.8,4.8,null,null,null,null,null,null,null,null,"otočná spojka",null,{"$f":"J46","v":5},1.35,6.75]
[null,null,null,null,null,null,null,"3",6.8,6.8,6.8,6.8,6.8,null,null,null,null,null,null,null,null,"závlačná spojka",null,{"$f":"J46*2","v":10},0.8,8]
[null,null,null,null,null,null,null,"4",8.8000000000000007,8.8000000000000007,8.8000000000000007,8.8000000000000007,8.8000000000000007,null,null,null,null,null,null,null,null,"CELKOVÁ HMOTNOST [kg]",null,null,null,{"$f":"SUM(Z6:Z29)","v":941.45}]
[null,null,null,null,null,null,null,"5",10.8,10.8,10.8,10.8,10.8]
[null,null,null,null,null,null,null,"6",12.8,12.8,12.8,12.8,12.8]
[null,null,null,null,null,null,null,"7",14.8,14.8,14.8,14.8,14.8]
[null,null,null,null,null,null,null,"8",16.8,16.8,16.8,16.8,16.8]
[null,null,null,null,null,null,null,"9",18.8,18.8,18.8,18.8,18.8]
[null,null,null,null,null,null,null,"10",20.8,20.8,20.8,20.8,20.8]
[null,null,null,null,null,null,null,"11",22.8,22.8,22.8,22.8,22.8]
[null,null,null,null,null,null,null,"12",24.8,24.8,24.8,24.8,24.8]
[null,null,null,null,null,null,null,"13",26.8,26.8,26.8,26.8,26.8]
[]
[null,null,null,null,null,null,null,"LEŠENÍ","výška založení [m]",null,{"$f":"D8+0.8","v":0.8},"[m]","nepsat nuly v kolonce \"patro\",pokud není sestava lešení využita",null,null,null,null,null,"Poznámka:",{"$f":"IF(Půdorys!I6=0,\"\",Půdorys!I6)","v":"2m sestava"}]
[null,null,null,null,null,null,null,null,"ZALOŽENÍ","VÝŠKA P.P.","ZALOŽENÍ","VÝŠKA P.P.","ZALOŽENÍ","VÝŠKA P.P.","ZALOŽENÍ","VÝŠKA P.P.","ZALOŽENÍ","VÝŠKA P.P.","ZALOŽENÍ","VÝŠKA P.P.","ZALOŽENÍ","VÝŠKA P.P.","ZALOŽENÍ","VÝŠKA P.P.","ZALOŽENÍ","VÝŠKA P.P.","ZALOŽENÍ","VÝŠKA P.P."]
[null,null,null,null,null,null,null,"SESTAVA",1,null,2,null,3,null,4,null,5,null,6,null,7,null,8,null,9,null,10]
[null,null,null,null,null,null,null,"DÉLKA SESTAVY",2,null,3,null,0,null,0,null,0,null,0,null,0,null,0,null,0,null,0]
[null,null,null,null,null,null,null,"\"potvrdit\""]
[null,null,null,null,null,null,null,"PATRO",0,5,0,5]
[null,null,null,null,null,null,null,"POSUN"]
[null,null,null,null,null,null,null,"plocha [m2]",{"$f":"(J46-I46)*$D$86*I44","v":20},null,{"$f":"L46*$D$86*K44","v":30},null,{"$f":"N46*$D$86*M44","v":0},null,{"$f":"P46*$D$86*O44","v":0},null,{"$f":"R46*$D$86*Q44","v":0},null,{"$f":"T46*$D$86*S44","v":0},null,{"$f":"V46*$D$86*U44","v":0},null,{"$f":"X46*$D$86*W44","v":0},null,{"$f":"Z46*$D$86*Y44","v":0},null,{"$f":"AB46*$D$86*AA44","v":0}]
[null,null,null,null,null,null,null,"výška",{"$f":"IF(I46=-0.5,M22,INDEX($M$23:$M$39,I46+4))","v":0.8},{"$f":"INDEX($M$23:$M$39,J46+4)","v":10.8},{"$f":"IF(K46=-0.5,M22,INDEX($M$23:$M$39,K46+4))","v":0.8},{"$f":"INDEX($M$23:$M$39,L46+4)","v":10.8},{"$f":"IF(M46=-0.5,M22,INDEX($M$23:$M$39,M46+4))","v":0.8},{"$f":"INDEX($M$23:$M$39,N46+4)","v":0.8},{"$f":"IF(O46=-0.5,M22,INDEX($M$23:$M$39,O46+4))","v":0.8},{"$f":"INDEX($M$23:$M$39,P46+4)","v":0.8},{"$f":"IF(Q46=-0.5,M22,INDEX($M$23:$M$39,Q46+4))","v":0.8},{"$f":"INDEX($M$23:$M$39,R46+4)","v":0.8},{"$f":"IF(S46=-0.5,M22,INDEX($M$23:$M$39,S46+4))","v":0.8},{"$f":"INDEX($M$23:$M$39,T46+4)","v":0.8},{"$f":"IF(U46=-0.5,M22,INDEX($M$23:$M$39,U46+4))","v":0.8},{"$f":"INDEX($M$23:$M$39,V46+4)","v":0.8},{"$f":"IF(W46=-0.5,M22,INDEX($M$23:$M$39,W46+4))","v":0.8},{"$f":"INDEX($M$23:$M$39,X46+4)","v":0.8},{"$f":"IF(Y46=-0.5,M22,INDEX($M$23:$M$39,Y46+4))","v":0.8},{"$f":"INDEX($M$23:$M$39,Z46+4)","v":0.8},{"$f":"IF(AA46=-0.5,M22,INDEX($M$23:$M$39,AA46+4))","v":0.8},{"$f":"INDEX($M$23:$M$39,AB46+4)","v":0.8}]
[]
[]
[]
[]
[]
[null,null,null,null,null,null,null,-1]
[null,null,null,null,null,null,null,0]
[null,null,null,null,null,null,null,1,{"$f":"$I$49","v":0.8},{"$f":"$J$49","v":10.8}]
[null,null,null,null,null,null,null,2,{"$f":"$I$49","v":0.8},{"$f":"$J$49","v":10.8}]
[null,null,null,null,null,null,null,3,{"$f":"$I$49","v":0.8},{"$f":"$J$49","v":10.8},{"$f":"$K$49","v":0.8},{"$f":"$L$49","v":10.8}]
[null,null,null,null,null,null,null,4,null,null,{"$f":"$K$49","v":0.8},{"$f":"$L$49","v":10.8}]
[null,null,null,null,null,null,null,5,null,null,{"$f":"$K$49","v":0.8},{"$f":"$L$49","v":10.8}]
[null,null,null,null,null,null,null,6,null,null,{"$f":"$K$49","v":0.8},{"$f":"$L$49","v":10.8},{"$f":"$M$49","v":0.8},{"$f":"$N$49","v":0.8}]
[null,null,null,null,null,null,null,7,null,null,null,null,{"$f":"$M$49","v":0.8},{"$f":"$N$49","v":0.8}]
[null,null,null,null,null,null,null,8,null,null,null,null,{"$f":"$M$49","v":0.8},{"$f":"$N$49","v":0.8}]
[null,null,null,null,null,null,null,9,null,null,null,null,{"$f":"$M$49","v":0.8},{"$f":"$N$49","v":0.8},{"$f":"$O$49","v":0.8},{"$f":"$P$49","v":0.8}]
[null,null,null,null,null,null,null,10,null,null,null,null,null,null,{"$f":"$O$49","v":0.8},{"$f":"$P$49","v":0.8}]
[null,null,null,null,null,null,null,11,null,null,null,null,null,null,{"$f":"$O$49","v":0.8},{"$f":"$P$49","v":0.8}]
[null,null,null,null,null,null,null,12,null,null,null,null,null,null,{"$f":"$O$49","v":0.8},{"$f":"$P$49","v":0.8},{"$f":"$Q$49","v":0.8},{"$f":"$R$49","v":0.8}]
[null,null,"Pomocný výpočet počtu sestav lešení:",null,null,null,null,13,null,null,null,null,null,null,null,null,{"$f":"$Q$49","v":0.8},{"$f":"$R$49","v":0.8}]
[null,null,"Délka:",null,null,null,null,14,null,null,null,null,null,null,null,null,{"$f":"$Q$49","v":0.8},{"$f":"$R$49","v":0.8}]
[null,null,"přesah za roh objektu:","Ne",null,null,null,15,null,null,null,null,null,null,null,null,{"$f":"$Q$49","v":0.8},{"$f":"$R$49","v":0.8},{"$f":"$S$49","v":0.8},{"$f":"$T$49","v":0.8}]
[null,null,"Požadovaná minimální délka lešení [m]",{"$f":"IF(D71=Data_podpora!B17,'stěna B'!D12+2,IF('stěna B'!D71=Data_podpora!B14,'stěna B'!D12+0.5,IF(D71=Data_podpora!B13,'stěna B'!D12,'stěna B'!D12+1)))","v":5},"[m]",null,null,16,null,null,null,null,null,null,null,null,null,null,{"$f":"$S$49","v":0.8},{"$f":"$T$49","v":0.8}]
[null,null,"Počet sestav lešení (3m) [-]",{"$f":"ROUNDDOWN(D72/E73,0)","v":1},"3",{"$f":"D73*E73","v":3},"[m]",17,null,null,null,null,null,null,null,null,null,null,{"$f":"$S$49","v":0.8},{"$f":"$T$49","v":0.8}]
[null,null,"Počet sestav lešení (2m) [-]",{"$f":"ROUNDDOWN(MOD(D72,E73)/E74,0)","v":1},"2",{"$f":"D74*E74","v":2},"[m]",18,null,null,null,null,null,null,null,null,null,null,{"$f":"$S$49","v":0.8},{"$f":"$T$49","v":0.8},{"$f":"$U$49","v":0.8},{"$f":"$V$49","v":0.8}]
[null,null,"Počet sestav lešení (0,75m) [-]",{"$f":"ROUNDUP(D72-(D73*E73+D74*E74),0)","v":0},"0,75",{"$f":"D75*E75","v":0},"[m]",19,null,null,null,null,null,null,null,null,null,null,null,null,{"$f":"$U$49","v":0.8},{"$f":"$V$49","v":0.8}]
[null,null,"Reálná délka lešení [m]",{"$f":"D73*E73+D74*E74+D75*E75","v":5},"[m]",null,null,20,null,null,null,null,null,null,null,null,null,null,null,null,{"$f":"$U$49","v":0.8},{"$f":"$V$49","v":0.8}]
[null,null,null,null,null,null,null,21,null,null,null,null,null,null,null,null,null,null,null,null,{"$f":"$U$49","v":0.8},{"$f":"$V$49","v":0.8},{"$f":"$W$49","v":0.8},{"$f":"$X$49","v":0.8}]
[null,null,"Výška:",null,null,null,null,22,null,null,null,null,null,null,null,null,null,null,null,null,null,null,{"$f":"$W$49","v":0.8},{"$f":"X77","v":0.8}]
[null,null,"Lešení pro:","Fasádu",null,null,null,23,null,null,null,null,null,null,null,null,null,null,null,null,null,null,{"$f":"$W$49","v":0.8},{"$f":"X78","v":0.8}]
[null,null,"Výška zábradlí posledního patra [m]",1,"[m]",null,null,24,null,null,null,null,null,null,null,null,null,null,null,null,null,null,{"$f":"$W$49","v":0.8},{"$f":"X79","v":0.8},{"$f":"$Y$49","v":0.8},{"$f":"$Z$49","v":0.8}]
[null,null,"Požadovaná výška [m]",{"$f":"IF(D79=Data_podpora!B22,'stěna B'!D14+D80,'stěna B'!D14)","v":11.759999999999991},"[m]",null,null,25,null,null,null,null,null,null,null,null,null,null,null,null,null,null,null,null,{"$f":"$Y$49","v":0.8},{"$f":"Z80","v":0.8}]
["Založení",null,"Výška nejnižžšího bodu terénu [m]",{"$f":"MIN(D4,D5,D6,D8)","v":0},"[m]",null,null,26,null,null,null,null,null,null,null,null,null,null,null,null,null,null,null,null,{"$f":"$Y$49","v":0.8},{"$f":"Z81","v":0.8}]
[null,null,"Výška nejvyššího  bodu terénu [m]",{"$f":"D8","v":0},"[m]",null,null,27,null,null,null,null,null,null,null,null,null,null,null,null,null,null,null,null,{"$f":"$Y$49","v":0.8},{"$f":"Z82","v":0.8},{"$f":"$AA$49","v":0.8},{"$f":"$AB$49","v":0.8}]
[null,null,"Rozdíl max a min [m]",{"$f":"D83-D82","v":0},"[m]",{"$f":"IF(D84<0.4,\"(Patky 0,4m)\",IF(D84<=1,\"(Patky 1m)\",IF(2>=D84>1,\"(Rám 1m)\",IF(5>D84>2,\"(Rám 2m)\",\"\"))))","v":"(Patky 0,4m)"},null,28,null,null,null,null,null,null,null,null,null,null,null,null,null,null,null,null,null,null,{"$f":"$AA$49","v":0.8},{"$f":"AB83","v":0.8}]
[null,"#","Výška založení [m]",{"$f":"D8+0.1","v":0.1},"[m]",null,null,29,null,null,null,null,null,null,null,null,null,null,null,null,null,null,null,null,null,null,{"$f":"$AA$49","v":0.8},{"$f":"AB84","v":0.8}]
[null,null,"Modulová výška patra lešení [m]",2,"[m]",null,null,30,null,null,null,null,null,null,null,null,null,null,null,null,null,null,null,null,null,null,{"$f":"$AA$49","v":0.8},{"$f":"AB85","v":0.8}]
[null,null,"Počet pater lešení [-]; výška [m])",{"$f":"IF(D81-D85<11,ROUNDDOWN((D81-D85)/2.15,0),ROUNDDOWN((D81-D85)/2.1,0))","v":5},"pater",{"$f":"INDEX(M27:M39,D87)","v":10.8},"[m]",31]
[null,null,"Reálná výška lešení [m]",{"$f":"D87*D86+D85+D80","v":11.1},"[m]"]
[]
["Uskočení pater","→","Hranice posouzení uskočení","4",null,{"$f":"INDEX(M27:M39,D90)","v":8.8000000000000007},"[m]"]
[null,null,"Zbývající výška do hřebene",{"$f":"$D$14-F90","v":2.9599999999999902},"[m]"]
[null,null,"Počet uskočených pater",{"$f":"IF(D91<11,ROUNDDOWN((D91)/2.6,0),ROUNDDOWN((D91)/2.6,0))","v":1},{"$f":"IF(D92=1,\"patro\",IF(D92<=4,\"patra\",\"pater\"))","v":"patro"}]
[null,null,"Rozdíl výšky okapu a nejbližšího patra",{"$f":"$J$4-(INDEX(M27:M39,D90))","v":2.9599999999999902},"[m]"]
[null,null,"Rozdíl výšek na 3 m sestavu",{"$f":"$N$5*$E$73","v":0},"[m]"]
[null,{"$f":"IF($D$92>=1,1,\"\")","v":1},"První sestava",{"$f":"D93+D94","v":2.9599999999999902},"[m]",{"$f":"IF(D$95<=2,\"posoudit další\",IF(D$95<=3.2,\"ponechat\",\"pokračuje patrem\"))","v":"ponechat"}]
[null,{"$f":"IF(1<=$D$92,2,\"X\")","v":2},"Druhá sestava",{"$f":"IF(F95=\"ponechat\",$D$93+$D$94*B96,$D$93+$D$94*B96-2)","v":2.9599999999999902},"[m]",{"$f":"IF(D96<2,\"posoudit další\",IF(D96<=3.2,\"ponechat\",IF(D96>3.2,\"pokračuje patrem\",\"\")))","v":"ponechat"}]
[null,{"$f":"IF(2<=$D$92,3,\"X\")","v":"X"},"Třetí sestava",{"$f":"IF(F96=\"ponechat\",$D$93+$D$94*B97,$D$93+$D$94*B97-2)","v":{"$error":"#VALUE!"}},"[m]",{"$f":"IF(D97<2,\"posoudit další\",IF(D97<=3.2,\"ponechat\",IF(D97>3.2,\"pokračuje patrem\",\"\")))","v":{"$error":"#VALUE!"}}]
[null,{"$f":"IF(3<=$D$92,4,\"X\")","v":"X"},"Čtvrtá sestava",{"$f":"IF(F97=\"ponechat\",$D$93+$D$94*B98,$D$93+$D$94*B98-2)","v":{"$error":"#VALUE!"}},"[m]",{"$f":"IF(D98<2,\"posoudit další\",IF(D98<=3.2,\"ponechat\",IF(D98>3.2,\"pokračuje patrem\",\"\")))","v":{"$error":"#VALUE!"}}]
[]
[]
[]
[]
[null,null,"NAKLÁDACÍ LIST"]
[]
[null,null,"stavitelná patka 0,5m","počet kusů"]
[null,null,"stavitelná patka 1m",{"$f":"IF(D107>=0,($D$73+$D$74+$D$75)*2+2-D107,($D$73+$D$74+$D$75)*2+2)","v":4}]
[null,null,"rám 2m",2]
[null,null,"rám 1m",{"$f":"(($D$73+$D$74+$D$75)+1)*$D$87","v":15}]
[null,null,"podlaha 3m",{"$f":"IF(D85>=1,($D$73+$D$74+$D$75)+1,0)","v":0}]
[null,null,"podlaha 2m",{"$f":"(D73*D87-$D112)*2","v":0}]
[null,null,"průlezová podlaha 3m",{"$f":"D74*D87","v":5}]
[null,null,"zábradlí 3m",{"$f":"D87","v":5}]
[null,null,"zábradlí 2m",{"$f":"(1+$D$87*2)*D73","v":11}]
[null,null,"diagonální úchyt",{"$f":"(1+$D$87*2)*D74","v":11}]
[null,null,"diagonála 3m"]
[null,null,"diagonála 2m",{"$f":"$D$87*(ROUNDUP((D73+D74+D75)/4,0))","v":5}]
[null,null,"kotva 0,5 m",{"$f":"IF(D116=0,$D$87*ROUNDUP(D74/4,0),0)","v":0}]
[null,null,"kotva dlouhá 1 m",{"$f":"(($D$87-1)*SUM(D73:D75))/2","v":4}]
[null,null,"eLko / sloupek"]
[null,null,"eLko 2 m",{"$f":"SUM(D73:D75)+1","v":3}]
[null,null,"Háčko"]
[null,null,"boční zábradlí"]
[null,null,"okopové prkno 3m",{"$f":"D87*2","v":10}]
[null,null,"okopové prkno 2m",{"$f":"D73*D87","v":5}]
[null,null,"konzola",{"$f":"D74*D87","v":5}]
[null,null,"pevna spojka"]
[null,null,"otočná spojka"]
[null,null,"závlačná spojka"]

{"sheet":"stěna C","index":4,"n_rows":128,"n_cols":34,"rows_kept":128,"cut":false,"hidden":false,"merged":[[0,4,1,6],[2,28,2,30],[2,31,2,33],[3,21,4,22],[3,23,4,23],[3,24,4,24],[3,25,4,25],[42,20,42,21],[42,22,42,23],[42,24,42,25],[42,26,42,27],[43,8,43,9],[43,10,43,11],[43,12,43,13],[43,14,43,15],[43,16,43,17],[43,18,43,19],[42,8,42,9],[42,10,42,11],[42,12,42,13],[42,14,42,15],[42,16,42,17],[42,18,42,19],[43,20,43,21],[43,22,43,23],[43,24,43,25],[43,26,43,27],[47,8,47,9],[47,10,47,11],[47,12,47,13],[47,14,47,15],[47,16,47,17],[47,18,47,19],[89,0,93,0],[47,20,47,21],[47,22,47,23],[47,24,47,25],[47,26,47,27],[70,3,70,4],[81,0,84,0]]}
[null,null,"Stěna A","Výkres:",null,null,null,"Data grafu:"]
[null,null,"Nastavení parametrů výpočtu:",null,null,null,null,null,"Tvar střechy",null,"Tvar terénu",null,"úhel alfa",null,null,null,null,null,null,null,null,"NAKLÁDACÍ LIST:",null,{"$f":"$C$1","v":"Stěna A"},{"$f":"IF(AD6=0,\"(BUDE NAKLÁDÁNO POUZE AUTO)\",\"\")","v":""},null,null,"VYTÍŽENOST ODVOZNÍHO PROSTŘEDKU:"]
[null,null,"Terén: absolutní výška (±0,00 = svislice od hřebene střechy na terén)",null,null,null,null,null,"osa x","osa y","osa x","osa y","tg A",{"$f":"($D$14-$J$4)/($D$12/2)","v":0},null,null,null,null,null,null,null,"obestavběná plocha lešení [m2]",null,null,{"$f":"IF(K41>=1,SUM(I48,K48,M48,O48,Q48,S48,U48,W48,Y48,AA48)+SUM(I44,K44,M44,O44,Q44,S44,U44,W44,Y44,AA44)*2+SUM(I44,K44,M44,O44,Q44,S44,U44,W44,Y44,AA44),SUM(I48,K48,M48,O48,Q48,S48,U48,W48,Y48,AA48)+SUM(I44,K44,M44,O44,Q44,S44,U44,W44,Y44,AA44)*2)","v":288},"[m2]",null,"[kg]","1. cesta",null,null,"2.cesta"]
[null,"→","Výška terénu v levém rohu [m]",0,"[m]",null,null,"vlevo",0,{"$f":"IF($D$13=Data_podpora!$B$9,$D$14,$D$15+$D$4)","v":11.759999999999991},0,{"$f":"$D$4","v":0},"A",{"$f":"DEGREES(ATAN(N3))","v":0},null,null,null,null,null,null,null,"Komponenta",null,"počet kusů [ks]","jednotková hmotnost [kg/ks]","hmotnost [kg]",null,null,"KAPACITA","VYUŽITO","Zbývá","KAPACITA","VYUŽITO","ZBÝVÁ"]
[null,"→","Výška terénu v pravém rohu [m]",0,"[m]",null,null,"max",{"$f":"$D$9","v":0},{"$f":"IF($D$12/2<I5,-$N$3*I5+$J$4+$N$3*$D$12,$N$3*I5+$J$4)","v":11.759999999999991},{"$f":"$D$9","v":0},{"$f":"$D$8","v":0},"tg A",{"$f":"TAN(RADIANS($N$4))","v":0},null,null,null,null,null,null,null,null,null,null,null,null,null,"AUTO",2500,{"$f":"IF(Z30<=AC5,SUM(Z6:Z29),SUM(Z6:Z9,Z26:Z29,Z15:Z23,Z13/2,Z14/2))","v":1329.35},{"$f":"IF((AC5-AD5)<=0,0,AC5-AD5)","v":1170.6500000000001},2500,{"$f":"IF(AC5-AD5<=0,-(AC5-AD5),0)","v":0},{"$f":"AF5-AG5","v":2500}]
[null,"→","Výška nejnižšího bodu terénu [m]",0,"[m]",null,null,"min",{"$f":"$D$7","v":0},{"$f":"IF($D$12/2>I6,$N$3*I6+$J$4,-$N$3*I6+$J$4+$N$3*$D$12)","v":11.759999999999991},{"$f":"$D$7","v":0},{"$f":"$D$6","v":0},"sklon",{"$f":"$N$5","v":0},null,null,null,null,null,null,null,"stavitelná patka 0,5m",null,{"$f":"IF(X7>0,(COUNT(I46:AB46)+2)-X7,(COUNT(I46:AB46)+2))","v":18},3.1,{"$f":"Y7*X6","v":84.600000000000009},null,"ZÁVĚS",3500,{"$f":"IF(Z30<=AC5,0,SUM(Z10:Z12,Z24:Z25,Z13/2,Z14/2))","v":2182},{"$f":"IF((AC6-AD6)<=0,0,AC6-AD6)","v":1318},3500,{"$f":"IF(AC6-AD6<=0,-(AC6-AD6),0)","v":0},{"$f":"AF6-AG6","v":3500}]
[null,"→","Místo nejnižšího bodu (zleva) [m]",0,"[m]",null,null,"top",{"$f":"$D$12/2","v":10.75},{"$f":"$D$14","v":11.759999999999991},{"$f":"$D$12/2","v":10.75},{"$f":"0","v":0},null,null,null,null,null,null,null,null,null,"stavitelná patka 1m",null,0,4.7,{"$f":"Y9*X7","v":0}]
[null,"→","Výška nejvyššího bodu terénu [m]",0,"[m]",null,null,"vpravo",{"$f":"$D$12","v":21.5},{"$f":"$J$4","v":11.759999999999991},{"$f":"$D$12","v":21.5},{"$f":"$D$5","v":0},null,null,null,null,null,null,null,null,null,"rám 2m",null,{"$f":"IF(X9>0,SUM(J46-I46,L46-K46,N46-M46,P46-O46,R46-Q46,T46-S46,V46-U46,X46-W46,Z46-Y46,AB46-AA46)+MIN(J46-I46,L46-K46,N46-M46,P46-O46,R46-Q46,T46-S46,V46-U46,X46-W46,Z46-Y46,AB46-AA46)+MAX(J46-I46,L46-K46,N46-M46,P46-O46,R46-Q46,T46-S46,V46-U46,X46-W46,Z46-Y46,AB46-AA46)-MIN(J46-I46,L46-K46,N46-M46,P46-O46,R46-Q46,T46-S46,V46-U46,X46-W46,Z46-Y46,AB46-AA46)-X9,SUM(J46-I46,L46-K46,N46-M46,P46-O46,R46-Q46,T46-S46,V46-U46,X46-W46,Z46-Y46,AB46-AA46)+MIN(J46-I46,L46-K46,N46-M46,P46-O46,R46-Q46,T46-S46,V46-U46,X46-W46,Z46-Y46,AB46-AA46)+MAX(J46-I46,L46-K46,N46-M46,P46-O46,R46-Q46,T46-S46,V46-U46,X46-W46,Z46-Y46,AB46-AA46)-MIN(J46-I46,L46-K46,N46-M46,P46-O46,R46-Q46,T46-S46,V46-U46,X46-W46,Z46-Y46,AB46-AA46))","v":45},16.5,{"$f":"Y8*X8","v":742.5}]
[null,"→","Místo nejvyššího bodu (zleva) [m]",0,"[m]",null,null,null,null,null,null,null,null,null,null,null,null,null,null,null,null,"rám 1m",null,0,11.3,0]
[null,null,null,null,null,null,null,null,"Tvar střechy",null,"Tvar terénu",null,"úhel alfa",null,null,null,null,null,null,null,null,"podlaha 3m",null,{"$f":"((IF(I44=3,J46-I46,0)+IF(K44=3,L46-K46,0)+IF(M44=3,N46-M46,0)+IF(O44=3,P46-O46,0)+IF(Q44=3,R46-Q46,0)+IF(S44=3,T46-S46,0)+IF(U44=3,V46-U46,0)+IF(W44=3,X46-W46,0)+IF(Y44=3,Z46-Y46,0)+IF(AA44=3,AB46-AA46,0))-X12)*2","v":70},22,1540]
[null,null,"Střecha:",null,null,null,null,null,"osa x","osa y","osa x","osa y","tg A",{"$f":"($D$14-$J$4)/($D$17)","v":{"$error":"#DIV/0!"}},null,null,null,null,null,null,null,"podlaha 2m",null,{"$f":"(IF(I44=2,J46-I46,0)+IF(K44=2,L46-K46,0)+IF(M44=2,N46-M46,0)+IF(O44=2,P46-O46,0)+IF(Q44=2,R46-Q46,0)+IF(S44=2,T46-S46,0)+IF(U44=2,V46-U46,0)+IF(W44=2,X46-W46,0)+IF(Y44=2,Z46-Y46,0)+IF(AA44=2,AB46-AA46,0))*2","v":0},14.5,0]
[null,null,"Délka strany [m]",{"$f":"Půdorys!$C$7","v":21.5},"[m]",null,null,"vlevo",0,{"$f":"$D$15+$D$4","v":11.759999999999991},0,{"$f":"$D$4","v":0},"A",{"$f":"DEGREES(ATAN(N11))","v":{"$error":"#DIV/0!"}},null,null,null,null,null,null,null,"průlezová podlaha 3m",null,{"$f":"MAX(J46:AB46)","v":5},28,140]
[null,"→","Tvar střechy:","sedlová",null,null,null,"max",{"$f":"$D$9","v":0},{"$f":"IF($I$17<I13,-$N$3*I13+$J$4+$N$11*$D$12,IF(I13<$I$14,$N$11*I13+$J$4,J14))","v":{"$error":"#DIV/0!"}},{"$f":"$D$9","v":0},{"$f":"$D$8","v":0},"tg A",{"$f":"TAN(RADIANS($N$12))","v":{"$error":"#DIV/0!"}},null,null,null,null,null,null,null,"zábradlí 3m",null,{"$f":"IF(I44=3,2*(J46-I46)+1,0)+IF(K44=3,2*(L46-K46)+1,0)+IF(M44=3,2*(N46-M46)+1,0)+IF(O44=3,2*(P46-O46)+1,0)+IF(Q44=3,2*(R46-Q46)+1,0)+IF(S44=3,2*(T46-S46)+1,0)+IF(U44=3,2*(V46-U46)+1,0)+IF(W44=3,2*(X46-W46)+1,0)+IF(Y44=3,2*(Z46-Y46)+1,0)+IF(AA44=3,2*(AB46-AA46)+1,0)","v":88},5.5,484]
[null,"→",{"$f":"IF('stěna A'!$D$13=Data_podpora!$B$9,\"Výška stěny [m]\",\"Výška uprostřed stěny [m]\")","v":"Výška uprostřed stěny [m]"},{"$f":"507.76-496","v":11.759999999999991},"[m]",null,null,"min",{"$f":"$D$7","v":0},{"$f":"IF($I$13>=I14,$N$11*I14+$J$4,IF(I14<=$I$16,J12,-$N$11*I14+$J$12+$N$11*$D$12))","v":{"$error":"#DIV/0!"}},{"$f":"$D$7","v":0},{"$f":"$D$6","v":0},"sklon",{"$f":"$N$13","v":{"$error":"#DIV/0!"}},null,null,null,null,null,null,null,"zábradlí 2m",null,{"$f":"IF(I44=2,2*(J46-I46)+1,0)+IF(K44=2,2*(L46-K46)+1,0)+IF(M44=2,2*(N46-M46)+1,0)+IF(O44=2,2*(P46-O46)+1,0)+IF(Q44=2,2*(R46-Q46)+1,0)+IF(S44=2,2*(T46-S46)+1,0)+IF(U44=2,2*(V46-U46)+1,0)+IF(W44=2,2*(X46-W46)+1,0)+IF(Y44=2,2*(Z46-Y46)+1,0)+IF(AA44=2,2*(AB46-AA46)+1,0)","v":0},3.5,0]
[null,{"$f":"IF($D$13=Data_podpora!B9,\"\",\"→\")","v":"→"},{"$f":"IF($D$13=Data_podpora!$B$9,\"\",\"Výška od terénu k okapu (levý) [m]\")","v":"Výška od terénu k okapu (levý) [m]"},{"$f":"507.76-496","v":11.759999999999991},{"$f":"IF($D$13=Data_podpora!$B$9,\"\",\"[m]\")","v":"[m]"},null,null,"polov1",{"$f":"$D$17","v":0},{"$f":"$D$14","v":11.759999999999991},{"$f":"$D$17","v":0},{"$f":"$D$18","v":0},null,null,null,null,null,null,null,null,null,"diagonální úchyt",null,{"$f":"X16/MAX(I46:AB46)","v":2},0.5,1]
[null,null,{"$f":" IF(D13=Data_podpora!B10,\"Upřesňující parametry pro polovalbovou střechu:\",\"\")","v":""},null,null,null,null,"top",{"$f":"$D$12/2","v":10.75},{"$f":"$D$14","v":11.759999999999991},{"$f":"$D$12/2","v":10.75},{"$f":"0","v":0},null,null,null,null,null,null,null,null,null,"diagonála 3m",null,{"$f":"MAX(J46-I46,L46-K46,N46-M46,P46-O46,R46-Q46,T46-S46,V46-U46,X46-W46,Z46-Y46,AB46-AA46)*ROUNDUP((IF(I44=3,I44,0)+IF(K44=3,K44,0)+IF(M44=3,M44,0)+IF(O44=3,O44,0)+IF(Q44=3,Q44,0)+IF(S44=3,S44,0)+IF(U44=3,U44,0)+IF(W44=3,W44,0)+IF(Y44=3,Y44,0)+IF(AA44=3,AA44,0))/20,0)","v":10},11,110]
[null,{"$f":"IF($D$13=Data_podpora!$B$10,'stěna A'!$B$15,\"\")","v":""},{"$f":"IF($D$13=Data_podpora!$B$10,\"Vzdálenost polovalby zleva  [m]\",\"\")","v":""},null,{"$f":"IF($D$13=Data_podpora!$B$10,\"[m]\",\"\")","v":""},null,null,"polov2",{"$f":"$D$12-$D$17","v":21.5},{"$f":"$D$14","v":11.759999999999991},{"$f":"$D$12-$D$17","v":21.5},{"$f":"$D$19","v":0},null,null,null,null,null,null,null,null,null,"diagonála 2m",null,{"$f":"IF(X16=0,MAX(J46-I46,L46-K46,N46-M46,P46-O46,R46-Q46,T46-S46,V46-U46,X46-W46,Z46-Y46,AB46-AA46)*ROUNDUP((IF(I44=2,I44,0)+IF(K44=2,K44,0)+IF(M44=2,M44,0)+IF(O44=2,O44,0)+IF(Q44=2,Q44,0)+IF(S44=2,S44,0)+IF(U44=2,U44,0)+IF(W44=2,W44,0)+IF(Y44=2,Y44,0)+IF(AA44=2,AA44,0))/12,0),0)","v":0},8,0]
[null,{"$f":"IF($D$13=Data_podpora!$B$10,'stěna A'!$B$15,\"\")","v":""},{"$f":"IF($D$13=Data_podpora!$B$10,\"Výška terénu v místě levé polovalby [m]\",\"\")","v":""},null,{"$f":"IF($D$13=Data_podpora!$B$10,\"[m]\",\"\")","v":""},null,null,"vpravo",{"$f":"$D$12","v":21.5},{"$f":"$J$4","v":11.759999999999991},{"$f":"$D$12","v":21.5},{"$f":"$D$5","v":0},null,null,null,null,null,null,null,null,null,"kotva 0,5 m",null,{"$f":"IF(X19=0,ROUNDUP(X8*0.45,0),ROUNDUP(X8*0.45,0)-X19)","v":21},2,42]
[null,{"$f":"IF($D$13=Data_podpora!$B$10,'stěna A'!$B$15,\"\")","v":""},{"$f":"IF($D$13=Data_podpora!$B$10,\"Výška terénu v místě pravé polovalby [m]\",\"\")","v":""},null,{"$f":"IF($D$13=Data_podpora!$B$10,\"[m]\",\"\")","v":""},null,null,null,null,null,null,null,null,null,null,null,null,null,null,null,null,"kotva dlouhá 1 m",null,0,3.8,0]
[null,{"$f":"IF($D$21=Data_podpora!$B$30,\"→\",\"\")","v":""},{"$f":"IF(D18=Data_podpora!B30,\"Výška od terénu (zleva) [m]\",\"\")","v":""},null,null,null,null,"Patra lešení",null,null,null,null,null,null,null,null,null,null,null,null,null,"eLko / sloupek",null,{"$f":"IF(X22=0,COUNT(J46,L46,N46,P46,R46,T46,V46,X46,Z46,AB46)+1,(COUNT(J46,L46,N46,P46,R46,T46,V46,X46,Z46,AB46)+1)-X22)","v":9},5,45]
[null,{"$f":"IF($D$21=Data_podpora!$B$30,\"→\",\"\")","v":""},{"$f":"IF(D18=Data_podpora!B30,\"Šířka [m]\",\"\")","v":""},null,null,null,null,null,null,null,null,null,null,null,null,null,null,null,null,null,null,"eLko 2 m",null,null,11.5,0]
[null,null,null,null,null,null,null,"-0,5",{"$f":"I26-1","v":-0.19999999999999996},{"$f":"J26-1","v":-0.19999999999999996},-0.19999999999999996,-0.19999999999999996,-0.19999999999999996,null,null,null,null,null,null,null,null,"Háčko",null,{"$f":"2*(MAX(I46:AB46)-MIN(J46,L46,N46,P46,R46,T46,V46,X46,Z46,AB46))","v":0},9.6999999999999993,0]
[null,null,null,null,null,null,null,"-3",{"$f":"I24-2","v":-5.2},-5.9,-5.9,-5.9,-5.9,null,null,null,null,null,null,null,null,"boční zábradlí",null,{"$f":"IF(X22=0,(MAX(J46-I46,L46-K46,N46-M46,P46-O46,R46-Q46,T46-S46,V46-U46,X46-W46,Z46-Y46,AB46-AA46)+1)*2,(MAX(J46-I46,L46-K46,N46-M46,P46-O46,R46-Q46,T46-S46,V46-U46,X46-W46,Z46-Y46,AB46-AA46)+1)*2-X22)","v":12},3,36]
[null,{"$f":"IF($D$21=Data_podpora!B30,\"→\",\"\")","v":""},null,null,{"$f":"IF(D23=Data_podpora!B30,\"[m]\",\"\")","v":""},null,null,"-2",-3.2,-3.9,-3.9,-3.9,-3.9,null,null,null,null,null,null,null,null,"okopové prkno 3m",null,{"$f":"IF(I44=3,J46-I46,0)+IF(K44=3,L46-K46,0)+IF(M44=3,N46-M46,0)+IF(O44=3,P46-O46,0)+IF(Q44=3,R46-Q46,0)+IF(S44=3,T46-S46,0)+IF(U44=3,V46-U46,0)+IF(W44=3,X46-W46,0)+IF(Y44=3,Z46-Y46,0)+IF(AA44=3,AB46-AA46,0)","v":40},6.5,260]
[null,null,null,null,null,null,null,"-1",{"$f":"I26-2","v":-1.2},{"$f":"$D$85-2","v":-1.9},{"$f":"$D$85-2","v":-1.9},{"$f":"$D$85-2","v":-1.9},{"$f":"$D$85-2","v":-1.9},null,null,null,null,null,null,null,null,"okopové prkno 2m",null,{"$f":"IF(I44=2,J46-I46,0)+IF(K44=2,L46-K46,0)+IF(M44=2,N46-M46,0)+IF(O44=2,P46-O46,0)+IF(Q44=2,R46-Q46,0)+IF(S44=2,T46-S46,0)+IF(U44=2,V46-U46,0)+IF(W44=2,X46-W46,0)+IF(Y44=2,Z46-Y46,0)+IF(AA44=2,AB46-AA46,0)","v":0},4.5,0]
[null,null,null,null,null,null,null,"0",{"$f":"$K$41","v":0.8},{"$f":"$K$41","v":0.8},{"$f":"$K$41","v":0.8},{"$f":"$K$41","v":0.8},{"$f":"$K$41","v":0.8},null,null,null,null,null,null,null,null,"konzola",null,null,10,0]
[null,null,null,null,null,null,null,"1",{"$f":"I26+$D$86","v":2.8},{"$f":"J26+$D$86","v":2.8},{"$f":"K26+$D$86","v":2.8},{"$f":"L26+$D$86","v":2.8},{"$f":"M26+$D$86","v":2.8},null,null,null,null,null,null,null,null,"pevna spojka",null,{"$f":"J46*2","v":10},1.1499999999999999,11.5]
[null,null,null,null,null,null,null,"2",4.8,4.8,4.8,4.8,4.8,null,null,null,null,null,null,null,null,"otočná spojka",null,{"$f":"J46","v":5},1.35,6.75]
[null,null,null,null,null,null,null,"3",6.8,6.8,6.8,6.8,6.8,null,null,null,null,null,null,null,null,"závlačná spojka",null,{"$f":"J46*2","v":10},0.8,8]
[null,null,null,null,null,null,null,"4",8.8000000000000007,8.8000000000000007,8.8000000000000007,8.8000000000000007,8.8000000000000007,null,null,null,null,null,null,null,null,"CELKOVÁ HMOTNOST [kg]",null,null,null,{"$f":"SUM(Z6:Z29)","v":3511.35}]
[null,null,null,null,null,null,null,"5",10.8,10.8,10.8,10.8,10.8]
[null,null,null,null,null,null,null,"6",12.8,12.8,12.8,12.8,12.8]
[null,null,null,null,null,null,null,"7",14.8,14.8,14.8,14.8,14.8]
[null,null,null,null,null,null,null,"8",16.8,16.8,16.8,16.8,16.8]
[null,null,null,null,null,null,null,"9",18.8,18.8,18.8,18.8,18.8]
[null,null,null,null,null,null,null,"10",20.8,20.8,20.8,20.8,20.8]
[null,null,null,null,null,null,null,"11",22.8,22.8,22.8,22.8,22.8]
[null,null,null,null,null,null,null,"12",24.8,24.8,24.8,24.8,24.8]
[null,null,null,null,null,null,null,"13",26.8,26.8,26.8,26.8,26.8]
[]
[null,null,null,null,null,null,null,"LEŠENÍ","výška založení [m]",null,{"$f":"D8+0.8","v":0.8},"[m]","nepsat nuly v kolonce \"patro\",pokud není sestava lešení využita",null,null,null,null,null,"Poznámka:",{"$f":"IF(Půdorys!I7=0,\"\",Půdorys!I7)","v":""}]
[null,null,null,null,null,null,null,null,"ZALOŽENÍ","VÝŠKA P.P.","ZALOŽENÍ","VÝŠKA P.P.","ZALOŽENÍ","VÝŠKA P.P.","ZALOŽENÍ","VÝŠKA P.P.","ZALOŽENÍ","VÝŠKA P.P.","ZALOŽENÍ","VÝŠKA P.P.","ZALOŽENÍ","VÝŠKA P.P.","ZALOŽENÍ","VÝŠKA P.P.","ZALOŽENÍ","VÝŠKA P.P.","ZALOŽENÍ","VÝŠKA P.P."]
[null,null,null,null,null,null,null,"SESTAVA",1,null,2,null,3,null,4,null,5,null,6,null,7,null,8,null,9,null,10]
[null,null,null,null,null,null,null,"DÉLKA SESTAVY",3,null,3,null,3,null,3,null,3,null,3,null,3,null,3,null,0,null,0]
[null,null,null,null,null,null,null,"\"potvrdit\""]
[null,null,null,null,null,null,null,"PATRO",0,5,0,5,0,5,0,5,0,5,0,5,0,5,0,5]
[null,null,null,null,null,null,null,"POSUN"]
[null,null,null,null,null,null,null,"plocha [m2]",{"$f":"(J46-I46)*$D$86*I44","v":30},null,{"$f":"L46*$D$86*K44","v":30},null,{"$f":"N46*$D$86*M44","v":30},null,{"$f":"P46*$D$86*O44","v":30},null,{"$f":"R46*$D$86*Q44","v":30},null,{"$f":"T46*$D$86*S44","v":30},null,{"$f":"V46*$D$86*U44","v":30},null,{"$f":"X46*$D$86*W44","v":30},null,{"$f":"Z46*$D$86*Y44","v":0},null,{"$f":"AB46*$D$86*AA44","v":0}]
[null,null,null,null,null,null,null,"výška",{"$f":"IF(I46=-0.5,M22,INDEX($M$23:$M$39,I46+4))","v":0.8},{"$f":"INDEX($M$23:$M$39,J46+4)","v":10.8},{"$f":"IF(K46=-0.5,M22,INDEX($M$23:$M$39,K46+4))","v":0.8},{"$f":"INDEX($M$23:$M$39,L46+4)","v":10.8},{"$f":"IF(M46=-0.5,M22,INDEX($M$23:$M$39,M46+4))","v":0.8},{"$f":"INDEX($M$23:$M$39,N46+4)","v":10.8},{"$f":"IF(O46=-0.5,M22,INDEX($M$23:$M$39,O46+4))","v":0.8},{"$f":"INDEX($M$23:$M$39,P46+4)","v":10.8},{"$f":"IF(Q46=-0.5,M22,INDEX($M$23:$M$39,Q46+4))","v":0.8},{"$f":"INDEX($M$23:$M$39,R46+4)","v":10.8},{"$f":"IF(S46=-0.5,M22,INDEX($M$23:$M$39,S46+4))","v":0.8},{"$f":"INDEX($M$23:$M$39,T46+4)","v":10.8},{"$f":"IF(U46=-0.5,M22,INDEX($M$23:$M$39,U46+4))","v":0.8},{"$f":"INDEX($M$23:$M$39,V46+4)","v":10.8},{"$f":"IF(W46=-0.5,M22,INDEX($M$23:$M$39,W46+4))","v":0.8},{"$f":"INDEX($M$23:$M$39,X46+4)","v":10.8},{"$f":"IF(Y46=-0.5,M22,INDEX($M$23:$M$39,Y46+4))","v":0.8},{"$f":"INDEX($M$23:$M$39,Z46+4)","v":0.8},{"$f":"IF(AA46=-0.5,M22,INDEX($M$23:$M$39,AA46+4))","v":0.8},{"$f":"INDEX($M$23:$M$39,AB46+4)","v":0.8}]
[]
[]
[]
[]
[]
[null,null,null,null,null,null,null,-1]
[null,null,null,null,null,null,null,0,{"$f":"$I$49","v":0.8},{"$f":"$J$49","v":10.8}]
[null,null,null,null,null,null,null,1,{"$f":"$I$49","v":0.8},{"$f":"$J$49","v":10.8}]
[null,null,null,null,null,null,null,2,{"$f":"$I$49","v":0.8},{"$f":"$J$49","v":10.8}]
[null,null,null,null,null,null,null,3,{"$f":"$I$49","v":0.8},{"$f":"$J$49","v":10.8},{"$f":"$K$49","v":0.8},{"$f":"$L$49","v":10.8}]
[null,null,null,null,null,null,null,4,null,null,{"$f":"$K$49","v":0.8},{"$f":"$L$49","v":10.8}]
[null,null,null,null,null,null,null,5,null,null,{"$f":"$K$49","v":0.8},{"$f":"$L$49","v":10.8}]
[null,null,null,null,null,null,null,6,null,null,{"$f":"$K$49","v":0.8},{"$f":"$L$49","v":10.8},{"$f":"$M$49","v":0.8},{"$f":"$N$49","v":10.8}]
[null,null,null,null,null,null,null,7,null,null,null,null,{"$f":"$M$49","v":0.8},{"$f":"$N$49","v":10.8}]
[null,null,null,null,null,null,null,8,null,null,null,null,{"$f":"$M$49","v":0.8},{"$f":"$N$49","v":10.8}]
[null,null,null,null,null,null,null,9,null,null,null,null,{"$f":"$M$49","v":0.8},{"$f":"$N$49","v":10.8},{"$f":"$O$49","v":0.8},{"$f":"$P$49","v":10.8}]
[null,null,null,null,null,null,null,10,null,null,null,null,null,null,{"$f":"$O$49","v":0.8},{"$f":"$P$49","v":10.8}]
[null,null,null,null,null,null,null,11,null,null,null,null,null,null,{"$f":"$O$49","v":0.8},{"$f":"$P$49","v":10.8}]
[null,null,null,null,null,null,null,12,null,null,null,null,null,null,{"$f":"$O$49","v":0.8},{"$f":"$P$49","v":10.8},{"$f":"$Q$49","v":0.8},{"$f":"$R$49","v":10.8}]
[null,null,"Pomocný výpočet počtu sestav lešení:",null,null,null,null,13,null,null,null,null,null,null,null,null,{"$f":"$Q$49","v":0.8},{"$f":"$R$49","v":10.8}]
[null,null,"Délka:",null,null,null,null,14,null,null,null,null,null,null,null,null,{"$f":"$Q$49","v":0.8},{"$f":"$R$49","v":10.8}]
[null,null,"přesah za roh objektu:","Ne",null,null,null,15,null,null,null,null,null,null,null,null,{"$f":"$Q$49","v":0.8},{"$f":"$R$49","v":10.8},{"$f":"$S$49","v":0.8},{"$f":"$T$49","v":10.8}]
[null,null,"Požadovaná minimální délka lešení [m]",{"$f":"IF(D71=Data_podpora!B17,'stěna C'!D12+2,IF('stěna C'!D71=Data_podpora!B14,'stěna C'!D12+0.5,IF(D71=Data_podpora!B13,'stěna C'!D12,'stěna C'!D12+1)))","v":21.5},"[m]",null,null,16,null,null,null,null,null,null,null,null,null,null,{"$f":"$S$49","v":0.8},{"$f":"$T$49","v":10.8}]
[null,null,"Počet sestav lešení (3m) [-]",{"$f":"ROUNDDOWN(D72/E73,0)","v":7},"3",{"$f":"D73*E73","v":21},"[m]",17,null,null,null,null,null,null,null,null,null,null,{"$f":"$S$49","v":0.8},{"$f":"$T$49","v":10.8}]
[null,null,"Počet sestav lešení (2m) [-]",{"$f":"ROUNDDOWN(MOD(D72,E73)/E74,0)","v":0},"2",{"$f":"D74*E74","v":0},"[m]",18,null,null,null,null,null,null,null,null,null,null,{"$f":"$S$49","v":0.8},{"$f":"$T$49","v":10.8},{"$f":"$U$49","v":0.8},{"$f":"$V$49","v":10.8}]
[null,null,"Počet sestav lešení (0,75m) [-]",{"$f":"ROUNDUP(D72-(D73*E73+D74*E74),0)","v":1},"0,75",{"$f":"D75*E75","v":0.75},"[m]",19,null,null,null,null,null,null,null,null,null,null,null,null,{"$f":"$U$49","v":0.8},{"$f":"$V$49","v":10.8}]
[null,null,"Reálná délka lešení [m]",{"$f":"D73*E73+D74*E74+D75*E75","v":21.75},"[m]",null,null,20,null,null,null,null,null,null,null,null,null,null,null,null,{"$f":"$U$49","v":0.8},{"$f":"$V$49","v":10.8}]
[null,null,null,null,null,null,null,21,null,null,null,null,null,null,null,null,null,null,null,null,{"$f":"$U$49","v":0.8},{"$f":"$V$49","v":10.8},{"$f":"$W$49","v":0.8},{"$f":"$X$49","v":10.8}]
[null,null,"Výška:",null,null,null,null,22,null,null,null,null,null,null,null,null,null,null,null,null,null,null,{"$f":"$W$49","v":0.8},{"$f":"X77","v":10.8}]
[null,null,"Lešení pro:","Fasádu",null,null,null,23,null,null,null,null,null,null,null,null,null,null,null,null,null,null,{"$f":"$W$49","v":0.8},{"$f":"X78","v":10.8}]
[null,null,"Výška zábradlí posledního patra [m]",1,"[m]",null,null,24,null,null,null,null,null,null,null,null,null,null,null,null,null,null,{"$f":"$W$49","v":0.8},{"$f":"X79","v":10.8},{"$f":"$Y$49","v":0.8},{"$f":"$Z$49","v":0.8}]
[null,null,"Požadovaná výška [m]",{"$f":"IF(D79=Data_podpora!B22,'stěna C'!D14+D80,'stěna C'!D14)","v":11.759999999999991},"[m]",null,null,25,null,null,null,null,null,null,null,null,null,null,null,null,null,null,null,null,{"$f":"$Y$49","v":0.8},{"$f":"Z80","v":0.8}]
["Založení",null,"Výška nejnižžšího bodu terénu [m]",{"$f":"MIN(D4,D5,D6,D8)","v":0},"[m]",null,null,26,null,null,null,null,null,null,null,null,null,null,null,null,null,null,null,null,{"$f":"$Y$49","v":0.8},{"$f":"Z81","v":0.8}]
[null,null,"Výška nejvyššího  bodu terénu [m]",{"$f":"D8","v":0},"[m]",null,null,27,null,null,null,null,null,null,null,null,null,null,null,null,null,null,null,null,{"$f":"$Y$49","v":0.8},{"$f":"Z82","v":0.8},{"$f":"$AA$49","v":0.8},{"$f":"$AB$49","v":0.8}]
[null,null,"Rozdíl max a min [m]",{"$f":"D83-D82","v":0},"[m]",{"$f":"IF(D84<0.4,\"(Patky 0,4m)\",IF(D84<=1,\"(Patky 1m)\",IF(2>=D84>1,\"(Rám 1m)\",IF(5>D84>2,\"(Rám 2m)\",\"\"))))","v":"(Patky 0,4m)"},null,28,null,null,null,null,null,null,null,null,null,null,null,null,null,null,null,null,null,null,{"$f":"$AA$49","v":0.8},{"$f":"AB83","v":0.8}]
[null,"#","Výška založení [m]",{"$f":"D8+0.1","v":0.1},"[m]",null,null,29,null,null,null,null,null,null,null,null,null,null,null,null,null,null,null,null,null,null,{"$f":"$AA$49","v":0.8},{"$f":"AB84","v":0.8}]
[null,null,"Modulová výška patra lešení [m]",2,"[m]",null,null,30,null,null,null,null,null,null,null,null,null,null,null,null,null,null,null,null,null,null,{"$f":"$AA$49","v":0.8},{"$f":"AB85","v":0.8}]
[null,null,"Počet pater lešení [-]; výška [m])",{"$f":"IF(D81-D85<11,ROUNDDOWN((D81-D85)/2.15,0),ROUNDDOWN((D81-D85)/2.1,0))","v":5},"pater",{"$f":"INDEX(M27:M39,D87)","v":10.8},"[m]",31]
[null,null,"Reálná výška lešení [m]",{"$f":"D87*D86+D85+D80","v":11.1},"[m]"]
[]
["Uskočení pater","→","Hranice posouzení uskočení","4",null,{"$f":"INDEX(M27:M39,D90)","v":8.8000000000000007},"[m]"]
[null,null,"Zbývající výška do hřebene",{"$f":"$D$14-F90","v":2.9599999999999902},"[m]"]
[null,null,"Počet uskočených pater",{"$f":"IF(D91<11,ROUNDDOWN((D91)/2.6,0),ROUNDDOWN((D91)/2.6,0))","v":1},{"$f":"IF(D92=1,\"patro\",IF(D92<=4,\"patra\",\"pater\"))","v":"patro"}]
[null,null,"Rozdíl výšky okapu a nejbližšího patra",{"$f":"$J$4-(INDEX(M27:M39,D90))","v":2.9599999999999902},"[m]"]
[null,null,"Rozdíl výšek na 3 m sestavu",{"$f":"$N$5*$E$73","v":0},"[m]"]
[null,{"$f":"IF($D$92>=1,1,\"\")","v":1},"První sestava",{"$f":"D93+D94","v":2.9599999999999902},"[m]",{"$f":"IF(D$95<=2,\"posoudit další\",IF(D$95<=3.2,\"ponechat\",\"pokračuje patrem\"))","v":"ponechat"}]
[null,{"$f":"IF(1<=$D$92,2,\"X\")","v":2},"Druhá sestava",{"$f":"IF(F95=\"ponechat\",$D$93+$D$94*B96,$D$93+$D$94*B96-2)","v":2.9599999999999902},"[m]",{"$f":"IF(D96<2,\"posoudit další\",IF(D96<=3.2,\"ponechat\",IF(D96>3.2,\"pokračuje patrem\",\"\")))","v":"ponechat"}]
[null,{"$f":"IF(2<=$D$92,3,\"X\")","v":"X"},"Třetí sestava",{"$f":"IF(F96=\"ponechat\",$D$93+$D$94*B97,$D$93+$D$94*B97-2)","v":{"$error":"#VALUE!"}},"[m]",{"$f":"IF(D97<2,\"posoudit další\",IF(D97<=3.2,\"ponechat\",IF(D97>3.2,\"pokračuje patrem\",\"\")))","v":{"$error":"#VALUE!"}}]
[null,{"$f":"IF(3<=$D$92,4,\"X\")","v":"X"},"Čtvrtá sestava",{"$f":"IF(F97=\"ponechat\",$D$93+$D$94*B98,$D$93+$D$94*B98-2)","v":{"$error":"#VALUE!"}},"[m]",{"$f":"IF(D98<2,\"posoudit další\",IF(D98<=3.2,\"ponechat\",IF(D98>3.2,\"pokračuje patrem\",\"\")))","v":{"$error":"#VALUE!"}}]
[]
[]
[]
[]
[null,null,"NAKLÁDACÍ LIST"]
[]
[null,null,"stavitelná patka 0,5m","počet kusů"]
[null,null,"stavitelná patka 1m",{"$f":"IF(D107>=0,($D$73+$D$74+$D$75)*2+2-D107,($D$73+$D$74+$D$75)*2+2)","v":16}]
[null,null,"rám 2m",2]
[null,null,"rám 1m",{"$f":"(($D$73+$D$74+$D$75)+1)*$D$87","v":45}]
[null,null,"podlaha 3m",{"$f":"IF(D85>=1,($D$73+$D$74+$D$75)+1,0)","v":0}]
[null,null,"podlaha 2m",{"$f":"(D73*D87-$D112)*2","v":60}]
[null,null,"průlezová podlaha 3m",{"$f":"D74*D87","v":0}]
[null,null,"zábradlí 3m",{"$f":"D87","v":5}]
[null,null,"zábradlí 2m",{"$f":"(1+$D$87*2)*D73","v":77}]
[null,null,"diagonální úchyt",{"$f":"(1+$D$87*2)*D74","v":0}]
[null,null,"diagonála 3m"]
[null,null,"diagonála 2m",{"$f":"$D$87*(ROUNDUP((D73+D74+D75)/4,0))","v":10}]
[null,null,"kotva 0,5 m",{"$f":"IF(D116=0,$D$87*ROUNDUP(D74/4,0),0)","v":0}]
[null,null,"kotva dlouhá 1 m",{"$f":"(($D$87-1)*SUM(D73:D75))/2","v":16}]
[null,null,"eLko / sloupek"]
[null,null,"eLko 2 m",{"$f":"SUM(D73:D75)+1","v":9}]
[null,null,"Háčko"]
[null,null,"boční zábradlí"]
[null,null,"okopové prkno 3m",{"$f":"D87*2","v":10}]
[null,null,"okopové prkno 2m",{"$f":"D73*D87","v":35}]
[null,null,"konzola",{"$f":"D74*D87","v":0}]
[null,null,"pevna spojka"]
[null,null,"otočná spojka"]
[null,null,"závlačná spojka"]

{"sheet":"stěna D","index":5,"n_rows":128,"n_cols":36,"rows_kept":128,"cut":false,"hidden":false,"merged":[[0,4,1,6],[3,21,4,22],[3,23,4,23],[3,24,4,24],[3,25,4,25],[42,20,42,21],[42,22,42,23],[42,24,42,25],[42,26,42,27],[43,8,43,9],[43,10,43,11],[43,12,43,13],[43,14,43,15],[43,16,43,17],[43,18,43,19],[42,8,42,9],[42,10,42,11],[42,12,42,13],[42,14,42,15],[42,16,42,17],[42,18,42,19],[43,20,43,21],[43,22,43,23],[43,24,43,25],[43,26,43,27],[47,8,47,9],[47,10,47,11],[47,12,47,13],[47,14,47,15],[47,16,47,17],[47,18,47,19],[89,0,93,0],[47,20,47,21],[47,22,47,23],[47,24,47,25],[47,26,47,27],[70,3,70,4],[81,0,84,0]]}
[null,null,"Stěna D","Výkres:",null,null,null,"Data grafu:"]
[null,null,"Nastavení parametrů výpočtu:",null,null,null,null,null,"Tvar střechy",null,"Tvar terénu",null,"úhel alfa",null,null,null,null,null,null,null,null,"NAKLÁDACÍ LIST:",null,{"$f":"$C$1","v":"Stěna D"},{"$f":"IF(AF6=0,\"(BUDE NAKLÁDÁNO POUZE AUTO)\",\"\")","v":""},null,null,null,null,"VYTÍŽENOST ODVOZNÍHO PROSTŘEDKU:"]
[null,null,"Terén: absolutní výška (±0,00 = svislice od hřebene střechy na terén)",null,null,null,null,null,"osa x","osa y","osa x","osa y","tg A",{"$f":"($D$14-$J$4)/($D$12/2)","v":0.39512195121951227},null,null,null,null,null,null,null,"obestavběná plocha lešení [m2]",null,null,{"$f":"IF(K41>=1,SUM(I48,K48,M48,O48,Q48,S48,U48,W48,Y48,AA48)+SUM(I44,K44,M44,O44,Q44,S44,U44,W44,Y44,AA44)*2+SUM(I44,K44,M44,O44,Q44,S44,U44,W44,Y44,AA44),SUM(I48,K48,M48,O48,Q48,S48,U48,W48,Y48,AA48)+SUM(I44,K44,M44,O44,Q44,S44,U44,W44,Y44,AA44)*2)","v":240},"[m2]",null,null,null,"[kg]","1. cesta",null,null,"2.cesta"]
[null,"→","Výška terénu v levém rohu [m]",0,"[m]",null,null,"vlevo",0,{"$f":"IF($D$13=Data_podpora!$B$9,$D$14,$D$15+$D$4)","v":11.76},0,{"$f":"$D$4","v":0},"A",{"$f":"DEGREES(ATAN(N3))","v":21.560063906565112},null,null,null,null,null,null,null,"Komponenta",null,"počet kusů [ks]","jednotková hmotnost [kg/ks]","hmotnost [kg]",null,null,null,null,"KAPACITA","VYUŽITO","Zbývá","KAPACITA","VYUŽITO","ZBÝVÁ"]
[null,"→","Výška terénu v pravém rohu [m]",2.5,"[m]",null,null,"top",{"$f":"$D$12/2","v":8.1999999999999993},{"$f":"$D$14","v":15},{"$f":"$D$12/2","v":8.1999999999999993},{"$f":"0","v":0},"tg A",{"$f":"TAN(RADIANS($N$4))","v":0.39512195121951232},null,null,null,null,null,null,null,null,null,null,null,null,null,null,null,"AUTO",2500,{"$f":"IF(Z30<=AE5,SUM(Z6:Z29),SUM(Z6:Z9,Z26:Z29,Z15:Z23,Z13/2,Z14/2))","v":1133.25},{"$f":"IF((AE5-AF5)<=0,0,AE5-AF5)","v":1366.75},2500,{"$f":"IF(AE5-AF5<=0,-(AE5-AF5),0)","v":0},{"$f":"AH5-AI5","v":2500}]
[null,"→","Výška nejnižšího bodu terénu [m]",0,"[m]",null,null,"min",{"$f":"$D$7","v":11},{"$f":"IF($D$12/2>I6,$N$3*I6+$J$4,-$N$3*I6+$J$4+$N$3*$D$12)","v":13.893658536585365},{"$f":"$D$7","v":11},{"$f":"$D$6","v":0},"sklon",{"$f":"$N$5","v":0.39512195121951232},null,null,null,null,null,null,null,"stavitelná patka 0,5m",null,{"$f":"IF(X7>0,(COUNT(I46:AB46)+2)-X7,(COUNT(I46:AB46)+2))","v":14},3.1,{"$f":"Y7*X6","v":65.8},null,null,null,"ZÁVĚS",3500,{"$f":"IF(Z30<=AE5,0,SUM(Z10:Z12,Z24:Z25,Z13/2,Z14/2))","v":1824.5},{"$f":"IF((AE6-AF6)<=0,0,AE6-AF6)","v":1675.5},3500,{"$f":"IF(AE6-AF6<=0,-(AE6-AF6),0)","v":0},{"$f":"AH6-AI6","v":3500}]
[null,"→","Místo nejnižšího bodu (zleva) [m]",11,"[m]",null,null,"max",{"$f":"$D$9","v":16.399999999999999},{"$f":"IF($D$12/2<I7,-$N$3*I7+$J$4+$N$3*$D$12,$N$3*I7+$J$4)","v":11.76},{"$f":"$D$9","v":16.399999999999999},{"$f":"$D$8","v":2.5},null,null,null,null,null,null,null,null,null,"stavitelná patka 1m",null,0,4.7,{"$f":"Y9*X7","v":0}]
[null,"→","Výška nejvyššího bodu terénu [m]",2.5,"[m]",null,null,"vpravo",{"$f":"$D$12","v":16.399999999999999},{"$f":"$J$4","v":11.76},{"$f":"$D$12","v":16.399999999999999},{"$f":"$D$5","v":2.5},null,null,null,null,null,null,null,null,null,"rám 2m",null,{"$f":"IF(X9>0,SUM(J46-I46,L46-K46,N46-M46,P46-O46,R46-Q46,T46-S46,V46-U46,X46-W46,Z46-Y46,AB46-AA46)+MIN(J46-I46,L46-K46,N46-M46,P46-O46,R46-Q46,T46-S46,V46-U46,X46-W46,Z46-Y46,AB46-AA46)+MAX(J46-I46,L46-K46,N46-M46,P46-O46,R46-Q46,T46-S46,V46-U46,X46-W46,Z46-Y46,AB46-AA46)-MIN(J46-I46,L46-K46,N46-M46,P46-O46,R46-Q46,T46-S46,V46-U46,X46-W46,Z46-Y46,AB46-AA46)-X9,SUM(J46-I46,L46-K46,N46-M46,P46-O46,R46-Q46,T46-S46,V46-U46,X46-W46,Z46-Y46,AB46-AA46)+MIN(J46-I46,L46-K46,N46-M46,P46-O46,R46-Q46,T46-S46,V46-U46,X46-W46,Z46-Y46,AB46-AA46)+MAX(J46-I46,L46-K46,N46-M46,P46-O46,R46-Q46,T46-S46,V46-U46,X46-W46,Z46-Y46,AB46-AA46)-MIN(J46-I46,L46-K46,N46-M46,P46-O46,R46-Q46,T46-S46,V46-U46,X46-W46,Z46-Y46,AB46-AA46))","v":39},16.5,{"$f":"Y8*X8","v":643.5}]
[null,"→","Místo nejvyššího bodu (zleva) [m]",{"$f":"D12","v":16.399999999999999},"[m]",null,null,null,null,null,null,null,null,null,null,null,null,null,null,null,null,"rám 1m",null,1,11.3,11.3]
[null,null,null,null,null,null,null,null,"Tvar střechy",null,"Tvar terénu",null,"úhel alfa",null,null,null,null,null,null,null,null,"podlaha 3m",null,{"$f":"((IF(I44=3,J46-I46,0)+IF(K44=3,L46-K46,0)+IF(M44=3,N46-M46,0)+IF(O44=3,P46-O46,0)+IF(Q44=3,R46-Q46,0)+IF(S44=3,T46-S46,0)+IF(U44=3,V46-U46,0)+IF(W44=3,X46-W46,0)+IF(Y44=3,Z46-Y46,0)+IF(AA44=3,AB46-AA46,0))-X12)*2","v":56},22,1232]
[null,null,"Střecha:",null,null,null,null,null,"osa x","osa y","osa x","osa y","tg A",{"$f":"($D$14-$J$4)/($D$17)","v":{"$error":"#DIV/0!"}},null,null,null,null,null,null,null,"podlaha 2m",null,{"$f":"(IF(I44=2,J46-I46,0)+IF(K44=2,L46-K46,0)+IF(M44=2,N46-M46,0)+IF(O44=2,P46-O46,0)+IF(Q44=2,R46-Q46,0)+IF(S44=2,T46-S46,0)+IF(U44=2,V46-U46,0)+IF(W44=2,X46-W46,0)+IF(Y44=2,Z46-Y46,0)+IF(AA44=2,AB46-AA46,0))*2","v":0},14.5,0]
[null,null,"Délka strany [m]",{"$f":"Půdorys!C8","v":16.399999999999999},"[m]",null,null,"vlevo",0,{"$f":"$D$15+$D$4","v":11.76},0,{"$f":"$D$4","v":0},"A",{"$f":"DEGREES(ATAN(N11))","v":{"$error":"#DIV/0!"}},null,null,null,null,null,null,null,"průlezová podlaha 3m",null,{"$f":"MAX(J46:AB46)","v":6},28,168]
[null,"→","Tvar střechy:","sedlová",null,null,null,"polov1",{"$f":"$D$17","v":0},{"$f":"$D$14","v":15},{"$f":"$D$17","v":0},{"$f":"$D$18","v":0},"tg A",{"$f":"TAN(RADIANS($N$12))","v":{"$error":"#DIV/0!"}},null,null,null,null,null,null,null,"zábradlí 3m",null,{"$f":"IF(I44=3,2*(J46-I46)+1,0)+IF(K44=3,2*(L46-K46)+1,0)+IF(M44=3,2*(N46-M46)+1,0)+IF(O44=3,2*(P46-O46)+1,0)+IF(Q44=3,2*(R46-Q46)+1,0)+IF(S44=3,2*(T46-S46)+1,0)+IF(U44=3,2*(V46-U46)+1,0)+IF(W44=3,2*(X46-W46)+1,0)+IF(Y44=3,2*(Z46-Y46)+1,0)+IF(AA44=3,2*(AB46-AA46)+1,0)","v":74},5.5,407]
[null,"→",{"$f":"IF('stěna D'!$D$13=Data_podpora!$B$9,\"Výška stěny [m]\",\"Výška uprostřed stěny [m]\")","v":"Výška uprostřed stěny [m]"},15,"[m]",null,null,"top",{"$f":"$D$12/2","v":8.1999999999999993},{"$f":"$D$14","v":15},{"$f":"$D$12/2","v":8.1999999999999993},{"$f":"0","v":0},"sklon",{"$f":"$N$13","v":{"$error":"#DIV/0!"}},null,null,null,null,null,null,null,"zábradlí 2m",null,{"$f":"IF(I44=2,2*(J46-I46)+1,0)+IF(K44=2,2*(L46-K46)+1,0)+IF(M44=2,2*(N46-M46)+1,0)+IF(O44=2,2*(P46-O46)+1,0)+IF(Q44=2,2*(R46-Q46)+1,0)+IF(S44=2,2*(T46-S46)+1,0)+IF(U44=2,2*(V46-U46)+1,0)+IF(W44=2,2*(X46-W46)+1,0)+IF(Y44=2,2*(Z46-Y46)+1,0)+IF(AA44=2,2*(AB46-AA46)+1,0)","v":0},3.5,0]
[null,{"$f":"IF($D$13=Data_podpora!B9,\"\",\"→\")","v":"→"},{"$f":"IF($D$13=Data_podpora!$B$9,\"\",\"Výška od terénu k okapu (levý) [m]\")","v":"Výška od terénu k okapu (levý) [m]"},11.76,{"$f":"IF($D$13=Data_podpora!$B$9,\"\",\"[m]\")","v":"[m]"},null,null,"min",{"$f":"$D$7","v":11},{"$f":"IF($I$13>=I15,$N$11*I15+$J$4,IF(I15<=$I$16,J13,-$N$11*I15+$J$12+$N$11*$D$12))","v":15},{"$f":"$D$7","v":11},{"$f":"$D$6","v":0},null,null,null,null,null,null,null,null,null,"diagonální úchyt",null,{"$f":"X16/MAX(I46:AB46)","v":1},0.5,0.5]
[null,null,{"$f":" IF(D13=Data_podpora!B10,\"Upřesňující parametry pro polovalbovou střechu:\",\"\")","v":""},null,null,null,null,"polov2",{"$f":"$D$12-$D$17","v":16.399999999999999},{"$f":"$D$14","v":15},{"$f":"$D$12-$D$17","v":16.399999999999999},{"$f":"$D$19","v":0},null,null,null,null,null,null,null,null,null,"diagonála 3m",null,{"$f":"MAX(J46-I46,L46-K46,N46-M46,P46-O46,R46-Q46,T46-S46,V46-U46,X46-W46,Z46-Y46,AB46-AA46)*ROUNDUP((IF(I44=3,I44,0)+IF(K44=3,K44,0)+IF(M44=3,M44,0)+IF(O44=3,O44,0)+IF(Q44=3,Q44,0)+IF(S44=3,S44,0)+IF(U44=3,U44,0)+IF(W44=3,W44,0)+IF(Y44=3,Y44,0)+IF(AA44=3,AA44,0))/20,0)","v":6},11,66]
[null,{"$f":"IF($D$13=Data_podpora!$B$10,'stěna D'!$B$15,\"\")","v":""},{"$f":"IF($D$13=Data_podpora!$B$10,\"Místo polovalby [m]\",\"\")","v":""},null,{"$f":"IF($D$13=Data_podpora!$B$10,\"[m]\",\"\")","v":""},null,null,"max",{"$f":"$D$9","v":16.399999999999999},{"$f":"IF($I$17<I17,-$N$3*I17+$J$4+$N$11*$D$12,IF(I17<$I$14,$N$11*I17+$J$4,J18))","v":11.76},{"$f":"$D$9","v":16.399999999999999},{"$f":"$D$8","v":2.5},null,null,null,null,null,null,null,null,null,"diagonála 2m",null,{"$f":"IF(X16=0,MAX(J46-I46,L46-K46,N46-M46,P46-O46,R46-Q46,T46-S46,V46-U46,X46-W46,Z46-Y46,AB46-AA46)*ROUNDUP((IF(I44=2,I44,0)+IF(K44=2,K44,0)+IF(M44=2,M44,0)+IF(O44=2,O44,0)+IF(Q44=2,Q44,0)+IF(S44=2,S44,0)+IF(U44=2,U44,0)+IF(W44=2,W44,0)+IF(Y44=2,Y44,0)+IF(AA44=2,AA44,0))/12,0),0)","v":0},8,0]
[null,{"$f":"IF($D$13=Data_podpora!$B$10,'stěna D'!$B$15,\"\")","v":""},{"$f":"IF($D$13=Data_podpora!$B$10,\"Výška terénu v místě levé polovalby [m]\",\"\")","v":""},null,{"$f":"IF($D$13=Data_podpora!$B$10,\"[m]\",\"\")","v":""},null,null,"vpravo",{"$f":"$D$12","v":16.399999999999999},{"$f":"$J$4","v":11.76},{"$f":"$D$12","v":16.399999999999999},{"$f":"$D$5","v":2.5},null,null,null,null,null,null,null,null,null,"kotva 0,5 m",null,{"$f":"IF(X19=0,ROUNDUP(X8*0.45,0),ROUNDUP(X8*0.45,0)-X19)","v":18},2,36]
[null,{"$f":"IF($D$13=Data_podpora!$B$10,'stěna D'!$B$15,\"\")","v":""},{"$f":"IF($D$13=Data_podpora!$B$10,\"Výška terénu v místě pravé polovalby [m]\",\"\")","v":""},null,{"$f":"IF($D$13=Data_podpora!$B$10,\"[m]\",\"\")","v":""},null,null,null,null,null,null,null,null,null,null,null,null,null,null,null,null,"kotva dlouhá 1 m",null,0,3.8,0]
[null,null,null,null,null,null,null,"Patra lešení",null,null,null,null,null,null,null,null,null,null,null,null,null,"eLko / sloupek",null,{"$f":"IF(X22=0,COUNT(J46,L46,N46,P46,R46,T46,V46,X46,Z46,AB46)+1,(COUNT(J46,L46,N46,P46,R46,T46,V46,X46,Z46,AB46)+1)-X22)","v":5},5,25]
[null,null,null,null,null,null,null,null,null,null,null,null,null,null,null,null,null,null,null,null,null,"eLko 2 m",null,null,11.5,0]
[null,{"$f":"IF($D$21=Data_podpora!B30,\"→\",\"\")","v":""},{"$f":"IF(D21=Data_podpora!B30,\"Vzdálenost od levého rohu [m]\",\"\")","v":""},null,{"$f":"IF(D21=Data_podpora!B30,\"[m]\",\"\")","v":""},null,null,"-0,5",{"$f":"I26-1","v":-0.6},{"$f":"J26-1","v":-0.6},{"$f":"K26-1","v":-0.6},{"$f":"L26-1","v":-0.6},{"$f":"M26-1","v":-0.6},null,null,null,null,null,null,null,null,"Háčko",null,{"$f":"2*(MAX(I46:AB46)-MIN(J46,L46,N46,P46,R46,T46,V46,X46,Z46,AB46))","v":2},9.6999999999999993,19.399999999999999]
[null,{"$f":"IF($D$21=Data_podpora!$B$30,\"→\",\"\")","v":""},{"$f":"IF(D21=Data_podpora!B30,\"Výška od terénu (zleva) [m]\",\"\")","v":""},null,{"$f":"IF(D21=Data_podpora!B30,\"[m]\",\"\")","v":""},null,null,"-3",{"$f":"I24-2","v":-5.6},-5.6,-5.6,-5.6,-5.6,null,null,null,null,null,null,null,null,"boční zábradlí",null,{"$f":"IF(X22=0,(MAX(J46-I46,L46-K46,N46-M46,P46-O46,R46-Q46,T46-S46,V46-U46,X46-W46,Z46-Y46,AB46-AA46)+1)*2,(MAX(J46-I46,L46-K46,N46-M46,P46-O46,R46-Q46,T46-S46,V46-U46,X46-W46,Z46-Y46,AB46-AA46)+1)*2-X22)","v":12},3,36]
[null,{"$f":"IF($D$21=Data_podpora!$B$30,\"→\",\"\")","v":""},{"$f":"IF(D21=Data_podpora!B30,\"Šířka [m]\",\"\")","v":""},null,{"$f":"IF(D21=Data_podpora!B30,\"[m]\",\"\")","v":""},null,null,"-2",-3.6,-3.6,-3.6,-3.6,-3.6,null,null,null,null,null,null,null,null,"okopové prkno 3m",null,{"$f":"IF(I44=3,J46-I46,0)+IF(K44=3,L46-K46,0)+IF(M44=3,N46-M46,0)+IF(O44=3,P46-O46,0)+IF(Q44=3,R46-Q46,0)+IF(S44=3,T46-S46,0)+IF(U44=3,V46-U46,0)+IF(W44=3,X46-W46,0)+IF(Y44=3,Z46-Y46,0)+IF(AA44=3,AB46-AA46,0)","v":34},6.5,221]
[null,null,null,null,null,null,null,"-1",{"$f":"I26-2","v":-1.6},{"$f":"$K$41-2","v":-1.6},{"$f":"$K$41-2","v":-1.6},{"$f":"$K$41-2","v":-1.6},{"$f":"$K$41-2","v":-1.6},null,null,null,null,null,null,null,null,"okopové prkno 2m",null,{"$f":"IF(I44=2,J46-I46,0)+IF(K44=2,L46-K46,0)+IF(M44=2,N46-M46,0)+IF(O44=2,P46-O46,0)+IF(Q44=2,R46-Q46,0)+IF(S44=2,T46-S46,0)+IF(U44=2,V46-U46,0)+IF(W44=2,X46-W46,0)+IF(Y44=2,Z46-Y46,0)+IF(AA44=2,AB46-AA46,0)","v":0},4.5,0]
[null,null,null,null,null,null,null,"0",{"$f":"$K$41","v":0.4},{"$f":"$K$41","v":0.4},{"$f":"$K$41","v":0.4},{"$f":"$K$41","v":0.4},{"$f":"$K$41","v":0.4},null,null,null,null,null,null,null,null,"konzola",null,null,10,0]
[null,null,null,null,null,null,null,"1",{"$f":"I26+$D$86","v":2.4},{"$f":"J26+$D$86","v":2.4},{"$f":"K26+$D$86","v":2.4},{"$f":"L26+$D$86","v":2.4},{"$f":"M26+$D$86","v":2.4},null,null,null,null,null,null,null,null,"pevna spojka",null,{"$f":"J46*2","v":10},1.1499999999999999,11.5]
[null,null,null,null,null,null,null,"2",4.4000000000000004,4.4000000000000004,4.4000000000000004,4.4000000000000004,4.4000000000000004,null,null,null,null,null,null,null,null,"otočná spojka",null,{"$f":"J46","v":5},1.35,6.75]
[null,null,null,null,null,null,null,"3",6.4,6.4,6.4,6.4,6.4,null,null,null,null,null,null,null,null,"závlačná spojka",null,{"$f":"J46*2","v":10},0.8,8]
[null,null,null,null,null,null,null,"4",8.4,8.4,8.4,8.4,8.4,null,null,null,null,null,null,null,null,"CELKOVÁ HMOTNOST [kg]",null,null,null,{"$f":"SUM(Z6:Z29)","v":2957.75}]
[null,null,null,null,null,null,null,"5",10.4,10.4,10.4,10.4,10.4]
[null,null,null,null,null,null,null,"6",12.4,12.4,12.4,12.4,12.4]
[null,null,null,null,null,null,null,"7",14.4,14.4,14.4,14.4,14.4]
[null,null,null,null,null,null,null,"8",16.399999999999999,16.399999999999999,16.399999999999999,16.399999999999999,16.399999999999999]
[null,null,null,null,null,null,null,"9",18.399999999999999,18.399999999999999,18.399999999999999,18.399999999999999,18.399999999999999]
[null,null,null,null,null,null,null,"10",20.399999999999999,20.399999999999999,20.399999999999999,20.399999999999999,20.399999999999999]
[null,null,null,null,null,null,null,"11",22.4,22.4,22.4,22.4,22.4]
[null,null,null,null,null,null,null,"12",24.4,24.4,24.4,24.4,24.4]
[null,null,null,null,null,null,null,"13",26.4,26.4,26.4,26.4,26.4]
[]
[null,null,null,null,null,null,null,"LEŠENÍ","výška založení [m]",null,0.4,"[m]","nepsat nuly v kolonce \"patro\",pokud není sestava lešení využita",null,null,null,null,null,"Poznámka:",{"$f":"IF(Půdorys!I8=0,\"\",Půdorys!I8)","v":""}]
[null,null,null,null,null,null,null,null,"ZALOŽENÍ","VÝŠKA P.P.","ZALOŽENÍ","VÝŠKA P.P.","ZALOŽENÍ","VÝŠKA P.P.","ZALOŽENÍ","VÝŠKA P.P.","ZALOŽENÍ","VÝŠKA P.P.","ZALOŽENÍ","VÝŠKA P.P.","ZALOŽENÍ","VÝŠKA P.P.","ZALOŽENÍ","VÝŠKA P.P.","ZALOŽENÍ","VÝŠKA P.P.","ZALOŽENÍ","VÝŠKA P.P."]
[null,null,null,null,null,null,null,"SESTAVA",1,null,2,null,3,null,4,null,5,null,6,null,7,null,8,null,9,null,10]
[null,null,null,null,null,null,null,"DÉLKA SESTAVY",3,null,3,null,3,null,3,null,3,null,3,null,0,null,0,null,0,null,0]
[null,null,null,null,null,null,null,"\"potvrdit\""]
[null,null,null,null,null,null,null,"PATRO",0,5,0,6,0,6,0,6,0,6,0,5]
[null,null,null,null,null,null,null,"POSUN"]
[null,null,null,null,null,null,null,"plocha [m2]",{"$f":"(J46-I46)*$D$86*I44","v":30},null,{"$f":"L46*$D$86*K44","v":36},null,{"$f":"N46*$D$86*M44","v":36},null,{"$f":"P46*$D$86*O44","v":36},null,{"$f":"R46*$D$86*Q44","v":36},null,{"$f":"T46*$D$86*S44","v":30},null,{"$f":"V46*$D$86*U44","v":0},null,{"$f":"X46*$D$86*W44","v":0},null,{"$f":"Z46*$D$86*Y44","v":0},null,{"$f":"AB46*$D$86*AA44","v":0}]
[null,null,null,null,null,null,null,"výška",{"$f":"IF(I46=-0.5,M22,INDEX($M$23:$M$39,I46+4))","v":0.4},{"$f":"INDEX($M$23:$M$39,J46+4)","v":10.4},{"$f":"IF(K46=-0.5,M22,INDEX($M$23:$M$39,K46+4))","v":0.4},{"$f":"INDEX($M$23:$M$39,L46+4)","v":12.4},{"$f":"IF(M46=-0.5,M22,INDEX($M$23:$M$39,M46+4))","v":0.4},{"$f":"INDEX($M$23:$M$39,N46+4)","v":12.4},{"$f":"IF(O46=-0.5,M22,INDEX($M$23:$M$39,O46+4))","v":0.4},{"$f":"INDEX($M$23:$M$39,P46+4)","v":12.4},{"$f":"IF(Q46=-0.5,M22,INDEX($M$23:$M$39,Q46+4))","v":0.4},{"$f":"INDEX($M$23:$M$39,R46+4)","v":12.4},{"$f":"IF(S46=-0.5,M22,INDEX($M$23:$M$39,S46+4))","v":0.4},{"$f":"INDEX($M$23:$M$39,T46+4)","v":10.4},{"$f":"IF(U46=-0.5,M22,INDEX($M$23:$M$39,U46+4))","v":0.4},{"$f":"INDEX($M$23:$M$39,V46+4)","v":0.4},{"$f":"IF(W46=-0.5,M22,INDEX($M$23:$M$39,W46+4))","v":0.4},{"$f":"INDEX($M$23:$M$39,X46+4)","v":0.4},{"$f":"IF(Y46=-0.5,M22,INDEX($M$23:$M$39,Y46+4))","v":0.4},{"$f":"INDEX($M$23:$M$39,Z46+4)","v":0.4},{"$f":"IF(AA46=-0.5,M22,INDEX($M$23:$M$39,AA46+4))","v":0.4},{"$f":"INDEX($M$23:$M$39,AB46+4)","v":0.4}]
[]
[]
[]
[]
[]
[null,null,null,null,null,null,null,-1]
[null,null,null,null,null,null,null,0,{"$f":"$I$49","v":0.4},{"$f":"$J$49","v":10.4}]
[null,null,null,null,null,null,null,1,{"$f":"$I$49","v":0.4},{"$f":"$J$49","v":10.4}]
[null,null,null,null,null,null,null,2,{"$f":"$I$49","v":0.4},{"$f":"$J$49","v":10.4}]
[null,null,null,null,null,null,null,3,{"$f":"$I$49","v":0.4},{"$f":"$J$49","v":10.4},{"$f":"$K$49","v":0.4},{"$f":"$L$49","v":12.4}]
[null,null,null,null,null,null,null,4,null,null,{"$f":"$K$49","v":0.4},{"$f":"$L$49","v":12.4}]
[null,null,null,null,null,null,null,5,null,null,{"$f":"$K$49","v":0.4},{"$f":"$L$49","v":12.4}]
[null,null,null,null,null,null,null,6,null,null,{"$f":"$K$49","v":0.4},{"$f":"$L$49","v":12.4},{"$f":"$M$49","v":0.4},{"$f":"$N$49","v":12.4}]
[null,null,null,null,null,null,null,7,null,null,null,null,{"$f":"$M$49","v":0.4},{"$f":"$N$49","v":12.4}]
[null,null,null,null,null,null,null,8,null,null,null,null,{"$f":"$M$49","v":0.4},{"$f":"$N$49","v":12.4},{"$f":"$O$49","v":0.4},{"$f":"$P$49","v":12.4}]
[null,null,null,null,null,null,null,9,null,null,null,null,{"$f":"$M$49","v":0.4},{"$f":"$N$49","v":12.4},{"$f":"$O$49","v":0.4},{"$f":"$P$49","v":12.4}]
[null,null,null,null,null,null,null,10,null,null,null,null,null,null,{"$f":"$O$49","v":0.4},{"$f":"$P$49","v":12.4}]
[null,null,null,null,null,null,null,11,null,null,null,null,null,null,{"$f":"$O$49","v":0.4},{"$f":"$P$49","v":12.4},{"$f":"$Q$49","v":0.4},{"$f":"$R$49","v":12.4}]
[null,null,null,null,null,null,null,12,null,null,null,null,null,null,null,null,{"$f":"$Q$49","v":0.4},{"$f":"$R$49","v":12.4}]
[null,null,"Pomocný výpočet počtu sestav lešení:",null,null,null,null,13,null,null,null,null,null,null,null,null,{"$f":"$Q$49","v":0.4},{"$f":"$R$49","v":12.4}]
[null,null,"Délka:",null,null,null,null,14,null,null,null,null,null,null,null,null,{"$f":"$Q$49","v":0.4},{"$f":"$R$49","v":12.4},{"$f":"$S$49","v":0.4},{"$f":"$T$49","v":10.4}]
[null,null,"přesah za roh objektu:","Ne",null,null,null,15,null,null,null,null,null,null,null,null,null,null,{"$f":"$S$49","v":0.4},{"$f":"$T$49","v":10.4}]
[null,null,"Požadovaná minimální délka lešení [m]",{"$f":"IF(D71=Data_podpora!B17,'stěna D'!D12+2,IF('stěna D'!D71=Data_podpora!B14,'stěna D'!D12+0.5,IF(D71=Data_podpora!B13,'stěna D'!D12,'stěna D'!D12+1)))","v":16.399999999999999},"[m]",null,null,16,null,null,null,null,null,null,null,null,null,null,{"$f":"$S$49","v":0.4},{"$f":"$T$49","v":10.4}]
[null,null,"Počet sestav lešení (3m) [-]",{"$f":"ROUNDDOWN(D72/E73,0)","v":5},"3",{"$f":"D73*E73","v":15},"[m]",17,null,null,null,null,null,null,null,null,null,null,{"$f":"$S$49","v":0.4},{"$f":"$T$49","v":10.4},{"$f":"$U$49","v":0.4},{"$f":"$V$49","v":0.4}]
[null,null,"Počet sestav lešení (2m) [-]",{"$f":"ROUNDDOWN(MOD(D72,E73)/E74,0)","v":0},"2",{"$f":"D74*E74","v":0},"[m]",18,null,null,null,null,null,null,null,null,null,null,null,null,{"$f":"$U$49","v":0.4},{"$f":"$V$49","v":0.4}]
[null,null,"Počet sestav lešení (0,75m) [-]",{"$f":"ROUNDUP(D72-(D73*E73+D74*E74),0)","v":2},"0,75",{"$f":"D75*E75","v":1.5},"[m]",19,null,null,null,null,null,null,null,null,null,null,null,null,{"$f":"$U$49","v":0.4},{"$f":"$V$49","v":0.4}]
[null,null,"Reálná délka lešení [m]",{"$f":"D73*E73+D74*E74+D75*E75","v":16.5},"[m]",null,null,20,null,null,null,null,null,null,null,null,null,null,null,null,{"$f":"$U$49","v":0.4},{"$f":"$V$49","v":0.4}]
[null,null,null,null,null,null,null,21,null,null,null,null,null,null,null,null,null,null,null,null,null,null,{"$f":"$W$49","v":0.4},{"$f":"$X$49","v":0.4}]
[null,null,"Výška:",null,null,null,null,22,null,null,null,null,null,null,null,null,null,null,null,null,null,null,{"$f":"$W$49","v":0.4},{"$f":"X77","v":0.4}]
[null,null,"Lešení pro:","Fasádu",null,null,null,23,null,null,null,null,null,null,null,null,null,null,null,null,null,null,{"$f":"$W$49","v":0.4},{"$f":"X78","v":0.4}]
[null,null,"Výška zábradlí posledního patra [m]",1,"[m]",null,null,24,null,null,null,null,null,null,null,null,null,null,null,null,null,null,{"$f":"$W$49","v":0.4},{"$f":"X79","v":0.4},{"$f":"$Y$49","v":0.4},{"$f":"$Z$49","v":0.4}]
[null,null,"Požadovaná výška [m]",{"$f":"IF(D79=Data_podpora!B22,'stěna D'!D14+D80,'stěna D'!D14)","v":15},"[m]",null,null,25,null,null,null,null,null,null,null,null,null,null,null,null,null,null,null,null,{"$f":"$Y$49","v":0.4},{"$f":"Z80","v":0.4}]
["Založení",null,"Výška nejnižžšího bodu terénu [m]",{"$f":"MIN(D4,D5,D6,D8)","v":0},"[m]",null,null,26,null,null,null,null,null,null,null,null,null,null,null,null,null,null,null,null,{"$f":"$Y$49","v":0.4},{"$f":"Z81","v":0.4}]
[null,null,"Výška nejvyššího  bodu terénu [m]",{"$f":"D8","v":2.5},"[m]",null,null,27,null,null,null,null,null,null,null,null,null,null,null,null,null,null,null,null,{"$f":"$Y$49","v":0.4},{"$f":"Z82","v":0.4},{"$f":"$AA$49","v":0.4},{"$f":"$AB$49","v":0.4}]
[null,null,"Rozdíl max a min [m]",{"$f":"D83-D82","v":2.5},"[m]",{"$f":"IF(D84<0.4,\"(Patky 0,4m)\",IF(D84<=1,\"(Patky 1m)\",IF(2>=D84>1,\"(Rám 1m)\",IF(5>D84>2,\"(Rám 2m)\",\"\"))))","v":"(Rám 1m)"},null,28,null,null,null,null,null,null,null,null,null,null,null,null,null,null,null,null,null,null,{"$f":"$AA$49","v":0.4},{"$f":"AB83","v":0.4}]
[null,"#","Výška založení [m]",{"$f":"D8+0.1","v":2.6},"[m]",null,null,29,null,null,null,null,null,null,null,null,null,null,null,null,null,null,null,null,null,null,{"$f":"$AA$49","v":0.4},{"$f":"AB84","v":0.4}]
[null,null,"Modulová výška patra lešení [m]",2,"[m]",null,null,30,null,null,null,null,null,null,null,null,null,null,null,null,null,null,null,null,null,null,{"$f":"$AA$49","v":0.4},{"$f":"AB85","v":0.4}]
[null,null,"Počet pater lešení [-]; výška [m])",{"$f":"IF(D81-D85<11,ROUNDDOWN((D81-D85)/2.15,0),ROUNDDOWN((D81-D85)/2.1,0))","v":5},"pater",{"$f":"INDEX(M27:M39,D87)","v":10.4},"[m]",31]
[null,null,"Reálná výška lešení [m]",{"$f":"D87*D86+D85+D80","v":13.6},"[m]"]
[]
["Uskočení pater","→","Hranice posouzení uskočení","4",null,{"$f":"INDEX(M27:M39,D90)","v":8.4},"[m]"]
[null,null,"Zbývající výška do hřebene",{"$f":"$D$14-F90","v":6.6},"[m]"]
[null,null,"Počet uskočených pater",{"$f":"IF(D91<11,ROUNDDOWN((D91)/2.6,0),ROUNDDOWN((D91)/2.6,0))","v":2},{"$f":"IF(D92=1,\"patro\",IF(D92<=4,\"patra\",\"pater\"))","v":"patra"}]
[null,null,"Rozdíl výšky okapu a nejbližšího patra",{"$f":"$J$4-(INDEX(M27:M39,D90))","v":3.3599999999999994},"[m]"]
[null,null,"Rozdíl výšek na 3 m sestavu",{"$f":"$N$5*$E$73","v":1.185365853658537},"[m]"]
[null,{"$f":"IF($D$92>=1,1,\"\")","v":1},"První sestava",{"$f":"D93+D94","v":4.5453658536585362},"[m]",{"$f":"IF(D$95<=2,\"posoudit další\",IF(D$95<=3.2,\"ponechat\",\"pokračuje patrem\"))","v":"pokračuje patrem"}]
[null,{"$f":"IF(1<=$D$92,2,\"X\")","v":2},"Druhá sestava",{"$f":"IF(F95=\"ponechat\",$D$93+$D$94*B96,$D$93+$D$94*B96-2)","v":3.7307317073170729},"[m]",{"$f":"IF(D96<2,\"posoudit další\",IF(D96<=3.2,\"ponechat\",IF(D96>3.2,\"pokračuje patrem\",\"\")))","v":"pokračuje patrem"}]
[null,{"$f":"IF(2<=$D$92,3,\"X\")","v":3},"Třetí sestava",{"$f":"IF(F96=\"ponechat\",$D$93+$D$94*B97,$D$93+$D$94*B97-2)","v":4.9160975609756106},"[m]",{"$f":"IF(D97<2,\"posoudit další\",IF(D97<=3.2,\"ponechat\",IF(D97>3.2,\"pokračuje patrem\",\"\")))","v":"pokračuje patrem"}]
[null,{"$f":"IF(3<=$D$92,4,\"X\")","v":"X"},"Čtvrtá sestava",{"$f":"IF(F97=\"ponechat\",$D$93+$D$94*B98,$D$93+$D$94*B98-2)","v":{"$error":"#VALUE!"}},"[m]",{"$f":"IF(D98<2,\"posoudit další\",IF(D98<=3.2,\"ponechat\",IF(D98>3.2,\"pokračuje patrem\",\"\")))","v":{"$error":"#VALUE!"}}]
[]
[]
[]
[]
[null,null,"NAKLÁDACÍ LIST"]
[]
[null,null,"stavitelná patka 0,5m","počet kusů"]
[null,null,"stavitelná patka 1m",{"$f":"IF(D107>=0,($D$73+$D$74+$D$75)*2+2-D107,($D$73+$D$74+$D$75)*2+2)","v":14}]
[null,null,"rám 2m",2]
[null,null,"rám 1m",{"$f":"(($D$73+$D$74+$D$75)+1)*$D$87","v":40}]
[null,null,"podlaha 3m",{"$f":"IF(D85>=1,($D$73+$D$74+$D$75)+1,0)","v":8}]
[null,null,"podlaha 2m",{"$f":"(D73*D87-$D112)*2","v":40}]
[null,null,"průlezová podlaha 3m",{"$f":"D74*D87","v":0}]
[null,null,"zábradlí 3m",{"$f":"D87","v":5}]
[null,null,"zábradlí 2m",{"$f":"(1+$D$87*2)*D73","v":55}]
[null,null,"diagonální úchyt",{"$f":"(1+$D$87*2)*D74","v":0}]
[null,null,"diagonála 3m"]
[null,null,"diagonála 2m",{"$f":"$D$87*(ROUNDUP((D73+D74+D75)/4,0))","v":10}]
[null,null,"kotva 0,5 m",{"$f":"IF(D116=0,$D$87*ROUNDUP(D74/4,0),0)","v":0}]
[null,null,"kotva dlouhá 1 m",{"$f":"(($D$87-1)*SUM(D73:D75))/2","v":14}]
[null,null,"eLko / sloupek"]
[null,null,"eLko 2 m",{"$f":"SUM(D73:D75)+1","v":8}]
[null,null,"Háčko"]
[null,null,"boční zábradlí"]
[null,null,"okopové prkno 3m",{"$f":"D87*2","v":10}]
[null,null,"okopové prkno 2m",{"$f":"D73*D87","v":25}]
[null,null,"konzola",{"$f":"D74*D87","v":0}]
[null,null,"pevna spojka"]
[null,null,"otočná spojka"]
[null,null,"závlačná spojka"]

{"sheet":"stěna E","index":6,"n_rows":128,"n_cols":34,"rows_kept":128,"cut":false,"hidden":false,"merged":[[0,4,1,6],[2,28,2,30],[2,31,2,33],[3,21,4,22],[3,23,4,23],[3,24,4,24],[3,25,4,25],[42,20,42,21],[42,22,42,23],[42,24,42,25],[42,26,42,27],[43,8,43,9],[43,10,43,11],[43,12,43,13],[43,14,43,15],[43,16,43,17],[43,18,43,19],[42,8,42,9],[42,10,42,11],[42,12,42,13],[42,14,42,15],[42,16,42,17],[42,18,42,19],[43,20,43,21],[43,22,43,23],[43,24,43,25],[43,26,43,27],[47,8,47,9],[47,10,47,11],[47,12,47,13],[47,14,47,15],[47,16,47,17],[47,18,47,19],[89,0,93,0],[47,20,47,21],[47,22,47,23],[47,24,47,25],[47,26,47,27],[70,3,70,4],[81,0,84,0]]}
[null,null,"Stěna E","Výkres:",null,null,null,"Data grafu:"]
[null,null,"Nastavení parametrů výpočtu:",null,null,null,null,null,"Tvar střechy",null,"Tvar terénu",null,"úhel alfa",null,null,null,null,null,null,null,null,"NAKLÁDACÍ LIST:",null,{"$f":"$C$1","v":"Stěna E"},{"$f":"IF(AD6=0,\"(BUDE NAKLÁDÁNO POUZE AUTO)\",\"\")","v":""},null,null,"VYTÍŽENOST ODVOZNÍHO PROSTŘEDKU:"]
[null,null,"Terén: absolutní výška (±0,00 = svislice od hřebene střechy na terén)",null,null,null,null,null,"osa x","osa y","osa x","osa y","tg A",{"$f":"($D$14-$J$4)/($D$12/2)","v":0},null,null,null,null,null,null,null,"obestavběná plocha lešení [m2]",null,null,{"$f":"IF(K41>=1,SUM(I48,K48,M48,O48,Q48,S48,U48,W48,Y48,AA48)+SUM(I44,K44,M44,O44,Q44,S44,U44,W44,Y44,AA44)*2+SUM(I44,K44,M44,O44,Q44,S44,U44,W44,Y44,AA44),SUM(I48,K48,M48,O48,Q48,S48,U48,W48,Y48,AA48)+SUM(I44,K44,M44,O44,Q44,S44,U44,W44,Y44,AA44)*2)","v":252},"[m2]",null,"[kg]","1. cesta",null,null,"2.cesta"]
[null,"→","Výška terénu v levém rohu [m]",0,"[m]",null,null,"vlevo",0,{"$f":"IF($D$13=Data_podpora!$B$9,$D$14,$D$15+$D$4)","v":11.759999999999991},0,{"$f":"$D$4","v":0},"A",{"$f":"DEGREES(ATAN(N3))","v":0},null,null,null,null,null,null,null,"Komponenta",null,"počet kusů [ks]","jednotková hmotnost [kg/ks]","hmotnost [kg]",null,null,"KAPACITA","VYUŽITO","Zbývá","KAPACITA","VYUŽITO","ZBÝVÁ"]
[null,"→","Výška terénu v pravém rohu [m]",0,"[m]",null,null,"max",{"$f":"$D$9","v":0},{"$f":"IF($D$12/2<I5,-$N$3*I5+$J$4+$N$3*$D$12,$N$3*I5+$J$4)","v":11.759999999999991},{"$f":"$D$9","v":0},{"$f":"$D$8","v":0},"tg A",{"$f":"TAN(RADIANS($N$4))","v":0},null,null,null,null,null,null,null,null,null,null,null,null,null,"AUTO",2500,{"$f":"IF(Z30<=AC5,SUM(Z6:Z29),SUM(Z6:Z9,Z26:Z29,Z15:Z23,Z13/2,Z14/2))","v":1196.2},{"$f":"IF((AC5-AD5)<=0,0,AC5-AD5)","v":1303.8},2500,{"$f":"IF(AC5-AD5<=0,-(AC5-AD5),0)","v":0},{"$f":"AF5-AG5","v":2500}]
[null,"→","Výška nejnižšího bodu terénu [m]",0,"[m]",null,null,"min",{"$f":"$D$7","v":0},{"$f":"IF($D$12/2>I6,$N$3*I6+$J$4,-$N$3*I6+$J$4+$N$3*$D$12)","v":11.759999999999991},{"$f":"$D$7","v":0},{"$f":"$D$6","v":0},"sklon",{"$f":"$N$5","v":0},null,null,null,null,null,null,null,"stavitelná patka 0,5m",null,{"$f":"IF(X7>0,(COUNT(I46:AB46)+2)-X7,(COUNT(I46:AB46)+2))","v":16},3.1,{"$f":"Y7*X6","v":75.2},null,"ZÁVĚS",3500,{"$f":"IF(Z30<=AC5,0,SUM(Z10:Z12,Z24:Z25,Z13/2,Z14/2))","v":1899.25},{"$f":"IF((AC6-AD6)<=0,0,AC6-AD6)","v":1600.75},3500,{"$f":"IF(AC6-AD6<=0,-(AC6-AD6),0)","v":0},{"$f":"AF6-AG6","v":3500}]
[null,"→","Místo nejnižšího bodu (zleva) [m]",0,"[m]",null,null,"top",{"$f":"$D$12/2","v":10.5},{"$f":"$D$14","v":11.759999999999991},{"$f":"$D$12/2","v":10.5},{"$f":"0","v":0},null,null,null,null,null,null,null,null,null,"stavitelná patka 1m",null,0,4.7,{"$f":"Y9*X7","v":0}]
[null,"→","Výška nejvyššího bodu terénu [m]",0,"[m]",null,null,"vpravo",{"$f":"$D$12","v":21},{"$f":"$J$4","v":11.759999999999991},{"$f":"$D$12","v":21},{"$f":"$D$5","v":0},null,null,null,null,null,null,null,null,null,"rám 2m",null,{"$f":"IF(X9>0,SUM(J46-I46,L46-K46,N46-M46,P46-O46,R46-Q46,T46-S46,V46-U46,X46-W46,Z46-Y46,AB46-AA46)+MIN(J46-I46,L46-K46,N46-M46,P46-O46,R46-Q46,T46-S46,V46-U46,X46-W46,Z46-Y46,AB46-AA46)+MAX(J46-I46,L46-K46,N46-M46,P46-O46,R46-Q46,T46-S46,V46-U46,X46-W46,Z46-Y46,AB46-AA46)-MIN(J46-I46,L46-K46,N46-M46,P46-O46,R46-Q46,T46-S46,V46-U46,X46-W46,Z46-Y46,AB46-AA46)-X9,SUM(J46-I46,L46-K46,N46-M46,P46-O46,R46-Q46,T46-S46,V46-U46,X46-W46,Z46-Y46,AB46-AA46)+MIN(J46-I46,L46-K46,N46-M46,P46-O46,R46-Q46,T46-S46,V46-U46,X46-W46,Z46-Y46,AB46-AA46)+MAX(J46-I46,L46-K46,N46-M46,P46-O46,R46-Q46,T46-S46,V46-U46,X46-W46,Z46-Y46,AB46-AA46)-MIN(J46-I46,L46-K46,N46-M46,P46-O46,R46-Q46,T46-S46,V46-U46,X46-W46,Z46-Y46,AB46-AA46))","v":40},16.5,{"$f":"Y8*X8","v":660}]
[null,"→","Místo nejvyššího bodu (zleva) [m]",0,"[m]",null,null,null,null,null,null,null,null,null,null,null,null,null,null,null,null,"rám 1m",null,0,11.3,0]
[null,null,null,null,null,null,null,null,"Tvar střechy",null,"Tvar terénu",null,"úhel alfa",null,null,null,null,null,null,null,null,"podlaha 3m",null,{"$f":"((IF(I44=3,J46-I46,0)+IF(K44=3,L46-K46,0)+IF(M44=3,N46-M46,0)+IF(O44=3,P46-O46,0)+IF(Q44=3,R46-Q46,0)+IF(S44=3,T46-S46,0)+IF(U44=3,V46-U46,0)+IF(W44=3,X46-W46,0)+IF(Y44=3,Z46-Y46,0)+IF(AA44=3,AB46-AA46,0))-X12)*2","v":60},22,1320]
[null,null,"Střecha:",null,null,null,null,null,"osa x","osa y","osa x","osa y","tg A",{"$f":"($D$14-$J$4)/($D$17)","v":{"$error":"#DIV/0!"}},null,null,null,null,null,null,null,"podlaha 2m",null,{"$f":"(IF(I44=2,J46-I46,0)+IF(K44=2,L46-K46,0)+IF(M44=2,N46-M46,0)+IF(O44=2,P46-O46,0)+IF(Q44=2,R46-Q46,0)+IF(S44=2,T46-S46,0)+IF(U44=2,V46-U46,0)+IF(W44=2,X46-W46,0)+IF(Y44=2,Z46-Y46,0)+IF(AA44=2,AB46-AA46,0))*2","v":0},14.5,0]
[null,null,"Délka strany [m]",{"$f":"Půdorys!C9","v":21},"[m]",null,null,"vlevo",0,{"$f":"$D$15+$D$4","v":11.759999999999991},0,{"$f":"$D$4","v":0},"A",{"$f":"DEGREES(ATAN(N11))","v":{"$error":"#DIV/0!"}},null,null,null,null,null,null,null,"průlezová podlaha 3m",null,{"$f":"MAX(J46:AB46)","v":5},28,140]
[null,"→","Tvar střechy:","sedlová",null,null,null,"max",{"$f":"$D$9","v":0},{"$f":"IF($I$17<I13,-$N$3*I13+$J$4+$N$11*$D$12,IF(I13<$I$14,$N$11*I13+$J$4,J14))","v":{"$error":"#DIV/0!"}},{"$f":"$D$9","v":0},{"$f":"$D$8","v":0},"tg A",{"$f":"TAN(RADIANS($N$12))","v":{"$error":"#DIV/0!"}},null,null,null,null,null,null,null,"zábradlí 3m",null,{"$f":"IF(I44=3,2*(J46-I46)+1,0)+IF(K44=3,2*(L46-K46)+1,0)+IF(M44=3,2*(N46-M46)+1,0)+IF(O44=3,2*(P46-O46)+1,0)+IF(Q44=3,2*(R46-Q46)+1,0)+IF(S44=3,2*(T46-S46)+1,0)+IF(U44=3,2*(V46-U46)+1,0)+IF(W44=3,2*(X46-W46)+1,0)+IF(Y44=3,2*(Z46-Y46)+1,0)+IF(AA44=3,2*(AB46-AA46)+1,0)","v":77},5.5,423.5]
[null,"→",{"$f":"IF('stěna E'!$D$13=Data_podpora!$B$9,\"Výška stěny [m]\",\"Výška uprostřed stěny [m]\")","v":"Výška uprostřed stěny [m]"},{"$f":"507.76-496","v":11.759999999999991},"[m]",null,null,"min",{"$f":"$D$7","v":0},{"$f":"IF($I$13>=I14,$N$11*I14+$J$4,IF(I14<=$I$16,J12,-$N$11*I14+$J$12+$N$11*$D$12))","v":{"$error":"#DIV/0!"}},{"$f":"$D$7","v":0},{"$f":"$D$6","v":0},"sklon",{"$f":"$N$13","v":{"$error":"#DIV/0!"}},null,null,null,null,null,null,null,"zábradlí 2m",null,{"$f":"IF(I44=2,2*(J46-I46)+1,0)+IF(K44=2,2*(L46-K46)+1,0)+IF(M44=2,2*(N46-M46)+1,0)+IF(O44=2,2*(P46-O46)+1,0)+IF(Q44=2,2*(R46-Q46)+1,0)+IF(S44=2,2*(T46-S46)+1,0)+IF(U44=2,2*(V46-U46)+1,0)+IF(W44=2,2*(X46-W46)+1,0)+IF(Y44=2,2*(Z46-Y46)+1,0)+IF(AA44=2,2*(AB46-AA46)+1,0)","v":0},3.5,0]
[null,{"$f":"IF($D$13=Data_podpora!B9,\"\",\"→\")","v":"→"},{"$f":"IF($D$13=Data_podpora!$B$9,\"\",\"Výška od terénu k okapu (levý) [m]\")","v":"Výška od terénu k okapu (levý) [m]"},{"$f":"507.76-496","v":11.759999999999991},{"$f":"IF($D$13=Data_podpora!$B$9,\"\",\"[m]\")","v":"[m]"},null,null,"polov1",{"$f":"$D$17","v":0},{"$f":"$D$14","v":11.759999999999991},{"$f":"$D$17","v":0},{"$f":"$D$18","v":0},null,null,null,null,null,null,null,null,null,"diagonální úchyt",null,{"$f":"X16/MAX(I46:AB46)","v":2},0.5,1]
[null,null,{"$f":" IF(D13=Data_podpora!B10,\"Upřesňující parametry pro polovalbovou střechu:\",\"\")","v":""},null,null,null,null,"top",{"$f":"$D$12/2","v":10.5},{"$f":"$D$14","v":11.759999999999991},{"$f":"$D$12/2","v":10.5},{"$f":"0","v":0},null,null,null,null,null,null,null,null,null,"diagonála 3m",null,{"$f":"MAX(J46-I46,L46-K46,N46-M46,P46-O46,R46-Q46,T46-S46,V46-U46,X46-W46,Z46-Y46,AB46-AA46)*ROUNDUP((IF(I44=3,I44,0)+IF(K44=3,K44,0)+IF(M44=3,M44,0)+IF(O44=3,O44,0)+IF(Q44=3,Q44,0)+IF(S44=3,S44,0)+IF(U44=3,U44,0)+IF(W44=3,W44,0)+IF(Y44=3,Y44,0)+IF(AA44=3,AA44,0))/20,0)","v":10},11,110]
[null,{"$f":"IF($D$13=Data_podpora!$B$10,'stěna E'!$B$15,\"\")","v":""},{"$f":"IF($D$13=Data_podpora!$B$10,\"Místo polovalby [m]\",\"\")","v":""},null,{"$f":"IF($D$13=Data_podpora!$B$10,\"[m]\",\"\")","v":""},null,null,"polov2",{"$f":"$D$12-$D$17","v":21},{"$f":"$D$14","v":11.759999999999991},{"$f":"$D$12-$D$17","v":21},{"$f":"$D$19","v":0},null,null,null,null,null,null,null,null,null,"diagonála 2m",null,{"$f":"IF(X16=0,MAX(J46-I46,L46-K46,N46-M46,P46-O46,R46-Q46,T46-S46,V46-U46,X46-W46,Z46-Y46,AB46-AA46)*ROUNDUP((IF(I44=2,I44,0)+IF(K44=2,K44,0)+IF(M44=2,M44,0)+IF(O44=2,O44,0)+IF(Q44=2,Q44,0)+IF(S44=2,S44,0)+IF(U44=2,U44,0)+IF(W44=2,W44,0)+IF(Y44=2,Y44,0)+IF(AA44=2,AA44,0))/12,0),0)","v":0},8,0]
[null,{"$f":"IF($D$13=Data_podpora!$B$10,'stěna E'!$B$15,\"\")","v":""},{"$f":"IF($D$13=Data_podpora!$B$10,\"Výška terénu v místě levé polovalby [m]\",\"\")","v":""},null,{"$f":"IF($D$13=Data_podpora!$B$10,\"[m]\",\"\")","v":""},null,null,"vpravo",{"$f":"$D$12","v":21},{"$f":"$J$4","v":11.759999999999991},{"$f":"$D$12","v":21},{"$f":"$D$5","v":0},null,null,null,null,null,null,null,null,null,"kotva 0,5 m",null,{"$f":"IF(X19=0,ROUNDUP(X8*0.45,0),ROUNDUP(X8*0.45,0)-X19)","v":18},2,36]
[null,{"$f":"IF($D$13=Data_podpora!$B$10,'stěna E'!$B$15,\"\")","v":""},{"$f":"IF($D$13=Data_podpora!$B$10,\"Výška terénu v místě pravé polovalby [m]\",\"\")","v":""},null,{"$f":"IF($D$13=Data_podpora!$B$10,\"[m]\",\"\")","v":""},null,null,null,null,null,null,null,null,null,null,null,null,null,null,null,null,"kotva dlouhá 1 m",null,0,3.8,0]
[null,null,null,null,null,null,null,"Patra lešení",null,null,null,null,null,null,null,null,null,null,null,null,null,"eLko / sloupek",null,{"$f":"IF(X22=0,COUNT(J46,L46,N46,P46,R46,T46,V46,X46,Z46,AB46)+1,(COUNT(J46,L46,N46,P46,R46,T46,V46,X46,Z46,AB46)+1)-X22)","v":8},5,40]
[null,null,null,null,null,null,null,null,null,null,null,null,null,null,null,null,null,null,null,null,null,"eLko 2 m",null,null,11.5,0]
[null,{"$f":"IF($D$21=Data_podpora!B30,\"→\",\"\")","v":""},null,null,{"$f":"IF(D21=Data_podpora!B30,\"[m]\",\"\")","v":""},null,null,"-0,5",{"$f":"I26-1","v":-0.9},{"$f":"J26-1","v":-0.9},{"$f":"K26-1","v":-0.9},{"$f":"L26-1","v":-0.9},{"$f":"M26-1","v":-0.9},null,null,null,null,null,null,null,null,"Háčko",null,{"$f":"2*(MAX(I46:AB46)-MIN(J46,L46,N46,P46,R46,T46,V46,X46,Z46,AB46))","v":0},9.6999999999999993,0]
[null,{"$f":"IF($D$21=Data_podpora!$B$30,\"→\",\"\")","v":""},{"$f":"IF(D21=Data_podpora!B30,\"Výška od terénu (zleva) [m]\",\"\")","v":""},null,{"$f":"IF(D21=Data_podpora!B30,\"[m]\",\"\")","v":""},null,null,"-3",{"$f":"I24-2","v":-5.9},-5.9,-5.9,-5.9,-5.9,null,null,null,null,null,null,null,null,"boční zábradlí",null,{"$f":"IF(X22=0,(MAX(J46-I46,L46-K46,N46-M46,P46-O46,R46-Q46,T46-S46,V46-U46,X46-W46,Z46-Y46,AB46-AA46)+1)*2,(MAX(J46-I46,L46-K46,N46-M46,P46-O46,R46-Q46,T46-S46,V46-U46,X46-W46,Z46-Y46,AB46-AA46)+1)*2-X22)","v":12},3,36]
[null,{"$f":"IF($D$21=Data_podpora!$B$30,\"→\",\"\")","v":""},{"$f":"IF(D21=Data_podpora!B30,\"Šířka [m]\",\"\")","v":""},null,{"$f":"IF(D21=Data_podpora!B30,\"[m]\",\"\")","v":""},null,null,"-2",-3.9,-3.9,-3.9,-3.9,-3.9,null,null,null,null,null,null,null,null,"okopové prkno 3m",null,{"$f":"IF(I44=3,J46-I46,0)+IF(K44=3,L46-K46,0)+IF(M44=3,N46-M46,0)+IF(O44=3,P46-O46,0)+IF(Q44=3,R46-Q46,0)+IF(S44=3,T46-S46,0)+IF(U44=3,V46-U46,0)+IF(W44=3,X46-W46,0)+IF(Y44=3,Z46-Y46,0)+IF(AA44=3,AB46-AA46,0)","v":35},6.5,227.5]
[null,null,null,null,null,null,null,"-1",{"$f":"I26-2","v":-1.9},{"$f":"$D$85-2","v":-1.9},{"$f":"$D$85-2","v":-1.9},{"$f":"$D$85-2","v":-1.9},{"$f":"$D$85-2","v":-1.9},null,null,null,null,null,null,null,null,"okopové prkno 2m",null,{"$f":"IF(I44=2,J46-I46,0)+IF(K44=2,L46-K46,0)+IF(M44=2,N46-M46,0)+IF(O44=2,P46-O46,0)+IF(Q44=2,R46-Q46,0)+IF(S44=2,T46-S46,0)+IF(U44=2,V46-U46,0)+IF(W44=2,X46-W46,0)+IF(Y44=2,Z46-Y46,0)+IF(AA44=2,AB46-AA46,0)","v":0},4.5,0]
[null,null,null,null,null,null,null,"0",{"$f":"$K$41","v":0.1},{"$f":"$K$41","v":0.1},{"$f":"$K$41","v":0.1},{"$f":"$K$41","v":0.1},{"$f":"$K$41","v":0.1},null,null,null,null,null,null,null,null,"konzola",null,null,10,0]
[null,null,null,null,null,null,null,"1",{"$f":"I26+$D$86","v":2.1},{"$f":"J26+$D$86","v":2.1},{"$f":"K26+$D$86","v":2.1},{"$f":"L26+$D$86","v":2.1},{"$f":"M26+$D$86","v":2.1},null,null,null,null,null,null,null,null,"pevna spojka",null,{"$f":"J46*2","v":10},1.1499999999999999,11.5]
[null,null,null,null,null,null,null,"2",4.0999999999999996,4.0999999999999996,4.0999999999999996,4.0999999999999996,4.0999999999999996,null,null,null,null,null,null,null,null,"otočná spojka",null,{"$f":"J46","v":5},1.35,6.75]
[null,null,null,null,null,null,null,"3",6.1,6.1,6.1,6.1,6.1,null,null,null,null,null,null,null,null,"závlačná spojka",null,{"$f":"J46*2","v":10},0.8,8]
[null,null,null,null,null,null,null,"4",8.1,8.1,8.1,8.1,8.1,null,null,null,null,null,null,null,null,null,null,null,null,{"$f":"SUM(Z6:Z29)","v":3095.45}]
[null,null,null,null,null,null,null,"5",10.1,10.1,10.1,10.1,10.1]
[null,null,null,null,null,null,null,"6",12.1,12.1,12.1,12.1,12.1]
[null,null,null,null,null,null,null,"7",14.1,14.1,14.1,14.1,14.1]
[null,null,null,null,null,null,null,"8",16.100000000000001,16.100000000000001,16.100000000000001,16.100000000000001,16.100000000000001]
[null,null,null,null,null,null,null,"9",18.100000000000001,18.100000000000001,18.100000000000001,18.100000000000001,18.100000000000001]
[null,null,null,null,null,null,null,"10",20.100000000000001,20.100000000000001,20.100000000000001,20.100000000000001,20.100000000000001]
[null,null,null,null,null,null,null,"11",22.1,22.1,22.1,22.1,22.1]
[null,null,null,null,null,null,null,"12",24.1,24.1,24.1,24.1,24.1]
[null,null,null,null,null,null,null,"13",26.1,26.1,26.1,26.1,26.1]
[]
[null,null,null,null,null,null,null,"LEŠENÍ","výška založení [m]",null,{"$f":"D8+0.1","v":0.1},"[m]","nepsat nuly v kolonce \"patro\",pokud není sestava lešení využita",null,null,null,null,null,"Poznámka:",{"$f":"IF(Půdorys!I9=0,\"\",Půdorys!I9)","v":""}]
[null,null,null,null,null,null,null,null,"ZALOŽENÍ","VÝŠKA P.P.","ZALOŽENÍ","VÝŠKA P.P.","ZALOŽENÍ","VÝŠKA P.P.","ZALOŽENÍ","VÝŠKA P.P.","ZALOŽENÍ","VÝŠKA P.P.","ZALOŽENÍ","VÝŠKA P.P.","ZALOŽENÍ","VÝŠKA P.P.","ZALOŽENÍ","VÝŠKA P.P.","ZALOŽENÍ","VÝŠKA P.P.","ZALOŽENÍ","VÝŠKA P.P."]
[null,null,null,null,null,null,null,"SESTAVA",1,null,2,null,3,null,4,null,5,null,6,null,7,null,8,null,9,null,10]
[null,null,null,null,null,null,null,"DÉLKA SESTAVY",3,null,3,null,3,null,3,null,3,null,3,null,3,null,0,null,0,null,0]
[null,null,null,null,null,null,null,"\"potvrdit\""]
[null,null,null,null,null,null,null,"PATRO",0,5,0,5,0,5,0,5,0,5,0,5,0,5]
[null,null,null,null,null,null,null,"POSUN"]
[null,null,null,null,null,null,null,"plocha [m2]",{"$f":"(J46-I46)*$D$86*I44","v":30},null,{"$f":"L46*$D$86*K44","v":30},null,{"$f":"N46*$D$86*M44","v":30},null,{"$f":"P46*$D$86*O44","v":30},null,{"$f":"R46*$D$86*Q44","v":30},null,{"$f":"T46*$D$86*S44","v":30},null,{"$f":"V46*$D$86*U44","v":30},null,{"$f":"X46*$D$86*W44","v":0},null,{"$f":"Z46*$D$86*Y44","v":0},null,{"$f":"AB46*$D$86*AA44","v":0}]
[null,null,null,null,null,null,null,"výška",{"$f":"IF(I46=-0.5,M22,INDEX($M$23:$M$39,I46+4))","v":0.1},{"$f":"INDEX($M$23:$M$39,J46+4)","v":10.1},{"$f":"IF(K46=-0.5,M22,INDEX($M$23:$M$39,K46+4))","v":0.1},{"$f":"INDEX($M$23:$M$39,L46+4)","v":10.1},{"$f":"IF(M46=-0.5,M22,INDEX($M$23:$M$39,M46+4))","v":0.1},{"$f":"INDEX($M$23:$M$39,N46+4)","v":10.1},{"$f":"IF(O46=-0.5,M22,INDEX($M$23:$M$39,O46+4))","v":0.1},{"$f":"INDEX($M$23:$M$39,P46+4)","v":10.1},{"$f":"IF(Q46=-0.5,M22,INDEX($M$23:$M$39,Q46+4))","v":0.1},{"$f":"INDEX($M$23:$M$39,R46+4)","v":10.1},{"$f":"IF(S46=-0.5,M22,INDEX($M$23:$M$39,S46+4))","v":0.1},{"$f":"INDEX($M$23:$M$39,T46+4)","v":10.1},{"$f":"IF(U46=-0.5,M22,INDEX($M$23:$M$39,U46+4))","v":0.1},{"$f":"INDEX($M$23:$M$39,V46+4)","v":10.1},{"$f":"IF(W46=-0.5,M22,INDEX($M$23:$M$39,W46+4))","v":0.1},{"$f":"INDEX($M$23:$M$39,X46+4)","v":0.1},{"$f":"IF(Y46=-0.5,M22,INDEX($M$23:$M$39,Y46+4))","v":0.1},{"$f":"INDEX($M$23:$M$39,Z46+4)","v":0.1},{"$f":"IF(AA46=-0.5,M22,INDEX($M$23:$M$39,AA46+4))","v":0.1},{"$f":"INDEX($M$23:$M$39,AB46+4)","v":0.1}]
[]
[]
[]
[]
[]
[null,null,null,null,null,null,null,-1]
[null,null,null,null,null,null,null,0,{"$f":"$I$49","v":0.1},{"$f":"$J$49","v":10.1}]
[null,null,null,null,null,null,null,1,{"$f":"$I$49","v":0.1},{"$f":"$J$49","v":10.1}]
[null,null,null,null,null,null,null,2,{"$f":"$I$49","v":0.1},{"$f":"$J$49","v":10.1}]
[null,null,null,null,null,null,null,3,{"$f":"$I$49","v":0.1},{"$f":"$J$49","v":10.1},{"$f":"$K$49","v":0.1},{"$f":"$L$49","v":10.1}]
[null,null,null,null,null,null,null,4,null,null,{"$f":"$K$49","v":0.1},{"$f":"$L$49","v":10.1}]
[null,null,null,null,null,null,null,5,null,null,{"$f":"$K$49","v":0.1},{"$f":"$L$49","v":10.1}]
[null,null,null,null,null,null,null,6,null,null,{"$f":"$K$49","v":0.1},{"$f":"$L$49","v":10.1},{"$f":"$M$49","v":0.1},{"$f":"$N$49","v":10.1}]
[null,null,null,null,null,null,null,7,null,null,null,null,{"$f":"$M$49","v":0.1},{"$f":"$N$49","v":10.1}]
[null,null,null,null,null,null,null,8,null,null,null,null,{"$f":"$M$49","v":0.1},{"$f":"$N$49","v":10.1}]
[null,null,null,null,null,null,null,9,null,null,null,null,{"$f":"$M$49","v":0.1},{"$f":"$N$49","v":10.1},{"$f":"$O$49","v":0.1},{"$f":"$P$49","v":10.1}]
[null,null,null,null,null,null,null,10,null,null,null,null,null,null,{"$f":"$O$49","v":0.1},{"$f":"$P$49","v":10.1}]
[null,null,null,null,null,null,null,11,null,null,null,null,null,null,{"$f":"$O$49","v":0.1},{"$f":"$P$49","v":10.1}]
[null,null,null,null,null,null,null,12,null,null,null,null,null,null,{"$f":"$O$49","v":0.1},{"$f":"$P$49","v":10.1},{"$f":"$Q$49","v":0.1},{"$f":"$R$49","v":10.1}]
[null,null,"Pomocný výpočet počtu sestav lešení:",null,null,null,null,13,null,null,null,null,null,null,null,null,{"$f":"$Q$49","v":0.1},{"$f":"$R$49","v":10.1}]
[null,null,"Délka:",null,null,null,null,14,null,null,null,null,null,null,null,null,{"$f":"$Q$49","v":0.1},{"$f":"$R$49","v":10.1}]
[null,null,"přesah za roh objektu:","Ne",null,null,null,15,null,null,null,null,null,null,null,null,{"$f":"$Q$49","v":0.1},{"$f":"$R$49","v":10.1},{"$f":"$S$49","v":0.1},{"$f":"$T$49","v":10.1}]
[null,null,"Požadovaná minimální délka lešení [m]",{"$f":"IF(D71=Data_podpora!B17,'stěna E'!D12+2,IF('stěna E'!D71=Data_podpora!B14,'stěna E'!D12+0.5,IF(D71=Data_podpora!B13,'stěna E'!D12,'stěna E'!D12+1)))","v":21},"[m]",null,null,16,null,null,null,null,null,null,null,null,null,null,{"$f":"$S$49","v":0.1},{"$f":"$T$49","v":10.1}]
[null,null,"Počet sestav lešení (3m) [-]",{"$f":"ROUNDDOWN(D72/E73,0)","v":7},"3",{"$f":"D73*E73","v":21},"[m]",17,null,null,null,null,null,null,null,null,null,null,{"$f":"$S$49","v":0.1},{"$f":"$T$49","v":10.1}]
[null,null,"Počet sestav lešení (2m) [-]",{"$f":"ROUNDDOWN(MOD(D72,E73)/E74,0)","v":0},"2",{"$f":"D74*E74","v":0},"[m]",18,null,null,null,null,null,null,null,null,null,null,{"$f":"$S$49","v":0.1},{"$f":"$T$49","v":10.1},{"$f":"$U$49","v":0.1},{"$f":"$V$49","v":10.1}]
[null,null,"Počet sestav lešení (0,75m) [-]",{"$f":"ROUNDUP(D72-(D73*E73+D74*E74),0)","v":0},"0,75",{"$f":"D75*E75","v":0},"[m]",19,null,null,null,null,null,null,null,null,null,null,null,null,{"$f":"$U$49","v":0.1},{"$f":"$V$49","v":10.1}]
[null,null,"Reálná délka lešení [m]",{"$f":"D73*E73+D74*E74+D75*E75","v":21},"[m]",null,null,20,null,null,null,null,null,null,null,null,null,null,null,null,{"$f":"$U$49","v":0.1},{"$f":"$V$49","v":10.1}]
[null,null,null,null,null,null,null,21,null,null,null,null,null,null,null,null,null,null,null,null,{"$f":"$U$49","v":0.1},{"$f":"$V$49","v":10.1},{"$f":"$W$49","v":0.1},{"$f":"$X$49","v":0.1}]
[null,null,"Výška:",null,null,null,null,22,null,null,null,null,null,null,null,null,null,null,null,null,null,null,{"$f":"$W$49","v":0.1},{"$f":"X77","v":0.1}]
[null,null,"Lešení pro:","Fasádu",null,null,null,23,null,null,null,null,null,null,null,null,null,null,null,null,null,null,{"$f":"$W$49","v":0.1},{"$f":"X78","v":0.1}]
[null,null,"Výška zábradlí posledního patra [m]",1,"[m]",null,null,24,null,null,null,null,null,null,null,null,null,null,null,null,null,null,{"$f":"$W$49","v":0.1},{"$f":"X79","v":0.1},{"$f":"$Y$49","v":0.1},{"$f":"$Z$49","v":0.1}]
[null,null,"Požadovaná výška [m]",{"$f":"IF(D79=Data_podpora!B22,'stěna E'!D14+D80,'stěna E'!D14)","v":11.759999999999991},"[m]",null,null,25,null,null,null,null,null,null,null,null,null,null,null,null,null,null,null,null,{"$f":"$Y$49","v":0.1},{"$f":"Z80","v":0.1}]
["Založení",null,"Výška nejnižžšího bodu terénu [m]",{"$f":"MIN(D4,D5,D6,D8)","v":0},"[m]",null,null,26,null,null,null,null,null,null,null,null,null,null,null,null,null,null,null,null,{"$f":"$Y$49","v":0.1},{"$f":"Z81","v":0.1}]
[null,null,"Výška nejvyššího  bodu terénu [m]",{"$f":"D8","v":0},"[m]",null,null,27,null,null,null,null,null,null,null,null,null,null,null,null,null,null,null,null,{"$f":"$Y$49","v":0.1},{"$f":"Z82","v":0.1},{"$f":"$AA$49","v":0.1},{"$f":"$AB$49","v":0.1}]
[null,null,"Rozdíl max a min [m]",{"$f":"D83-D82","v":0},"[m]",{"$f":"IF(D84<0.4,\"(Patky 0,4m)\",IF(D84<=1,\"(Patky 1m)\",IF(2>=D84>1,\"(Rám 1m)\",IF(5>D84>2,\"(Rám 2m)\",\"\"))))","v":"(Patky 0,4m)"},null,28,null,null,null,null,null,null,null,null,null,null,null,null,null,null,null,null,null,null,{"$f":"$AA$49","v":0.1},{"$f":"AB83","v":0.1}]
[null,"#","Výška založení [m]",{"$f":"D8+0.1","v":0.1},"[m]",null,null,29,null,null,null,null,null,null,null,null,null,null,null,null,null,null,null,null,null,null,{"$f":"$AA$49","v":0.1},{"$f":"AB84","v":0.1}]
[null,null,"Modulová výška patra lešení [m]",2,"[m]",null,null,30,null,null,null,null,null,null,null,null,null,null,null,null,null,null,null,null,null,null,{"$f":"$AA$49","v":0.1},{"$f":"AB85","v":0.1}]
[null,null,"Počet pater lešení [-]; výška [m])",{"$f":"IF(D81-D85<11,ROUNDDOWN((D81-D85)/2.15,0),ROUNDDOWN((D81-D85)/2.1,0))","v":5},"pater",{"$f":"INDEX(M27:M39,D87)","v":10.1},"[m]",31]
[null,null,"Reálná výška lešení [m]",{"$f":"D87*D86+D85+D80","v":11.1},"[m]"]
[]
["Uskočení pater","→","Hranice posouzení uskočení","4",null,{"$f":"INDEX(M27:M39,D90)","v":8.1},"[m]"]
[null,null,"Zbývající výška do hřebene",{"$f":"$D$14-F90","v":3.6599999999999913},"[m]"]
[null,null,"Počet uskočených pater",{"$f":"IF(D91<11,ROUNDDOWN((D91)/2.6,0),ROUNDDOWN((D91)/2.6,0))","v":1},{"$f":"IF(D92=1,\"patro\",IF(D92<=4,\"patra\",\"pater\"))","v":"patro"}]
[null,null,"Rozdíl výšky okapu a nejbližšího patra",{"$f":"$J$4-(INDEX(M27:M39,D90))","v":3.6599999999999913},"[m]"]
[null,null,"Rozdíl výšek na 3 m sestavu",{"$f":"$N$5*$E$73","v":0},"[m]"]
[null,{"$f":"IF($D$92>=1,1,\"\")","v":1},"První sestava",{"$f":"D93+D94","v":3.6599999999999913},"[m]",{"$f":"IF(D$95<=2,\"posoudit další\",IF(D$95<=3.2,\"ponechat\",\"pokračuje patrem\"))","v":"pokračuje patrem"}]
[null,{"$f":"IF(1<=$D$92,2,\"X\")","v":2},"Druhá sestava",{"$f":"IF(F95=\"ponechat\",$D$93+$D$94*B96,$D$93+$D$94*B96-2)","v":1.6599999999999913},"[m]",{"$f":"IF(D96<2,\"posoudit další\",IF(D96<=3.2,\"ponechat\",IF(D96>3.2,\"pokračuje patrem\",\"\")))","v":"posoudit další"}]
[null,{"$f":"IF(2<=$D$92,3,\"X\")","v":"X"},"Třetí sestava",{"$f":"IF(F96=\"ponechat\",$D$93+$D$94*B97,$D$93+$D$94*B97-2)","v":{"$error":"#VALUE!"}},"[m]",{"$f":"IF(D97<2,\"posoudit další\",IF(D97<=3.2,\"ponechat\",IF(D97>3.2,\"pokračuje patrem\",\"\")))","v":{"$error":"#VALUE!"}}]
[null,{"$f":"IF(3<=$D$92,4,\"X\")","v":"X"},"Čtvrtá sestava",{"$f":"IF(F97=\"ponechat\",$D$93+$D$94*B98,$D$93+$D$94*B98-2)","v":{"$error":"#VALUE!"}},"[m]",{"$f":"IF(D98<2,\"posoudit další\",IF(D98<=3.2,\"ponechat\",IF(D98>3.2,\"pokračuje patrem\",\"\")))","v":{"$error":"#VALUE!"}}]
[]
[]
[]
[]
[null,null,"NAKLÁDACÍ LIST"]
[]
[null,null,"stavitelná patka 0,5m","počet kusů"]
[null,null,"stavitelná patka 1m",{"$f":"IF(D107>=0,($D$73+$D$74+$D$75)*2+2-D107,($D$73+$D$74+$D$75)*2+2)","v":14}]
[null,null,"rám 2m",2]
[null,null,"rám 1m",{"$f":"(($D$73+$D$74+$D$75)+1)*$D$87","v":40}]
[null,null,"podlaha 3m",{"$f":"IF(D85>=1,($D$73+$D$74+$D$75)+1,0)","v":0}]
[null,null,"podlaha 2m",{"$f":"(D73*D87-$D112)*2","v":60}]
[null,null,"průlezová podlaha 3m",{"$f":"D74*D87","v":0}]
[null,null,"zábradlí 3m",{"$f":"D87","v":5}]
[null,null,"zábradlí 2m",{"$f":"(1+$D$87*2)*D73","v":77}]
[null,null,"diagonální úchyt",{"$f":"(1+$D$87*2)*D74","v":0}]
[null,null,"diagonála 3m"]
[null,null,"diagonála 2m",{"$f":"$D$87*(ROUNDUP((D73+D74+D75)/4,0))","v":10}]
[null,null,"kotva 0,5 m",{"$f":"IF(D116=0,$D$87*ROUNDUP(D74/4,0),0)","v":0}]
[null,null,"kotva dlouhá 1 m",{"$f":"(($D$87-1)*SUM(D73:D75))/2","v":14}]
[null,null,"eLko / sloupek"]
[null,null,"eLko 2 m",{"$f":"SUM(D73:D75)+1","v":8}]
[null,null,"Háčko"]
[null,null,"boční zábradlí"]
[null,null,"okopové prkno 3m",{"$f":"D87*2","v":10}]
[null,null,"okopové prkno 2m",{"$f":"D73*D87","v":35}]
[null,null,"konzola",{"$f":"D74*D87","v":0}]
[null,null,"pevna spojka"]
[null,null,"otočná spojka"]
[null,null,"závlačná spojka"]

{"sheet":"stěna F","index":7,"n_rows":128,"n_cols":34,"rows_kept":128,"cut":false,"hidden":false,"merged":[[0,4,1,6],[2,28,2,30],[2,31,2,33],[3,21,4,22],[3,23,4,23],[3,24,4,24],[3,25,4,25],[42,20,42,21],[42,22,42,23],[42,24,42,25],[42,26,42,27],[43,8,43,9],[43,10,43,11],[43,12,43,13],[43,14,43,15],[43,16,43,17],[43,18,43,19],[42,8,42,9],[42,10,42,11],[42,12,42,13],[42,14,42,15],[42,16,42,17],[42,18,42,19],[43,20,43,21],[43,22,43,23],[43,24,43,25],[43,26,43,27],[47,8,47,9],[47,10,47,11],[47,12,47,13],[47,14,47,15],[47,16,47,17],[47,18,47,19],[89,0,93,0],[47,20,47,21],[47,22,47,23],[47,24,47,25],[47,26,47,27],[70,3,70,4],[81,0,84,0]]}
[null,null,"Stěna F","Výkres:",null,null,null,"Data grafu:"]
[null,null,"Nastavení parametrů výpočtu:",null,null,null,null,null,"Tvar střechy",null,"Tvar terénu",null,"úhel alfa",null,null,null,null,null,null,null,null,"NAKLÁDACÍ LIST:",null,{"$f":"$C$1","v":"Stěna F"},{"$f":"IF(AD6=0,\"(BUDE NAKLÁDÁNO POUZE AUTO)\",\"\")","v":"(BUDE NAKLÁDÁNO POUZE AUTO)"},null,null,"VYTÍŽENOST ODVOZNÍHO PROSTŘEDKU:"]
[null,null,"Terén: absolutní výška (±0,00 = svislice od hřebene střechy na terén)",null,null,null,null,null,"osa x","osa y","osa x","osa y","tg A",{"$f":"($D$14-$J$4)/($D$12/2)","v":0},null,null,null,null,null,null,null,"obestavběná plocha lešení [m2]",null,null,{"$f":"IF(K41>=1,SUM(I48,K48,M48,O48,Q48,S48,U48,W48,Y48,AA48)+SUM(I44,K44,M44,O44,Q44,S44,U44,W44,Y44,AA44)*2+SUM(I44,K44,M44,O44,Q44,S44,U44,W44,Y44,AA44),SUM(I48,K48,M48,O48,Q48,S48,U48,W48,Y48,AA48)+SUM(I44,K44,M44,O44,Q44,S44,U44,W44,Y44,AA44)*2)","v":36},"[m2]",null,"[kg]","1. cesta",null,null,"2.cesta"]
[null,"→","Výška terénu v levém rohu [m]",0,"[m]",null,null,"vlevo",0,{"$f":"IF($D$13=Data_podpora!$B$9,$D$14,$D$15+$D$4)","v":11.759999999999991},0,{"$f":"$D$4","v":0},"A",{"$f":"DEGREES(ATAN(N3))","v":0},null,null,null,null,null,null,null,"Komponenta",null,"počet kusů [ks]","jednotková hmotnost [kg/ks]","hmotnost [kg]",null,null,"KAPACITA","VYUŽITO","Zbývá","KAPACITA","VYUŽITO","ZBÝVÁ"]
[null,"→","Výška terénu v pravém rohu [m]",0,"[m]",null,null,"max",{"$f":"$D$9","v":0},{"$f":"IF($D$12/2<I5,-$N$3*I5+$J$4+$N$3*$D$12,$N$3*I5+$J$4)","v":11.759999999999991},{"$f":"$D$9","v":0},{"$f":"$D$8","v":0},"tg A",{"$f":"TAN(RADIANS($N$4))","v":0},null,null,null,null,null,null,null,null,null,null,null,null,null,"AUTO",2500,{"$f":"IF(Z30<=AC5,SUM(Z6:Z29),SUM(Z6:Z9,Z26:Z29,Z15:Z23,Z13/2,Z14/2))","v":554.54999999999995},{"$f":"IF((AC5-AD5)<=0,0,AC5-AD5)","v":1945.45},2500,{"$f":"IF(AC5-AD5<=0,-(AC5-AD5),0)","v":0},{"$f":"AF5-AG5","v":2500}]
[null,"→","Výška nejnižšího bodu terénu [m]",0,"[m]",null,null,"min",{"$f":"$D$7","v":0},{"$f":"IF($D$12/2>I6,$N$3*I6+$J$4,-$N$3*I6+$J$4+$N$3*$D$12)","v":11.759999999999991},{"$f":"$D$7","v":0},{"$f":"$D$6","v":0},"sklon",{"$f":"$N$5","v":0},null,null,null,null,null,null,null,"stavitelná patka 0,5m",null,{"$f":"IF(X7>0,(COUNT(I46:AB46)+2)-X7,(COUNT(I46:AB46)+2))","v":4},3.1,{"$f":"Y7*X6","v":18.8},null,"ZÁVĚS",3500,{"$f":"IF(Z30<=AC5,0,SUM(Z10:Z12,Z24:Z25,Z13/2,Z14/2))","v":0},{"$f":"IF((AC6-AD6)<=0,0,AC6-AD6)","v":3500},3500,{"$f":"IF(AC6-AD6<=0,-(AC6-AD6),0)","v":0},{"$f":"AF6-AG6","v":3500}]
[null,"→","Místo nejnižšího bodu (zleva) [m]",0,"[m]",null,null,"top",{"$f":"$D$12/2","v":1.125},{"$f":"$D$14","v":11.759999999999991},{"$f":"$D$12/2","v":1.125},{"$f":"0","v":0},null,null,null,null,null,null,null,null,null,"stavitelná patka 1m",null,0,4.7,{"$f":"Y9*X7","v":0}]
[null,"→","Výška nejvyššího bodu terénu [m]",0,"[m]",null,null,"vpravo",{"$f":"$D$12","v":2.25},{"$f":"$J$4","v":11.759999999999991},{"$f":"$D$12","v":2.25},{"$f":"$D$5","v":0},null,null,null,null,null,null,null,null,null,"rám 2m",null,{"$f":"IF(X9>0,SUM(J46-I46,L46-K46,N46-M46,P46-O46,R46-Q46,T46-S46,V46-U46,X46-W46,Z46-Y46,AB46-AA46)+MIN(J46-I46,L46-K46,N46-M46,P46-O46,R46-Q46,T46-S46,V46-U46,X46-W46,Z46-Y46,AB46-AA46)+MAX(J46-I46,L46-K46,N46-M46,P46-O46,R46-Q46,T46-S46,V46-U46,X46-W46,Z46-Y46,AB46-AA46)-MIN(J46-I46,L46-K46,N46-M46,P46-O46,R46-Q46,T46-S46,V46-U46,X46-W46,Z46-Y46,AB46-AA46)-X9,SUM(J46-I46,L46-K46,N46-M46,P46-O46,R46-Q46,T46-S46,V46-U46,X46-W46,Z46-Y46,AB46-AA46)+MIN(J46-I46,L46-K46,N46-M46,P46-O46,R46-Q46,T46-S46,V46-U46,X46-W46,Z46-Y46,AB46-AA46)+MAX(J46-I46,L46-K46,N46-M46,P46-O46,R46-Q46,T46-S46,V46-U46,X46-W46,Z46-Y46,AB46-AA46)-MIN(J46-I46,L46-K46,N46-M46,P46-O46,R46-Q46,T46-S46,V46-U46,X46-W46,Z46-Y46,AB46-AA46))","v":10},16.5,{"$f":"Y8*X8","v":165}]
[null,"→","Místo nejvyššího bodu (zleva) [m]",0,"[m]",null,null,null,null,null,null,null,null,null,null,null,null,null,null,null,null,"rám 1m",null,0,11.3,0]
[null,null,null,null,null,null,null,null,"Tvar střechy",null,"Tvar terénu",null,"úhel alfa",null,null,null,null,null,null,null,null,"podlaha 3m",null,{"$f":"((IF(I44=3,J46-I46,0)+IF(K44=3,L46-K46,0)+IF(M44=3,N46-M46,0)+IF(O44=3,P46-O46,0)+IF(Q44=3,R46-Q46,0)+IF(S44=3,T46-S46,0)+IF(U44=3,V46-U46,0)+IF(W44=3,X46-W46,0)+IF(Y44=3,Z46-Y46,0)+IF(AA44=3,AB46-AA46,0))-X12)*2","v":0},22,0]
[null,null,"Střecha:",null,null,null,null,null,"osa x","osa y","osa x","osa y","tg A",{"$f":"($D$14-$J$4)/($D$17)","v":{"$error":"#DIV/0!"}},null,null,null,null,null,null,null,"podlaha 2m",null,{"$f":"(IF(I44=2,J46-I46,0)+IF(K44=2,L46-K46,0)+IF(M44=2,N46-M46,0)+IF(O44=2,P46-O46,0)+IF(Q44=2,R46-Q46,0)+IF(S44=2,T46-S46,0)+IF(U44=2,V46-U46,0)+IF(W44=2,X46-W46,0)+IF(Y44=2,Z46-Y46,0)+IF(AA44=2,AB46-AA46,0))*2","v":0},14.5,0]
[null,null,"Délka strany [m]",{"$f":"Půdorys!C10","v":2.25},"[m]",null,null,"vlevo",0,{"$f":"$D$15+$D$4","v":11.759999999999991},0,{"$f":"$D$4","v":0},"A",{"$f":"DEGREES(ATAN(N11))","v":{"$error":"#DIV/0!"}},null,null,null,null,null,null,null,"průlezová podlaha 3m",null,{"$f":"MAX(J46:AB46)","v":5},28,140]
[null,"→","Tvar střechy:","sedlová",null,null,null,"max",{"$f":"$D$9","v":0},{"$f":"IF($I$17<I13,-$N$3*I13+$J$4+$N$11*$D$12,IF(I13<$I$14,$N$11*I13+$J$4,J14))","v":{"$error":"#DIV/0!"}},{"$f":"$D$9","v":0},{"$f":"$D$8","v":0},"tg A",{"$f":"TAN(RADIANS($N$12))","v":{"$error":"#DIV/0!"}},null,null,null,null,null,null,null,"zábradlí 3m",null,{"$f":"IF(I44=3,2*(J46-I46)+1,0)+IF(K44=3,2*(L46-K46)+1,0)+IF(M44=3,2*(N46-M46)+1,0)+IF(O44=3,2*(P46-O46)+1,0)+IF(Q44=3,2*(R46-Q46)+1,0)+IF(S44=3,2*(T46-S46)+1,0)+IF(U44=3,2*(V46-U46)+1,0)+IF(W44=3,2*(X46-W46)+1,0)+IF(Y44=3,2*(Z46-Y46)+1,0)+IF(AA44=3,2*(AB46-AA46)+1,0)","v":11},5.5,60.5]
[null,"→",{"$f":"IF('stěna F'!$D$13=Data_podpora!$B$9,\"Výška stěny [m]\",\"Výška uprostřed stěny [m]\")","v":"Výška uprostřed stěny [m]"},{"$f":"507.76-496","v":11.759999999999991},"[m]",null,null,"min",{"$f":"$D$7","v":0},{"$f":"IF($I$13>=I14,$N$11*I14+$J$4,IF(I14<=$I$16,J12,-$N$11*I14+$J$12+$N$11*$D$12))","v":{"$error":"#DIV/0!"}},{"$f":"$D$7","v":0},{"$f":"$D$6","v":0},"sklon",{"$f":"$N$13","v":{"$error":"#DIV/0!"}},null,null,null,null,null,null,null,"zábradlí 2m",null,{"$f":"IF(I44=2,2*(J46-I46)+1,0)+IF(K44=2,2*(L46-K46)+1,0)+IF(M44=2,2*(N46-M46)+1,0)+IF(O44=2,2*(P46-O46)+1,0)+IF(Q44=2,2*(R46-Q46)+1,0)+IF(S44=2,2*(T46-S46)+1,0)+IF(U44=2,2*(V46-U46)+1,0)+IF(W44=2,2*(X46-W46)+1,0)+IF(Y44=2,2*(Z46-Y46)+1,0)+IF(AA44=2,2*(AB46-AA46)+1,0)","v":0},3.5,0]
[null,{"$f":"IF($D$13=Data_podpora!B9,\"\",\"→\")","v":"→"},{"$f":"IF($D$13=Data_podpora!$B$9,\"\",\"Výška od terénu k okapu (levý) [m]\")","v":"Výška od terénu k okapu (levý) [m]"},{"$f":"507.76-496","v":11.759999999999991},{"$f":"IF($D$13=Data_podpora!$B$9,\"\",\"[m]\")","v":"[m]"},null,null,"polov1",{"$f":"$D$17","v":0},{"$f":"$D$14","v":11.759999999999991},{"$f":"$D$17","v":0},{"$f":"$D$18","v":0},null,null,null,null,null,null,null,null,null,"diagonální úchyt",null,{"$f":"X16/MAX(I46:AB46)","v":1},0.5,0.5]
[null,null,{"$f":" IF(D13=Data_podpora!B10,\"Upřesňující parametry pro polovalbovou střechu:\",\"\")","v":""},null,null,null,null,"top",{"$f":"$D$12/2","v":1.125},{"$f":"$D$14","v":11.759999999999991},{"$f":"$D$12/2","v":1.125},{"$f":"0","v":0},null,null,null,null,null,null,null,null,null,"diagonála 3m",null,{"$f":"MAX(J46-I46,L46-K46,N46-M46,P46-O46,R46-Q46,T46-S46,V46-U46,X46-W46,Z46-Y46,AB46-AA46)*ROUNDUP((IF(I44=3,I44,0)+IF(K44=3,K44,0)+IF(M44=3,M44,0)+IF(O44=3,O44,0)+IF(Q44=3,Q44,0)+IF(S44=3,S44,0)+IF(U44=3,U44,0)+IF(W44=3,W44,0)+IF(Y44=3,Y44,0)+IF(AA44=3,AA44,0))/20,0)","v":5},11,55]
[null,{"$f":"IF($D$13=Data_podpora!$B$10,'stěna F'!$B$15,\"\")","v":""},{"$f":"IF($D$13=Data_podpora!$B$10,\"Místo polovalby [m]\",\"\")","v":""},null,{"$f":"IF($D$13=Data_podpora!$B$10,\"[m]\",\"\")","v":""},null,null,"polov2",{"$f":"$D$12-$D$17","v":2.25},{"$f":"$D$14","v":11.759999999999991},{"$f":"$D$12-$D$17","v":2.25},{"$f":"$D$19","v":0},null,null,null,null,null,null,null,null,null,"diagonála 2m",null,{"$f":"IF(X16=0,MAX(J46-I46,L46-K46,N46-M46,P46-O46,R46-Q46,T46-S46,V46-U46,X46-W46,Z46-Y46,AB46-AA46)*ROUNDUP((IF(I44=2,I44,0)+IF(K44=2,K44,0)+IF(M44=2,M44,0)+IF(O44=2,O44,0)+IF(Q44=2,Q44,0)+IF(S44=2,S44,0)+IF(U44=2,U44,0)+IF(W44=2,W44,0)+IF(Y44=2,Y44,0)+IF(AA44=2,AA44,0))/12,0),0)","v":0},8,0]
[null,{"$f":"IF($D$13=Data_podpora!$B$10,'stěna F'!$B$15,\"\")","v":""},{"$f":"IF($D$13=Data_podpora!$B$10,\"Výška terénu v místě levé polovalby [m]\",\"\")","v":""},null,{"$f":"IF($D$13=Data_podpora!$B$10,\"[m]\",\"\")","v":""},null,null,"vpravo",{"$f":"$D$12","v":2.25},{"$f":"$J$4","v":11.759999999999991},{"$f":"$D$12","v":2.25},{"$f":"$D$5","v":0},null,null,null,null,null,null,null,null,null,"kotva 0,5 m",null,{"$f":"IF(X19=0,ROUNDUP(X8*0.45,0),ROUNDUP(X8*0.45,0)-X19)","v":5},2,10]
[null,{"$f":"IF($D$13=Data_podpora!$B$10,'stěna F'!$B$15,\"\")","v":""},{"$f":"IF($D$13=Data_podpora!$B$10,\"Výška terénu v místě pravé polovalby [m]\",\"\")","v":""},null,{"$f":"IF($D$13=Data_podpora!$B$10,\"[m]\",\"\")","v":""},null,null,null,null,null,null,null,null,null,null,null,null,null,null,null,null,"kotva dlouhá 1 m",null,0,3.8,0]
[null,null,null,null,null,null,null,"Patra lešení",null,null,null,null,null,null,null,null,null,null,null,null,null,"eLko / sloupek",null,{"$f":"IF(X22=0,COUNT(J46,L46,N46,P46,R46,T46,V46,X46,Z46,AB46)+1,(COUNT(J46,L46,N46,P46,R46,T46,V46,X46,Z46,AB46)+1)-X22)","v":2},5,10]
[null,null,null,null,null,null,null,null,null,null,null,null,null,null,null,null,null,null,null,null,null,"eLko 2 m",null,null,11.5,0]
[null,{"$f":"IF($D$21=Data_podpora!B30,\"→\",\"\")","v":""},{"$f":"IF(D21=Data_podpora!B30,\"Vzdálenost od levého rohu [m]\",\"\")","v":""},null,{"$f":"IF(D21=Data_podpora!B30,\"[m]\",\"\")","v":""},null,null,"-0,5",{"$f":"I26-1","v":-0.9},{"$f":"J26-1","v":-0.9},{"$f":"K26-1","v":-0.9},{"$f":"L26-1","v":-0.9},{"$f":"M26-1","v":-0.9},null,null,null,null,null,null,null,null,"Háčko",null,{"$f":"2*(MAX(I46:AB46)-MIN(J46,L46,N46,P46,R46,T46,V46,X46,Z46,AB46))","v":0},9.6999999999999993,0]
[null,{"$f":"IF($D$21=Data_podpora!$B$30,\"→\",\"\")","v":""},{"$f":"IF(D21=Data_podpora!B30,\"Výška od terénu (zleva) [m]\",\"\")","v":""},null,{"$f":"IF(D21=Data_podpora!B30,\"[m]\",\"\")","v":""},null,null,"-3",{"$f":"I24-2","v":-5.9},-5.9,-5.9,-5.9,-5.9,null,null,null,null,null,null,null,null,"boční zábradlí",null,{"$f":"IF(X22=0,(MAX(J46-I46,L46-K46,N46-M46,P46-O46,R46-Q46,T46-S46,V46-U46,X46-W46,Z46-Y46,AB46-AA46)+1)*2,(MAX(J46-I46,L46-K46,N46-M46,P46-O46,R46-Q46,T46-S46,V46-U46,X46-W46,Z46-Y46,AB46-AA46)+1)*2-X22)","v":12},3,36]
[null,{"$f":"IF($D$21=Data_podpora!$B$30,\"→\",\"\")","v":""},{"$f":"IF(D21=Data_podpora!B30,\"Šířka [m]\",\"\")","v":""},null,{"$f":"IF(D21=Data_podpora!B30,\"[m]\",\"\")","v":""},null,null,"-2",-3.9,-3.9,-3.9,-3.9,-3.9,null,null,null,null,null,null,null,null,"okopové prkno 3m",null,{"$f":"IF(I44=3,J46-I46,0)+IF(K44=3,L46-K46,0)+IF(M44=3,N46-M46,0)+IF(O44=3,P46-O46,0)+IF(Q44=3,R46-Q46,0)+IF(S44=3,T46-S46,0)+IF(U44=3,V46-U46,0)+IF(W44=3,X46-W46,0)+IF(Y44=3,Z46-Y46,0)+IF(AA44=3,AB46-AA46,0)","v":5},6.5,32.5]
[null,null,null,null,null,null,null,"-1",{"$f":"I26-2","v":-1.9},{"$f":"$D$85-2","v":-1.9},{"$f":"$D$85-2","v":-1.9},{"$f":"$D$85-2","v":-1.9},{"$f":"$D$85-2","v":-1.9},null,null,null,null,null,null,null,null,"okopové prkno 2m",null,{"$f":"IF(I44=2,J46-I46,0)+IF(K44=2,L46-K46,0)+IF(M44=2,N46-M46,0)+IF(O44=2,P46-O46,0)+IF(Q44=2,R46-Q46,0)+IF(S44=2,T46-S46,0)+IF(U44=2,V46-U46,0)+IF(W44=2,X46-W46,0)+IF(Y44=2,Z46-Y46,0)+IF(AA44=2,AB46-AA46,0)","v":0},4.5,0]
[null,null,null,null,null,null,null,"0",{"$f":"$K$41","v":0.1},{"$f":"$K$41","v":0.1},{"$f":"$K$41","v":0.1},{"$f":"$K$41","v":0.1},{"$f":"$K$41","v":0.1},null,null,null,null,null,null,null,null,"konzola",null,null,10,0]
[null,null,null,null,null,null,null,"1",{"$f":"I26+$D$86","v":2.1},{"$f":"J26+$D$86","v":2.1},{"$f":"K26+$D$86","v":2.1},{"$f":"L26+$D$86","v":2.1},{"$f":"M26+$D$86","v":2.1},null,null,null,null,null,null,null,null,"pevna spojka",null,{"$f":"J46*2","v":10},1.1499999999999999,11.5]
[null,null,null,null,null,null,null,"2",4.0999999999999996,4.0999999999999996,4.0999999999999996,4.0999999999999996,4.0999999999999996,null,null,null,null,null,null,null,null,"otočná spojka",null,{"$f":"J46","v":5},1.35,6.75]
[null,null,null,null,null,null,null,"3",6.1,6.1,6.1,6.1,6.1,null,null,null,null,null,null,null,null,"závlačná spojka",null,{"$f":"J46*2","v":10},0.8,8]
[null,null,null,null,null,null,null,"4",8.1,8.1,8.1,8.1,8.1,null,null,null,null,null,null,null,null,"CELKOVÁ HMOTNOST [kg]",null,null,null,{"$f":"SUM(Z6:Z29)","v":554.54999999999995}]
[null,null,null,null,null,null,null,"5",10.1,10.1,10.1,10.1,10.1]
[null,null,null,null,null,null,null,"6",12.1,12.1,12.1,12.1,12.1]
[null,null,null,null,null,null,null,"7",14.1,14.1,14.1,14.1,14.1]
[null,null,null,null,null,null,null,"8",16.100000000000001,16.100000000000001,16.100000000000001,16.100000000000001,16.100000000000001]
[null,null,null,null,null,null,null,"9",18.100000000000001,18.100000000000001,18.100000000000001,18.100000000000001,18.100000000000001]
[null,null,null,null,null,null,null,"10",20.100000000000001,20.100000000000001,20.100000000000001,20.100000000000001,20.100000000000001]
[null,null,null,null,null,null,null,"11",22.1,22.1,22.1,22.1,22.1]
[null,null,null,null,null,null,null,"12",24.1,24.1,24.1,24.1,24.1]
[null,null,null,null,null,null,null,"13",26.1,26.1,26.1,26.1,26.1]
[]
[null,null,null,null,null,null,null,"LEŠENÍ","výška založení [m]",null,{"$f":"D8+0.1","v":0.1},"[m]","nepsat nuly v kolonce \"patro\",pokud není sestava lešení využita",null,null,null,null,null,"Poznámka:",{"$f":"IF(Půdorys!I10=0,\"\",Půdorys!I10)","v":""}]
[null,null,null,null,null,null,null,null,"ZALOŽENÍ","VÝŠKA P.P.","ZALOŽENÍ","VÝŠKA P.P.","ZALOŽENÍ","VÝŠKA P.P.","ZALOŽENÍ","VÝŠKA P.P.","ZALOŽENÍ","VÝŠKA P.P.","ZALOŽENÍ","VÝŠKA P.P.","ZALOŽENÍ","VÝŠKA P.P.","ZALOŽENÍ","VÝŠKA P.P.","ZALOŽENÍ","VÝŠKA P.P.","ZALOŽENÍ","VÝŠKA P.P."]
[null,null,null,null,null,null,null,"SESTAVA",1,null,2,null,3,null,4,null,5,null,6,null,7,null,8,null,9,null,10]
[null,null,null,null,null,null,null,"DÉLKA SESTAVY",3,null,0,null,0,null,0,null,0,null,0,null,0,null,0,null,0,null,0]
[null,null,null,null,null,null,null,"\"potvrdit\""]
[null,null,null,null,null,null,null,"PATRO",0,5]
[null,null,null,null,null,null,null,"POSUN"]
[null,null,null,null,null,null,null,"plocha [m2]",{"$f":"(J46-I46)*$D$86*I44","v":30},null,{"$f":"L46*$D$86*K44","v":0},null,{"$f":"N46*$D$86*M44","v":0},null,{"$f":"P46*$D$86*O44","v":0},null,{"$f":"R46*$D$86*Q44","v":0},null,{"$f":"T46*$D$86*S44","v":0},null,{"$f":"V46*$D$86*U44","v":0},null,{"$f":"X46*$D$86*W44","v":0},null,{"$f":"Z46*$D$86*Y44","v":0},null,{"$f":"AB46*$D$86*AA44","v":0}]
[null,null,null,null,null,null,null,"výška",{"$f":"IF(I46=-0.5,M22,INDEX($M$23:$M$39,I46+4))","v":0.1},{"$f":"INDEX($M$23:$M$39,J46+4)","v":10.1},{"$f":"IF(K46=-0.5,M22,INDEX($M$23:$M$39,K46+4))","v":0.1},{"$f":"INDEX($M$23:$M$39,L46+4)","v":0.1},{"$f":"IF(M46=-0.5,M22,INDEX($M$23:$M$39,M46+4))","v":0.1},{"$f":"INDEX($M$23:$M$39,N46+4)","v":0.1},{"$f":"IF(O46=-0.5,M22,INDEX($M$23:$M$39,O46+4))","v":0.1},{"$f":"INDEX($M$23:$M$39,P46+4)","v":0.1},{"$f":"IF(Q46=-0.5,M22,INDEX($M$23:$M$39,Q46+4))","v":0.1},{"$f":"INDEX($M$23:$M$39,R46+4)","v":0.1},{"$f":"IF(S46=-0.5,M22,INDEX($M$23:$M$39,S46+4))","v":0.1},{"$f":"INDEX($M$23:$M$39,T46+4)","v":0.1},{"$f":"IF(U46=-0.5,M22,INDEX($M$23:$M$39,U46+4))","v":0.1},{"$f":"INDEX($M$23:$M$39,V46+4)","v":0.1},{"$f":"IF(W46=-0.5,M22,INDEX($M$23:$M$39,W46+4))","v":0.1},{"$f":"INDEX($M$23:$M$39,X46+4)","v":0.1},{"$f":"IF(Y46=-0.5,M22,INDEX($M$23:$M$39,Y46+4))","v":0.1},{"$f":"INDEX($M$23:$M$39,Z46+4)","v":0.1},{"$f":"IF(AA46=-0.5,M22,INDEX($M$23:$M$39,AA46+4))","v":0.1},{"$f":"INDEX($M$23:$M$39,AB46+4)","v":0.1}]
[]
[]
[]
[]
[]
[null,null,null,null,null,null,null,-1]
[null,null,null,null,null,null,null,0,{"$f":"$I$49","v":0.1},{"$f":"$J$49","v":10.1}]
[null,null,null,null,null,null,null,1,{"$f":"$I$49","v":0.1},{"$f":"$J$49","v":10.1}]
[null,null,null,null,null,null,null,2,{"$f":"$I$49","v":0.1},{"$f":"$J$49","v":10.1},{"$f":"$K$49","v":0.1},{"$f":"$L$49","v":0.1}]
[null,null,null,null,null,null,null,3,{"$f":"$I$49","v":0.1},{"$f":"$J$49","v":10.1},{"$f":"$K$49","v":0.1},{"$f":"$L$49","v":0.1}]
[null,null,null,null,null,null,null,4,null,null,{"$f":"$K$49","v":0.1},{"$f":"$L$49","v":0.1}]
[null,null,null,null,null,null,null,5,null,null,{"$f":"$K$49","v":0.1},{"$f":"$L$49","v":0.1},{"$f":"$M$49","v":0.1},{"$f":"$N$49","v":0.1}]
[null,null,null,null,null,null,null,6,null,null,null,null,{"$f":"$M$49","v":0.1},{"$f":"$N$49","v":0.1}]
[null,null,null,null,null,null,null,7,null,null,null,null,{"$f":"$M$49","v":0.1},{"$f":"$N$49","v":0.1}]
[null,null,null,null,null,null,null,8,null,null,null,null,{"$f":"$M$49","v":0.1},{"$f":"$N$49","v":0.1},{"$f":"$O$49","v":0.1},{"$f":"$P$49","v":0.1}]
[null,null,null,null,null,null,null,9,null,null,null,null,null,null,{"$f":"$O$49","v":0.1},{"$f":"$P$49","v":0.1}]
[null,null,null,null,null,null,null,10,null,null,null,null,null,null,{"$f":"$O$49","v":0.1},{"$f":"$P$49","v":0.1}]
[null,null,null,null,null,null,null,11,null,null,null,null,null,null,{"$f":"$O$49","v":0.1},{"$f":"$P$49","v":0.1},{"$f":"$Q$49","v":0.1},{"$f":"$R$49","v":0.1}]
[null,null,null,null,null,null,null,12,null,null,null,null,null,null,null,null,{"$f":"$Q$49","v":0.1},{"$f":"$R$49","v":0.1}]
[null,null,"Pomocný výpočet počtu sestav lešení:",null,null,null,null,13,null,null,null,null,null,null,null,null,{"$f":"$Q$49","v":0.1},{"$f":"$R$49","v":0.1}]
[null,null,"Délka:",null,null,null,null,14,null,null,null,null,null,null,null,null,{"$f":"$Q$49","v":0.1},{"$f":"$R$49","v":0.1},{"$f":"$S$49","v":0.1},{"$f":"$T$49","v":0.1}]
[null,null,"přesah za roh objektu:","Ne",null,null,null,15,null,null,null,null,null,null,null,null,null,null,{"$f":"$S$49","v":0.1},{"$f":"$T$49","v":0.1}]
[null,null,"Požadovaná minimální délka lešení [m]",{"$f":"IF(D71=Data_podpora!B17,'stěna F'!D12+2,IF('stěna F'!D71=Data_podpora!B14,'stěna F'!D12+0.5,IF(D71=Data_podpora!B13,'stěna F'!D12,'stěna F'!D12+1)))","v":2.25},"[m]",null,null,16,null,null,null,null,null,null,null,null,null,null,{"$f":"$S$49","v":0.1},{"$f":"$T$49","v":0.1}]
[null,null,"Počet sestav lešení (3m) [-]",{"$f":"ROUNDDOWN(D72/E73,0)","v":0},"3",{"$f":"D73*E73","v":0},"[m]",17,null,null,null,null,null,null,null,null,null,null,{"$f":"$S$49","v":0.1},{"$f":"$T$49","v":0.1},{"$f":"$U$49","v":0.1},{"$f":"$V$49","v":0.1}]
[null,null,"Počet sestav lešení (2m) [-]",{"$f":"ROUNDDOWN(MOD(D72,E73)/E74,0)","v":1},"2",{"$f":"D74*E74","v":2},"[m]",18,null,null,null,null,null,null,null,null,null,null,null,null,{"$f":"$U$49","v":0.1},{"$f":"$V$49","v":0.1}]
[null,null,"Počet sestav lešení (0,75m) [-]",{"$f":"ROUNDUP(D72-(D73*E73+D74*E74),0)","v":1},"0,75",{"$f":"D75*E75","v":0.75},"[m]",19,null,null,null,null,null,null,null,null,null,null,null,null,{"$f":"$U$49","v":0.1},{"$f":"$V$49","v":0.1}]
[null,null,"Reálná délka lešení [m]",{"$f":"D73*E73+D74*E74+D75*E75","v":2.75},"[m]",null,null,20,null,null,null,null,null,null,null,null,null,null,null,null,{"$f":"$U$49","v":0.1},{"$f":"$V$49","v":0.1}]
[null,null,null,null,null,null,null,21,null,null,null,null,null,null,null,null,null,null,null,null,null,null,{"$f":"$W$49","v":0.1},{"$f":"$X$49","v":0.1}]
[null,null,"Výška:",null,null,null,null,22,null,null,null,null,null,null,null,null,null,null,null,null,null,null,{"$f":"$W$49","v":0.1},{"$f":"X77","v":0.1}]
[null,null,"Lešení pro:","Fasádu",null,null,null,23,null,null,null,null,null,null,null,null,null,null,null,null,null,null,{"$f":"$W$49","v":0.1},{"$f":"X78","v":0.1}]
[null,null,"Výška zábradlí posledního patra [m]",1,"[m]",null,null,24,null,null,null,null,null,null,null,null,null,null,null,null,null,null,{"$f":"$W$49","v":0.1},{"$f":"X79","v":0.1},{"$f":"$Y$49","v":0.1},{"$f":"$Z$49","v":0.1}]
[null,null,"Požadovaná výška [m]",{"$f":"IF(D79=Data_podpora!B22,'stěna F'!D14+D80,'stěna F'!D14)","v":11.759999999999991},"[m]",null,null,25,null,null,null,null,null,null,null,null,null,null,null,null,null,null,null,null,{"$f":"$Y$49","v":0.1},{"$f":"Z80","v":0.1}]
["Založení",null,"Výška nejnižžšího bodu terénu [m]",{"$f":"MIN(D4,D5,D6,D8)","v":0},"[m]",null,null,26,null,null,null,null,null,null,null,null,null,null,null,null,null,null,null,null,{"$f":"$Y$49","v":0.1},{"$f":"Z81","v":0.1}]
[null,null,"Výška nejvyššího  bodu terénu [m]",{"$f":"D8","v":0},"[m]",null,null,27,null,null,null,null,null,null,null,null,null,null,null,null,null,null,null,null,{"$f":"$Y$49","v":0.1},{"$f":"Z82","v":0.1},{"$f":"$AA$49","v":0.1},{"$f":"$AB$49","v":0.1}]
[null,null,"Rozdíl max a min [m]",{"$f":"D83-D82","v":0},"[m]",{"$f":"IF(D84<0.4,\"(Patky 0,4m)\",IF(D84<=1,\"(Patky 1m)\",IF(2>=D84>1,\"(Rám 1m)\",IF(5>D84>2,\"(Rám 2m)\",\"\"))))","v":"(Patky 0,4m)"},null,28,null,null,null,null,null,null,null,null,null,null,null,null,null,null,null,null,null,null,{"$f":"$AA$49","v":0.1},{"$f":"AB83","v":0.1}]
[null,"#","Výška založení [m]",{"$f":"D8+0.1","v":0.1},"[m]",null,null,29,null,null,null,null,null,null,null,null,null,null,null,null,null,null,null,null,null,null,{"$f":"$AA$49","v":0.1},{"$f":"AB84","v":0.1}]
[null,null,"Modulová výška patra lešení [m]",2,"[m]",null,null,30,null,null,null,null,null,null,null,null,null,null,null,null,null,null,null,null,null,null,{"$f":"$AA$49","v":0.1},{"$f":"AB85","v":0.1}]
[null,null,"Počet pater lešení [-]; výška [m])",{"$f":"IF(D81-D85<11,ROUNDDOWN((D81-D85)/2.15,0),ROUNDDOWN((D81-D85)/2.1,0))","v":5},"pater",{"$f":"INDEX(M27:M39,D87)","v":10.1},"[m]",31]
[null,null,"Reálná výška lešení [m]",{"$f":"D87*D86+D85+D80","v":11.1},"[m]"]
[]
["Uskočení pater","→","Hranice posouzení uskočení","4",null,{"$f":"INDEX(M27:M39,D90)","v":8.1},"[m]"]
[null,null,"Zbývající výška do hřebene",{"$f":"$D$14-F90","v":3.6599999999999913},"[m]"]
[null,null,"Počet uskočených pater",{"$f":"IF(D91<11,ROUNDDOWN((D91)/2.6,0),ROUNDDOWN((D91)/2.6,0))","v":1},{"$f":"IF(D92=1,\"patro\",IF(D92<=4,\"patra\",\"pater\"))","v":"patro"}]
[null,null,"Rozdíl výšky okapu a nejbližšího patra",{"$f":"$J$4-(INDEX(M27:M39,D90))","v":3.6599999999999913},"[m]"]
[null,null,"Rozdíl výšek na 3 m sestavu",{"$f":"$N$5*$E$73","v":0},"[m]"]
[null,{"$f":"IF($D$92>=1,1,\"\")","v":1},"První sestava",{"$f":"D93+D94","v":3.6599999999999913},"[m]",{"$f":"IF(D$95<=2,\"posoudit další\",IF(D$95<=3.2,\"ponechat\",\"pokračuje patrem\"))","v":"pokračuje patrem"}]
[null,{"$f":"IF(1<=$D$92,2,\"X\")","v":2},"Druhá sestava",{"$f":"IF(F95=\"ponechat\",$D$93+$D$94*B96,$D$93+$D$94*B96-2)","v":1.6599999999999913},"[m]",{"$f":"IF(D96<2,\"posoudit další\",IF(D96<=3.2,\"ponechat\",IF(D96>3.2,\"pokračuje patrem\",\"\")))","v":"posoudit další"}]
[null,{"$f":"IF(2<=$D$92,3,\"X\")","v":"X"},"Třetí sestava",{"$f":"IF(F96=\"ponechat\",$D$93+$D$94*B97,$D$93+$D$94*B97-2)","v":{"$error":"#VALUE!"}},"[m]",{"$f":"IF(D97<2,\"posoudit další\",IF(D97<=3.2,\"ponechat\",IF(D97>3.2,\"pokračuje patrem\",\"\")))","v":{"$error":"#VALUE!"}}]
[null,{"$f":"IF(3<=$D$92,4,\"X\")","v":"X"},"Čtvrtá sestava",{"$f":"IF(F97=\"ponechat\",$D$93+$D$94*B98,$D$93+$D$94*B98-2)","v":{"$error":"#VALUE!"}},"[m]",{"$f":"IF(D98<2,\"posoudit další\",IF(D98<=3.2,\"ponechat\",IF(D98>3.2,\"pokračuje patrem\",\"\")))","v":{"$error":"#VALUE!"}}]
[]
[]
[]
[]
[null,null,"NAKLÁDACÍ LIST"]
[]
[null,null,"stavitelná patka 0,5m","počet kusů"]
[null,null,"stavitelná patka 1m",{"$f":"IF(D107>=0,($D$73+$D$74+$D$75)*2+2-D107,($D$73+$D$74+$D$75)*2+2)","v":4}]
[null,null,"rám 2m",2]
[null,null,"rám 1m",{"$f":"(($D$73+$D$74+$D$75)+1)*$D$87","v":15}]
[null,null,"podlaha 3m",{"$f":"IF(D85>=1,($D$73+$D$74+$D$75)+1,0)","v":0}]
[null,null,"podlaha 2m",{"$f":"(D73*D87-$D112)*2","v":-10}]
[null,null,"průlezová podlaha 3m",{"$f":"D74*D87","v":5}]
[null,null,"zábradlí 3m",{"$f":"D87","v":5}]
[null,null,"zábradlí 2m",{"$f":"(1+$D$87*2)*D73","v":0}]
[null,null,"diagonální úchyt",{"$f":"(1+$D$87*2)*D74","v":11}]
[null,null,"diagonála 3m"]
[null,null,"diagonála 2m",{"$f":"$D$87*(ROUNDUP((D73+D74+D75)/4,0))","v":5}]
[null,null,"kotva 0,5 m",{"$f":"IF(D116=0,$D$87*ROUNDUP(D74/4,0),0)","v":0}]
[null,null,"kotva dlouhá 1 m",{"$f":"(($D$87-1)*SUM(D73:D75))/2","v":4}]
[null,null,"eLko / sloupek"]
[null,null,"eLko 2 m",{"$f":"SUM(D73:D75)+1","v":3}]
[null,null,"Háčko"]
[null,null,"boční zábradlí"]
[null,null,"okopové prkno 3m",{"$f":"D87*2","v":10}]
[null,null,"okopové prkno 2m",{"$f":"D73*D87","v":0}]
[null,null,"konzola",{"$f":"D74*D87","v":5}]
[null,null,"pevna spojka"]
[null,null,"otočná spojka"]
[null,null,"závlačná spojka"]

{"sheet":"stěna G","index":8,"n_rows":128,"n_cols":34,"rows_kept":128,"cut":false,"hidden":false,"merged":[[0,4,1,6],[2,28,2,30],[2,31,2,33],[3,21,4,22],[3,23,4,23],[3,24,4,24],[3,25,4,25],[42,20,42,21],[42,22,42,23],[42,24,42,25],[42,26,42,27],[43,8,43,9],[43,10,43,11],[43,12,43,13],[43,14,43,15],[43,16,43,17],[43,18,43,19],[42,8,42,9],[42,10,42,11],[42,12,42,13],[42,14,42,15],[42,16,42,17],[42,18,42,19],[43,20,43,21],[43,22,43,23],[43,24,43,25],[43,26,43,27],[47,8,47,9],[47,10,47,11],[47,12,47,13],[47,14,47,15],[47,16,47,17],[47,18,47,19],[89,0,93,0],[47,20,47,21],[47,22,47,23],[47,24,47,25],[47,26,47,27],[70,3,70,4],[81,0,84,0]]}
[null,null,"Stěna G","Výkres:",null,null,null,"Data grafu:"]
[null,null,"Nastavení parametrů výpočtu:",null,null,null,null,null,"Tvar střechy",null,"Tvar terénu",null,"úhel alfa",null,null,null,null,null,null,null,null,"NAKLÁDACÍ LIST:",null,{"$f":"$C$1","v":"Stěna G"},{"$f":"IF(AD6=0,\"(BUDE NAKLÁDÁNO POUZE AUTO)\",\"\")","v":""},null,null,"VYTÍŽENOST ODVOZNÍHO PROSTŘEDKU:"]
[null,null,"Terén: absolutní výška (±0,00 = svislice od hřebene střechy na terén)",null,null,null,null,null,"osa x","osa y","osa x","osa y","tg A",{"$f":"($D$14-$J$4)/($D$12/2)","v":-2.1316282072803005E-15},null,null,null,null,null,null,null,"obestavběná plocha lešení [m2]",null,null,{"$f":"IF(K41>=1,SUM(I48,K48,M48,O48,Q48,S48,U48,W48,Y48,AA48)+SUM(I44,K44,M44,O44,Q44,S44,U44,W44,Y44,AA44)*2+SUM(I44,K44,M44,O44,Q44,S44,U44,W44,Y44,AA44),SUM(I48,K48,M48,O48,Q48,S48,U48,W48,Y48,AA48)+SUM(I44,K44,M44,O44,Q44,S44,U44,W44,Y44,AA44)*2)","v":273},"[m2]",null,"[kg]","1. cesta",null,null,"2.cesta"]
[null,"→","Výška terénu v levém rohu [m]",{"$f":"498.8-497.5","v":1.3000000000000114},"[m]",null,null,"vlevo",0,{"$f":"IF($D$13=Data_podpora!$B$9,$D$14,$D$15+$D$4)","v":11.760000000000012},0,{"$f":"$D$4","v":1.3000000000000114},"A",{"$f":"DEGREES(ATAN(N3))","v":-1.2213329976819903E-13},null,null,null,null,null,null,null,"Komponenta",null,"počet kusů [ks]","jednotková hmotnost [kg/ks]","hmotnost [kg]",null,null,"KAPACITA","VYUŽITO","Zbývá","KAPACITA","VYUŽITO","ZBÝVÁ"]
[null,"→","Výška terénu v pravém rohu [m]",0,"[m]",null,null,"max",{"$f":"$D$9","v":0},{"$f":"IF($D$12/2<I5,-$N$3*I5+$J$4+$N$3*$D$12,$N$3*I5+$J$4)","v":11.760000000000012},{"$f":"$D$9","v":0},{"$f":"$D$8","v":1.3},"tg A",{"$f":"TAN(RADIANS($N$4))","v":-2.1316282072803005E-15},null,null,null,null,null,null,null,null,null,null,null,null,null,"AUTO",2500,{"$f":"IF(Z30<=AC5,SUM(Z6:Z29),SUM(Z6:Z9,Z26:Z29,Z15:Z23,Z13/2,Z14/2))","v":1196.2},{"$f":"IF((AC5-AD5)<=0,0,AC5-AD5)","v":1303.8},2500,{"$f":"IF(AC5-AD5<=0,-(AC5-AD5),0)","v":0},{"$f":"AF5-AG5","v":2500}]
[null,"→","Výška nejnižšího bodu terénu [m]",0,"[m]",null,null,"min",{"$f":"$D$7","v":5.5},{"$f":"IF($D$12/2>I6,$N$3*I6+$J$4,-$N$3*I6+$J$4+$N$3*$D$12)","v":11.76},{"$f":"$D$7","v":5.5},{"$f":"$D$6","v":0},"sklon",{"$f":"$N$5","v":-2.1316282072803005E-15},null,null,null,null,null,null,null,"stavitelná patka 0,5m",null,{"$f":"IF(X7>0,(COUNT(I46:AB46)+2)-X7,(COUNT(I46:AB46)+2))","v":16},3.1,{"$f":"Y7*X6","v":75.2},null,"ZÁVĚS",3500,{"$f":"IF(Z30<=AC5,0,SUM(Z10:Z12,Z24:Z25,Z13/2,Z14/2))","v":1899.25},{"$f":"IF((AC6-AD6)<=0,0,AC6-AD6)","v":1600.75},3500,{"$f":"IF(AC6-AD6<=0,-(AC6-AD6),0)","v":0},{"$f":"AF6-AG6","v":3500}]
[null,"→","Místo nejnižšího bodu (zleva) [m]",5.5,"[m]",null,null,"top",{"$f":"$D$12/2","v":10},{"$f":"$D$14","v":11.759999999999991},{"$f":"$D$12/2","v":10},{"$f":"0","v":0},null,null,null,null,null,null,null,null,null,"stavitelná patka 1m",null,0,4.7,{"$f":"Y9*X7","v":0}]
[null,"→","Výška nejvyššího bodu terénu [m]",1.3,"[m]",null,null,"vpravo",{"$f":"$D$12","v":20},{"$f":"$J$4","v":11.760000000000012},{"$f":"$D$12","v":20},{"$f":"$D$5","v":0},null,null,null,null,null,null,null,null,null,"rám 2m",null,{"$f":"IF(X9>0,SUM(J46-I46,L46-K46,N46-M46,P46-O46,R46-Q46,T46-S46,V46-U46,X46-W46,Z46-Y46,AB46-AA46)+MIN(J46-I46,L46-K46,N46-M46,P46-O46,R46-Q46,T46-S46,V46-U46,X46-W46,Z46-Y46,AB46-AA46)+MAX(J46-I46,L46-K46,N46-M46,P46-O46,R46-Q46,T46-S46,V46-U46,X46-W46,Z46-Y46,AB46-AA46)-MIN(J46-I46,L46-K46,N46-M46,P46-O46,R46-Q46,T46-S46,V46-U46,X46-W46,Z46-Y46,AB46-AA46)-X9,SUM(J46-I46,L46-K46,N46-M46,P46-O46,R46-Q46,T46-S46,V46-U46,X46-W46,Z46-Y46,AB46-AA46)+MIN(J46-I46,L46-K46,N46-M46,P46-O46,R46-Q46,T46-S46,V46-U46,X46-W46,Z46-Y46,AB46-AA46)+MAX(J46-I46,L46-K46,N46-M46,P46-O46,R46-Q46,T46-S46,V46-U46,X46-W46,Z46-Y46,AB46-AA46)-MIN(J46-I46,L46-K46,N46-M46,P46-O46,R46-Q46,T46-S46,V46-U46,X46-W46,Z46-Y46,AB46-AA46))","v":40},16.5,{"$f":"Y8*X8","v":660}]
[null,"→","Místo nejvyššího bodu (zleva) [m]",0,"[m]",null,null,null,null,null,null,null,null,null,null,null,null,null,null,null,null,"rám 1m",null,0,11.3,0]
[null,null,null,null,null,null,null,null,"Tvar střechy",null,"Tvar terénu",null,"úhel alfa",null,null,null,null,null,null,null,null,"podlaha 3m",null,{"$f":"((IF(I44=3,J46-I46,0)+IF(K44=3,L46-K46,0)+IF(M44=3,N46-M46,0)+IF(O44=3,P46-O46,0)+IF(Q44=3,R46-Q46,0)+IF(S44=3,T46-S46,0)+IF(U44=3,V46-U46,0)+IF(W44=3,X46-W46,0)+IF(Y44=3,Z46-Y46,0)+IF(AA44=3,AB46-AA46,0))-X12)*2","v":60},22,1320]
[null,null,"Střecha:",null,null,null,null,null,"osa x","osa y","osa x","osa y","tg A",{"$f":"($D$14-$J$4)/($D$17)","v":{"$error":"#DIV/0!"}},null,null,null,null,null,null,null,"podlaha 2m",null,{"$f":"(IF(I44=2,J46-I46,0)+IF(K44=2,L46-K46,0)+IF(M44=2,N46-M46,0)+IF(O44=2,P46-O46,0)+IF(Q44=2,R46-Q46,0)+IF(S44=2,T46-S46,0)+IF(U44=2,V46-U46,0)+IF(W44=2,X46-W46,0)+IF(Y44=2,Z46-Y46,0)+IF(AA44=2,AB46-AA46,0))*2","v":0},14.5,0]
[null,null,"Délka strany [m]",{"$f":"Půdorys!$C$5","v":20},"[m]",null,null,"vlevo",0,{"$f":"$D$15+$D$4","v":11.760000000000012},0,{"$f":"$D$4","v":1.3000000000000114},"A",{"$f":"DEGREES(ATAN(N11))","v":{"$error":"#DIV/0!"}},null,null,null,null,null,null,null,"průlezová podlaha 3m",null,{"$f":"MAX(J46:AB46)","v":5},28,140]
[null,"→","Tvar střechy:","sedlová",null,null,null,"max",{"$f":"$D$9","v":0},{"$f":"IF($I$17<I13,-$N$3*I13+$J$4+$N$11*$D$12,IF(I13<$I$14,$N$11*I13+$J$4,J14))","v":11.759999999999991},{"$f":"$D$9","v":0},{"$f":"$D$8","v":1.3},"tg A",{"$f":"TAN(RADIANS($N$12))","v":{"$error":"#DIV/0!"}},null,null,null,null,null,null,null,"zábradlí 3m",null,{"$f":"IF(I44=3,2*(J46-I46)+1,0)+IF(K44=3,2*(L46-K46)+1,0)+IF(M44=3,2*(N46-M46)+1,0)+IF(O44=3,2*(P46-O46)+1,0)+IF(Q44=3,2*(R46-Q46)+1,0)+IF(S44=3,2*(T46-S46)+1,0)+IF(U44=3,2*(V46-U46)+1,0)+IF(W44=3,2*(X46-W46)+1,0)+IF(Y44=3,2*(Z46-Y46)+1,0)+IF(AA44=3,2*(AB46-AA46)+1,0)","v":77},5.5,423.5]
[null,"→",{"$f":"IF('stěna G'!$D$13=Data_podpora!$B$9,\"Výška stěny [m]\",\"Výška uprostřed stěny [m]\")","v":"Výška uprostřed stěny [m]"},{"$f":"507.76-496","v":11.759999999999991},"[m]",null,null,"polov1",{"$f":"$D$17","v":0},{"$f":"$D$14","v":11.759999999999991},{"$f":"$D$17","v":0},{"$f":"$D$18","v":0},"sklon",{"$f":"$N$13","v":{"$error":"#DIV/0!"}},null,null,null,null,null,null,null,"zábradlí 2m",null,{"$f":"IF(I44=2,2*(J46-I46)+1,0)+IF(K44=2,2*(L46-K46)+1,0)+IF(M44=2,2*(N46-M46)+1,0)+IF(O44=2,2*(P46-O46)+1,0)+IF(Q44=2,2*(R46-Q46)+1,0)+IF(S44=2,2*(T46-S46)+1,0)+IF(U44=2,2*(V46-U46)+1,0)+IF(W44=2,2*(X46-W46)+1,0)+IF(Y44=2,2*(Z46-Y46)+1,0)+IF(AA44=2,2*(AB46-AA46)+1,0)","v":0},3.5,0]
[null,{"$f":"IF($D$13=Data_podpora!B9,\"\",\"→\")","v":"→"},{"$f":"IF($D$13=Data_podpora!$B$9,\"\",\"Výška od terénu k okapu (levý) [m]\")","v":"Výška od terénu k okapu (levý) [m]"},10.46,{"$f":"IF($D$13=Data_podpora!$B$9,\"\",\"[m]\")","v":"[m]"},null,null,"min",{"$f":"$D$7","v":5.5},{"$f":"IF($I$13>=I15,$N$11*I15+$J$4,IF(I15<=$I$16,J13,-$N$11*I15+$J$12+$N$11*$D$12))","v":11.759999999999991},{"$f":"$D$7","v":5.5},{"$f":"$D$6","v":0},null,null,null,null,null,null,null,null,null,"diagonální úchyt",null,{"$f":"X16/MAX(I46:AB46)","v":2},0.5,1]
[null,null,{"$f":" IF(D13=Data_podpora!B10,\"Upřesňující parametry pro polovalbovou střechu:\",\"\")","v":""},null,null,null,null,"top",{"$f":"$D$12/2","v":10},{"$f":"$D$14","v":11.759999999999991},{"$f":"$D$12/2","v":10},{"$f":"0","v":0},null,null,null,null,null,null,null,null,null,"diagonála 3m",null,{"$f":"MAX(J46-I46,L46-K46,N46-M46,P46-O46,R46-Q46,T46-S46,V46-U46,X46-W46,Z46-Y46,AB46-AA46)*ROUNDUP((IF(I44=3,I44,0)+IF(K44=3,K44,0)+IF(M44=3,M44,0)+IF(O44=3,O44,0)+IF(Q44=3,Q44,0)+IF(S44=3,S44,0)+IF(U44=3,U44,0)+IF(W44=3,W44,0)+IF(Y44=3,Y44,0)+IF(AA44=3,AA44,0))/20,0)","v":10},11,110]
[null,{"$f":"IF($D$13=Data_podpora!$B$10,'stěna G'!$B$15,\"\")","v":""},{"$f":"IF($D$13=Data_podpora!$B$10,\"Místo polovalby [m]\",\"\")","v":""},null,{"$f":"IF($D$13=Data_podpora!$B$10,\"[m]\",\"\")","v":""},null,null,"polov2",{"$f":"$D$12-$D$17","v":20},{"$f":"$D$14","v":11.759999999999991},{"$f":"$D$12-$D$17","v":20},{"$f":"$D$19","v":0},null,null,null,null,null,null,null,null,null,"diagonála 2m",null,{"$f":"IF(X16=0,MAX(J46-I46,L46-K46,N46-M46,P46-O46,R46-Q46,T46-S46,V46-U46,X46-W46,Z46-Y46,AB46-AA46)*ROUNDUP((IF(I44=2,I44,0)+IF(K44=2,K44,0)+IF(M44=2,M44,0)+IF(O44=2,O44,0)+IF(Q44=2,Q44,0)+IF(S44=2,S44,0)+IF(U44=2,U44,0)+IF(W44=2,W44,0)+IF(Y44=2,Y44,0)+IF(AA44=2,AA44,0))/12,0),0)","v":0},8,0]
[null,{"$f":"IF($D$13=Data_podpora!$B$10,'stěna G'!$B$15,\"\")","v":""},{"$f":"IF($D$13=Data_podpora!$B$10,\"Výška terénu v místě levé polovalby [m]\",\"\")","v":""},null,{"$f":"IF($D$13=Data_podpora!$B$10,\"[m]\",\"\")","v":""},null,null,"vpravo",{"$f":"$D$12","v":20},{"$f":"$J$4","v":11.760000000000012},{"$f":"$D$12","v":20},{"$f":"$D$5","v":0},null,null,null,null,null,null,null,null,null,"kotva 0,5 m",null,{"$f":"IF(X19=0,ROUNDUP(X8*0.45,0),ROUNDUP(X8*0.45,0)-X19)","v":18},2,36]
[null,{"$f":"IF($D$13=Data_podpora!$B$10,'stěna G'!$B$15,\"\")","v":""},{"$f":"IF($D$13=Data_podpora!$B$10,\"Výška terénu v místě pravé polovalby [m]\",\"\")","v":""},null,{"$f":"IF($D$13=Data_podpora!$B$10,\"[m]\",\"\")","v":""},null,null,null,null,null,null,null,null,null,null,null,null,null,null,null,null,"kotva dlouhá 1 m",null,0,3.8,0]
[null,null,null,null,null,null,null,"Patra lešení",null,null,null,null,null,null,null,null,null,null,null,null,null,"eLko / sloupek",null,{"$f":"IF(X22=0,COUNT(J46,L46,N46,P46,R46,T46,V46,X46,Z46,AB46)+1,(COUNT(J46,L46,N46,P46,R46,T46,V46,X46,Z46,AB46)+1)-X22)","v":8},5,40]
[null,null,null,null,null,null,null,null,null,null,null,null,null,null,null,null,null,null,null,null,null,"eLko 2 m",null,null,11.5,0]
[null,{"$f":"IF($D$21=Data_podpora!B30,\"→\",\"\")","v":""},{"$f":"IF(D21=Data_podpora!B30,\"Vzdálenost od levého rohu [m]\",\"\")","v":""},null,{"$f":"IF(D21=Data_podpora!B30,\"[m]\",\"\")","v":""},null,null,"-0,5",{"$f":"I26-1","v":0.40000000000000013},{"$f":"J26-1","v":0.40000000000000013},{"$f":"K26-1","v":0.40000000000000013},{"$f":"L26-1","v":0.40000000000000013},{"$f":"M26-1","v":0.40000000000000013},null,null,null,null,null,null,null,null,"Háčko",null,{"$f":"2*(MAX(I46:AB46)-MIN(J46,L46,N46,P46,R46,T46,V46,X46,Z46,AB46))","v":0},9.6999999999999993,0]
[null,{"$f":"IF($D$21=Data_podpora!$B$30,\"→\",\"\")","v":""},{"$f":"IF(D21=Data_podpora!B30,\"Výška od terénu (zleva) [m]\",\"\")","v":""},null,{"$f":"IF(D21=Data_podpora!B30,\"[m]\",\"\")","v":""},null,null,"-3",{"$f":"I24-2","v":-4.5999999999999996},-4.5999999999999996,-4.5999999999999996,-4.5999999999999996,-4.5999999999999996,null,null,null,null,null,null,null,null,"boční zábradlí",null,{"$f":"IF(X22=0,(MAX(J46-I46,L46-K46,N46-M46,P46-O46,R46-Q46,T46-S46,V46-U46,X46-W46,Z46-Y46,AB46-AA46)+1)*2,(MAX(J46-I46,L46-K46,N46-M46,P46-O46,R46-Q46,T46-S46,V46-U46,X46-W46,Z46-Y46,AB46-AA46)+1)*2-X22)","v":12},3,36]
[null,{"$f":"IF($D$21=Data_podpora!$B$30,\"→\",\"\")","v":""},{"$f":"IF(D21=Data_podpora!B30,\"Šířka [m]\",\"\")","v":""},null,{"$f":"IF(D21=Data_podpora!B30,\"[m]\",\"\")","v":""},null,null,"-2",-2.5999999999999996,-2.5999999999999996,-2.5999999999999996,-2.5999999999999996,-2.5999999999999996,null,null,null,null,null,null,null,null,"okopové prkno 3m",null,{"$f":"IF(I44=3,J46-I46,0)+IF(K44=3,L46-K46,0)+IF(M44=3,N46-M46,0)+IF(O44=3,P46-O46,0)+IF(Q44=3,R46-Q46,0)+IF(S44=3,T46-S46,0)+IF(U44=3,V46-U46,0)+IF(W44=3,X46-W46,0)+IF(Y44=3,Z46-Y46,0)+IF(AA44=3,AB46-AA46,0)","v":35},6.5,227.5]
[null,null,null,null,null,null,null,"-1",{"$f":"I26-2","v":-0.59999999999999987},{"$f":"$D$85-2","v":-0.59999999999999987},{"$f":"$D$85-2","v":-0.59999999999999987},{"$f":"$D$85-2","v":-0.59999999999999987},{"$f":"$D$85-2","v":-0.59999999999999987},null,null,null,null,null,null,null,null,"okopové prkno 2m",null,{"$f":"IF(I44=2,J46-I46,0)+IF(K44=2,L46-K46,0)+IF(M44=2,N46-M46,0)+IF(O44=2,P46-O46,0)+IF(Q44=2,R46-Q46,0)+IF(S44=2,T46-S46,0)+IF(U44=2,V46-U46,0)+IF(W44=2,X46-W46,0)+IF(Y44=2,Z46-Y46,0)+IF(AA44=2,AB46-AA46,0)","v":0},4.5,0]
[null,null,null,null,null,null,null,"0",{"$f":"$K$41","v":1.4000000000000001},{"$f":"$K$41","v":1.4000000000000001},{"$f":"$K$41","v":1.4000000000000001},{"$f":"$K$41","v":1.4000000000000001},{"$f":"$K$41","v":1.4000000000000001},null,null,null,null,null,null,null,null,"konzola",null,null,10,0]
[null,null,null,null,null,null,null,"1",{"$f":"I26+$D$86","v":3.4000000000000004},{"$f":"J26+$D$86","v":3.4000000000000004},{"$f":"K26+$D$86","v":3.4000000000000004},{"$f":"L26+$D$86","v":3.4000000000000004},{"$f":"M26+$D$86","v":3.4000000000000004},null,null,null,null,null,null,null,null,"pevna spojka",null,{"$f":"J46*2","v":10},1.1499999999999999,11.5]
[null,null,null,null,null,null,null,"2",5.4,5.4,5.4,5.4,5.4,null,null,null,null,null,null,null,null,"otočná spojka",null,{"$f":"J46","v":5},1.35,6.75]
[null,null,null,null,null,null,null,"3",7.4,7.4,7.4,7.4,7.4,null,null,null,null,null,null,null,null,"závlačná spojka",null,{"$f":"J46*2","v":10},0.8,8]
[null,null,null,null,null,null,null,"4",9.4,9.4,9.4,9.4,9.4,null,null,null,null,null,null,null,null,"CELKOVÁ HMOTNOST [kg]",null,null,null,{"$f":"SUM(Z6:Z29)","v":3095.45}]
[null,null,null,null,null,null,null,"5",11.4,11.4,11.4,11.4,11.4]
[null,null,null,null,null,null,null,"6",13.4,13.4,13.4,13.4,13.4]
[null,null,null,null,null,null,null,"7",15.4,15.4,15.4,15.4,15.4]
[null,null,null,null,null,null,null,"8",17.399999999999999,17.399999999999999,17.399999999999999,17.399999999999999,17.399999999999999]
[null,null,null,null,null,null,null,"9",19.399999999999999,19.399999999999999,19.399999999999999,19.399999999999999,19.399999999999999]
[null,null,null,null,null,null,null,"10",21.4,21.4,21.4,21.4,21.4]
[null,null,null,null,null,null,null,"11",23.4,23.4,23.4,23.4,23.4]
[null,null,null,null,null,null,null,"12",25.4,25.4,25.4,25.4,25.4]
[null,null,null,null,null,null,null,"13",27.4,27.4,27.4,27.4,27.4]
[]
[null,null,null,null,null,null,null,"LEŠENÍ","výška založení [m]",null,{"$f":"D8+0.1","v":1.4000000000000001},"[m]","nepsat nuly v kolonce \"patro\",pokud není sestava lešení využita",null,null,null,null,null,"Poznámka:",{"$f":"IF(Půdorys!I11=0,\"\",Půdorys!I11)","v":""}]
[null,null,null,null,null,null,null,null,"ZALOŽENÍ","VÝŠKA P.P.","ZALOŽENÍ","VÝŠKA P.P.","ZALOŽENÍ","VÝŠKA P.P.","ZALOŽENÍ","VÝŠKA P.P.","ZALOŽENÍ","VÝŠKA P.P.","ZALOŽENÍ","VÝŠKA P.P.","ZALOŽENÍ","VÝŠKA P.P.","ZALOŽENÍ","VÝŠKA P.P.","ZALOŽENÍ","VÝŠKA P.P.","ZALOŽENÍ","VÝŠKA P.P."]
[null,null,null,null,null,null,null,"SESTAVA",1,null,2,null,3,null,4,null,5,null,6,null,7,null,8,null,9,null,10]
[null,null,null,null,null,null,null,"DÉLKA SESTAVY",3,null,3,null,3,null,3,null,3,null,3,null,3,null,0,null,0,null,0]
[null,null,null,null,null,null,null,"\"potvrdit\""]
[null,null,null,null,null,null,null,"PATRO",0,5,0,5,0,5,0,5,0,5,0,5,0,5]
[null,null,null,null,null,null,null,"POSUN"]
[null,null,null,null,null,null,null,"plocha [m2]",{"$f":"(J46-I46)*$D$86*I44","v":30},null,{"$f":"L46*$D$86*K44","v":30},null,{"$f":"N46*$D$86*M44","v":30},null,{"$f":"P46*$D$86*O44","v":30},null,{"$f":"R46*$D$86*Q44","v":30},null,{"$f":"T46*$D$86*S44","v":30},null,{"$f":"V46*$D$86*U44","v":30},null,{"$f":"X46*$D$86*W44","v":0},null,{"$f":"Z46*$D$86*Y44","v":0},null,{"$f":"AB46*$D$86*AA44","v":0}]
[null,null,null,null,null,null,null,"výška",{"$f":"IF(I46=-0.5,M22,INDEX($M$23:$M$39,I46+4))","v":1.4000000000000001},{"$f":"INDEX($M$23:$M$39,J46+4)","v":11.4},{"$f":"IF(K46=-0.5,M22,INDEX($M$23:$M$39,K46+4))","v":1.4000000000000001},{"$f":"INDEX($M$23:$M$39,L46+4)","v":11.4},{"$f":"IF(M46=-0.5,M22,INDEX($M$23:$M$39,M46+4))","v":1.4000000000000001},{"$f":"INDEX($M$23:$M$39,N46+4)","v":11.4},{"$f":"IF(O46=-0.5,M22,INDEX($M$23:$M$39,O46+4))","v":1.4000000000000001},{"$f":"INDEX($M$23:$M$39,P46+4)","v":11.4},{"$f":"IF(Q46=-0.5,M22,INDEX($M$23:$M$39,Q46+4))","v":1.4000000000000001},{"$f":"INDEX($M$23:$M$39,R46+4)","v":11.4},{"$f":"IF(S46=-0.5,M22,INDEX($M$23:$M$39,S46+4))","v":1.4000000000000001},{"$f":"INDEX($M$23:$M$39,T46+4)","v":11.4},{"$f":"IF(U46=-0.5,M22,INDEX($M$23:$M$39,U46+4))","v":1.4000000000000001},{"$f":"INDEX($M$23:$M$39,V46+4)","v":11.4},{"$f":"IF(W46=-0.5,M22,INDEX($M$23:$M$39,W46+4))","v":1.4000000000000001},{"$f":"INDEX($M$23:$M$39,X46+4)","v":1.4000000000000001},{"$f":"IF(Y46=-0.5,M22,INDEX($M$23:$M$39,Y46+4))","v":1.4000000000000001},{"$f":"INDEX($M$23:$M$39,Z46+4)","v":1.4000000000000001},{"$f":"IF(AA46=-0.5,M22,INDEX($M$23:$M$39,AA46+4))","v":1.4000000000000001},{"$f":"INDEX($M$23:$M$39,AB46+4)","v":1.4000000000000001}]
[]
[]
[]
[]
[]
[null,null,null,null,null,null,null,-1]
[null,null,null,null,null,null,null,0,{"$f":"$I$49","v":1.4000000000000001},{"$f":"$J$49","v":11.4}]
[null,null,null,null,null,null,null,1,{"$f":"$I$49","v":1.4000000000000001},{"$f":"$J$49","v":11.4}]
[null,null,null,null,null,null,null,2,{"$f":"$I$49","v":1.4000000000000001},{"$f":"$J$49","v":11.4}]
[null,null,null,null,null,null,null,3,{"$f":"$I$49","v":1.4000000000000001},{"$f":"$J$49","v":11.4},{"$f":"$K$49","v":1.4000000000000001},{"$f":"$L$49","v":11.4}]
[null,null,null,null,null,null,null,4,null,null,{"$f":"$K$49","v":1.4000000000000001},{"$f":"$L$49","v":11.4}]
[null,null,null,null,null,null,null,5,null,null,{"$f":"$K$49","v":1.4000000000000001},{"$f":"$L$49","v":11.4}]
[null,null,null,null,null,null,null,6,null,null,{"$f":"$K$49","v":1.4000000000000001},{"$f":"$L$49","v":11.4},{"$f":"$M$49","v":1.4000000000000001},{"$f":"$N$49","v":11.4}]
[null,null,null,null,null,null,null,7,null,null,null,null,{"$f":"$M$49","v":1.4000000000000001},{"$f":"$N$49","v":11.4}]
[null,null,null,null,null,null,null,8,null,null,null,null,{"$f":"$M$49","v":1.4000000000000001},{"$f":"$N$49","v":11.4}]
[null,null,null,null,null,null,null,9,null,null,null,null,{"$f":"$M$49","v":1.4000000000000001},{"$f":"$N$49","v":11.4},{"$f":"$O$49","v":1.4000000000000001},{"$f":"$P$49","v":11.4}]
[null,null,null,null,null,null,null,10,null,null,null,null,null,null,{"$f":"$O$49","v":1.4000000000000001},{"$f":"$P$49","v":11.4}]
[null,null,null,null,null,null,null,11,null,null,null,null,null,null,{"$f":"$O$49","v":1.4000000000000001},{"$f":"$P$49","v":11.4}]
[null,null,null,null,null,null,null,12,null,null,null,null,null,null,{"$f":"$O$49","v":1.4000000000000001},{"$f":"$P$49","v":11.4},{"$f":"$Q$49","v":1.4000000000000001},{"$f":"$R$49","v":11.4}]
[null,null,"Pomocný výpočet počtu sestav lešení:",null,null,null,null,13,null,null,null,null,null,null,null,null,{"$f":"$Q$49","v":1.4000000000000001},{"$f":"$R$49","v":11.4}]
[null,null,"Délka:",null,null,null,null,14,null,null,null,null,null,null,null,null,{"$f":"$Q$49","v":1.4000000000000001},{"$f":"$R$49","v":11.4}]
[null,null,"přesah za roh objektu:","Ne",null,null,null,15,null,null,null,null,null,null,null,null,{"$f":"$Q$49","v":1.4000000000000001},{"$f":"$R$49","v":11.4},{"$f":"$S$49","v":1.4000000000000001},{"$f":"$T$49","v":11.4}]
[null,null,"Požadovaná minimální délka lešení [m]",{"$f":"IF(D71=Data_podpora!B17,'stěna G'!D12+2,IF('stěna G'!D71=Data_podpora!B14,'stěna G'!D12+0.5,IF(D71=Data_podpora!B13,'stěna G'!D12,'stěna G'!D12+1)))","v":20},"[m]",null,null,16,null,null,null,null,null,null,null,null,null,null,{"$f":"$S$49","v":1.4000000000000001},{"$f":"$T$49","v":11.4}]
[null,null,"Počet sestav lešení (3m) [-]",{"$f":"ROUNDDOWN(D72/E73,0)","v":6},"3",{"$f":"D73*E73","v":18},"[m]",17,null,null,null,null,null,null,null,null,null,null,{"$f":"$S$49","v":1.4000000000000001},{"$f":"$T$49","v":11.4}]
[null,null,"Počet sestav lešení (2m) [-]",{"$f":"ROUNDDOWN(MOD(D72,E73)/E74,0)","v":1},"2",{"$f":"D74*E74","v":2},"[m]",18,null,null,null,null,null,null,null,null,null,null,{"$f":"$S$49","v":1.4000000000000001},{"$f":"$T$49","v":11.4},{"$f":"$U$49","v":1.4000000000000001},{"$f":"$V$49","v":11.4}]
[null,null,"Počet sestav lešení (0,75m) [-]",{"$f":"ROUNDUP(D72-(D73*E73+D74*E74),0)","v":0},"0,75",{"$f":"D75*E75","v":0},"[m]",19,null,null,null,null,null,null,null,null,null,null,null,null,{"$f":"$U$49","v":1.4000000000000001},{"$f":"$V$49","v":11.4}]
[null,null,"Reálná délka lešení [m]",{"$f":"D73*E73+D74*E74+D75*E75","v":20},"[m]",null,null,20,null,null,null,null,null,null,null,null,null,null,null,null,{"$f":"$U$49","v":1.4000000000000001},{"$f":"$V$49","v":11.4}]
[null,null,null,null,null,null,null,21,null,null,null,null,null,null,null,null,null,null,null,null,{"$f":"$U$49","v":1.4000000000000001},{"$f":"$V$49","v":11.4},{"$f":"$W$49","v":1.4000000000000001},{"$f":"$X$49","v":1.4000000000000001}]
[null,null,"Výška:",null,null,null,null,22,null,null,null,null,null,null,null,null,null,null,null,null,null,null,{"$f":"$W$49","v":1.4000000000000001},{"$f":"X77","v":1.4000000000000001}]
[null,null,"Lešení pro:","Fasádu",null,null,null,23,null,null,null,null,null,null,null,null,null,null,null,null,null,null,{"$f":"$W$49","v":1.4000000000000001},{"$f":"X78","v":1.4000000000000001}]
[null,null,"Výška zábradlí posledního patra [m]",1,"[m]",null,null,24,null,null,null,null,null,null,null,null,null,null,null,null,null,null,{"$f":"$W$49","v":1.4000000000000001},{"$f":"X79","v":1.4000000000000001},{"$f":"$Y$49","v":1.4000000000000001},{"$f":"$Z$49","v":1.4000000000000001}]
[null,null,"Požadovaná výška [m]",{"$f":"IF(D79=Data_podpora!B22,'stěna G'!D14+D80,'stěna G'!D14)","v":11.759999999999991},"[m]",null,null,25,null,null,null,null,null,null,null,null,null,null,null,null,null,null,null,null,{"$f":"$Y$49","v":1.4000000000000001},{"$f":"Z80","v":1.4000000000000001}]
["Založení",null,"Výška nejnižžšího bodu terénu [m]",{"$f":"MIN(D4,D5,D6,D8)","v":0},"[m]",null,null,26,null,null,null,null,null,null,null,null,null,null,null,null,null,null,null,null,{"$f":"$Y$49","v":1.4000000000000001},{"$f":"Z81","v":1.4000000000000001}]
[null,null,"Výška nejvyššího  bodu terénu [m]",{"$f":"D8","v":1.3},"[m]",null,null,27,null,null,null,null,null,null,null,null,null,null,null,null,null,null,null,null,{"$f":"$Y$49","v":1.4000000000000001},{"$f":"Z82","v":1.4000000000000001},{"$f":"$AA$49","v":1.4000000000000001},{"$f":"$AB$49","v":1.4000000000000001}]
[null,null,"Rozdíl max a min [m]",{"$f":"D83-D82","v":1.3},"[m]",{"$f":"IF(D84<0.4,\"(Patky 0,4m)\",IF(D84<=1,\"(Patky 1m)\",IF(2>=D84>1,\"(Rám 1m)\",IF(5>D84>2,\"(Rám 2m)\",\"\"))))","v":"(Rám 1m)"},null,28,null,null,null,null,null,null,null,null,null,null,null,null,null,null,null,null,null,null,{"$f":"$AA$49","v":1.4000000000000001},{"$f":"AB83","v":1.4000000000000001}]
[null,"#","Výška založení [m]",{"$f":"D8+0.1","v":1.4000000000000001},"[m]",null,null,29,null,null,null,null,null,null,null,null,null,null,null,null,null,null,null,null,null,null,{"$f":"$AA$49","v":1.4000000000000001},{"$f":"AB84","v":1.4000000000000001}]
[null,null,"Modulová výška patra lešení [m]",2,"[m]",null,null,30,null,null,null,null,null,null,null,null,null,null,null,null,null,null,null,null,null,null,{"$f":"$AA$49","v":1.4000000000000001},{"$f":"AB85","v":1.4000000000000001}]
[null,null,"Počet pater lešení [-]; výška [m])",{"$f":"IF(D81-D85<11,ROUNDDOWN((D81-D85)/2.15,0),ROUNDDOWN((D81-D85)/2.1,0))","v":4},"pater",{"$f":"INDEX(M27:M39,D87)","v":9.4},"[m]",31]
[null,null,"Reálná výška lešení [m]",{"$f":"D87*D86+D85+D80","v":10.4},"[m]"]
[]
["Uskočení pater","→","Hranice posouzení uskočení","4",null,{"$f":"INDEX(M27:M39,D90)","v":9.4},"[m]"]
[null,null,"Zbývající výška do hřebene",{"$f":"$D$14-F90","v":2.3599999999999905},"[m]"]
[null,null,"Počet uskočených pater",{"$f":"IF(D91<11,ROUNDDOWN((D91)/2.6,0),ROUNDDOWN((D91)/2.6,0))","v":0},{"$f":"IF(D92=1,\"patro\",IF(D92<=4,\"patra\",\"pater\"))","v":"patra"}]
[null,null,"Rozdíl výšky okapu a nejbližšího patra",{"$f":"$J$4-(INDEX(M27:M39,D90))","v":2.3600000000000119},"[m]"]
[null,null,"Rozdíl výšek na 3 m sestavu",{"$f":"$N$5*$E$73","v":-6.394884621840901E-15},"[m]"]
[null,{"$f":"IF($D$92>=1,1,\"\")","v":""},"První sestava",{"$f":"D93+D94","v":2.3600000000000056},"[m]",{"$f":"IF(D$95<=2,\"posoudit další\",IF(D$95<=3.2,\"ponechat\",\"pokračuje patrem\"))","v":"ponechat"}]
[null,{"$f":"IF(1<=$D$92,2,\"X\")","v":"X"},"Druhá sestava",{"$f":"IF(F95=\"ponechat\",$D$93+$D$94*B96,$D$93+$D$94*B96-2)","v":{"$error":"#VALUE!"}},"[m]",{"$f":"IF(D96<2,\"posoudit další\",IF(D96<=3.2,\"ponechat\",IF(D96>3.2,\"pokračuje patrem\",\"\")))","v":{"$error":"#VALUE!"}}]
[null,{"$f":"IF(2<=$D$92,3,\"X\")","v":"X"},"Třetí sestava",{"$f":"IF(F96=\"ponechat\",$D$93+$D$94*B97,$D$93+$D$94*B97-2)","v":{"$error":"#VALUE!"}},"[m]",{"$f":"IF(D97<2,\"posoudit další\",IF(D97<=3.2,\"ponechat\",IF(D97>3.2,\"pokračuje patrem\",\"\")))","v":{"$error":"#VALUE!"}}]
[null,{"$f":"IF(3<=$D$92,4,\"X\")","v":"X"},"Čtvrtá sestava",{"$f":"IF(F97=\"ponechat\",$D$93+$D$94*B98,$D$93+$D$94*B98-2)","v":{"$error":"#VALUE!"}},"[m]",{"$f":"IF(D98<2,\"posoudit další\",IF(D98<=3.2,\"ponechat\",IF(D98>3.2,\"pokračuje patrem\",\"\")))","v":{"$error":"#VALUE!"}}]
[]
[]
[]
[]
[null,null,"NAKLÁDACÍ LIST"]
[]
[null,null,"stavitelná patka 0,5m","počet kusů"]
[null,null,"stavitelná patka 1m",{"$f":"IF(D107>=0,($D$73+$D$74+$D$75)*2+2-D107,($D$73+$D$74+$D$75)*2+2)","v":14}]
[null,null,"rám 2m",2]
[null,null,"rám 1m",{"$f":"(($D$73+$D$74+$D$75)+1)*$D$87","v":32}]
[null,null,"podlaha 3m",{"$f":"IF(D85>=1,($D$73+$D$74+$D$75)+1,0)","v":8}]
[null,null,"podlaha 2m",{"$f":"(D73*D87-$D112)*2","v":40}]
[null,null,"průlezová podlaha 3m",{"$f":"D74*D87","v":4}]
[null,null,"zábradlí 3m",{"$f":"D87","v":4}]
[null,null,"zábradlí 2m",{"$f":"(1+$D$87*2)*D73","v":54}]
[null,null,"diagonální úchyt",{"$f":"(1+$D$87*2)*D74","v":9}]
[null,null,"diagonála 3m"]
[null,null,"diagonála 2m",{"$f":"$D$87*(ROUNDUP((D73+D74+D75)/4,0))","v":8}]
[null,null,"kotva 0,5 m",{"$f":"IF(D116=0,$D$87*ROUNDUP(D74/4,0),0)","v":0}]
[null,null,"kotva dlouhá 1 m",{"$f":"(($D$87-1)*SUM(D73:D75))/2","v":10.5}]
[null,null,"eLko / sloupek"]
[null,null,"eLko 2 m",{"$f":"SUM(D73:D75)+1","v":8}]
[null,null,"Háčko"]
[null,null,"boční zábradlí"]
[null,null,"okopové prkno 3m",{"$f":"D87*2","v":8}]
[null,null,"okopové prkno 2m",{"$f":"D73*D87","v":24}]
[null,null,"konzola",{"$f":"D74*D87","v":4}]
[null,null,"pevna spojka"]
[null,null,"otočná spojka"]
[null,null,"závlačná spojka"]

{"sheet":"stěna H","index":9,"n_rows":128,"n_cols":34,"rows_kept":128,"cut":false,"hidden":false,"merged":[[0,4,1,6],[2,28,2,30],[2,31,2,33],[3,21,4,22],[3,23,4,23],[3,24,4,24],[3,25,4,25],[42,20,42,21],[42,22,42,23],[42,24,42,25],[42,26,42,27],[43,8,43,9],[43,10,43,11],[43,12,43,13],[43,14,43,15],[43,16,43,17],[43,18,43,19],[42,8,42,9],[42,10,42,11],[42,12,42,13],[42,14,42,15],[42,16,42,17],[42,18,42,19],[43,20,43,21],[43,22,43,23],[43,24,43,25],[43,26,43,27],[47,8,47,9],[47,10,47,11],[47,12,47,13],[47,14,47,15],[47,16,47,17],[47,18,47,19],[89,0,93,0],[47,20,47,21],[47,22,47,23],[47,24,47,25],[47,26,47,27],[70,3,70,4],[81,0,84,0]]}
[null,null,"Stěna H","Výkres:",null,null,null,"Data grafu:"]
[null,null,"Nastavení parametrů výpočtu:",null,null,null,null,null,"Tvar střechy",null,"Tvar terénu",null,"úhel alfa",null,null,null,null,null,null,null,null,"NAKLÁDACÍ LIST:",null,{"$f":"$C$1","v":"Stěna H"},{"$f":"IF(AD6=0,\"(BUDE NAKLÁDÁNO POUZE AUTO)\",\"\")","v":"(BUDE NAKLÁDÁNO POUZE AUTO)"},null,null,"VYTÍŽENOST ODVOZNÍHO PROSTŘEDKU:"]
[null,null,"Terén: absolutní výška (±0,00 = svislice od hřebene střechy na terén)",null,null,null,null,null,"osa x","osa y","osa x","osa y","tg A",{"$f":"($D$14-$J$4)/($D$12/2)","v":0.28679245283018523},null,null,null,null,null,null,null,"obestavběná plocha lešení [m2]",null,null,{"$f":"IF(K41>=1,SUM(I48,K48,M48,O48,Q48,S48,U48,W48,Y48,AA48)+SUM(I44,K44,M44,O44,Q44,S44,U44,W44,Y44,AA44)*2+SUM(I44,K44,M44,O44,Q44,S44,U44,W44,Y44,AA44),SUM(I48,K48,M48,O48,Q48,S48,U48,W48,Y48,AA48)+SUM(I44,K44,M44,O44,Q44,S44,U44,W44,Y44,AA44)*2)","v":192},"[m2]",null,"[kg]","1. cesta",null,null,"2.cesta"]
[null,"→","Výška terénu v levém rohu [m]",0.75,"[m]",null,null,"vlevo",0,{"$f":"IF($D$13=Data_podpora!$B$9,$D$14,$D$15+$D$4)","v":11.75},0,{"$f":"$D$4","v":0.75},"A",{"$f":"DEGREES(ATAN(N3))","v":16.00249182573333},null,null,null,null,null,null,null,"Komponenta",null,"počet kusů [ks]","jednotková hmotnost [kg/ks]","hmotnost [kg]",null,null,"KAPACITA","VYUŽITO","Zbývá","KAPACITA","VYUŽITO","ZBÝVÁ"]
[null,"→","Výška terénu v pravém rohu [m]",-0.75,"[m]",null,null,"max",{"$f":"$D$9","v":0},{"$f":"IF($D$12/2<I5,-$N$3*I5+$J$4+$N$3*$D$12,$N$3*I5+$J$4)","v":11.75},{"$f":"$D$9","v":0},{"$f":"$D$8","v":0.75},"tg A",{"$f":"TAN(RADIANS($N$4))","v":0.28679245283018523},null,null,null,null,null,null,null,null,null,null,null,null,null,"AUTO",2500,{"$f":"IF(Z30<=AC5,SUM(Z6:Z29),SUM(Z6:Z9,Z26:Z29,Z15:Z23,Z13/2,Z14/2))","v":2313.0500000000002},{"$f":"IF((AC5-AD5)<=0,0,AC5-AD5)","v":186.94999999999982},2500,{"$f":"IF(AC5-AD5<=0,-(AC5-AD5),0)","v":0},{"$f":"AF5-AG5","v":2500}]
[null,"→","Výška nejnižšího bodu terénu [m]",-0.75,"[m]",null,null,"top",{"$f":"$D$12/2","v":6.625},{"$f":"$D$14","v":13.649999999999977},{"$f":"$D$12/2","v":6.625},{"$f":"0","v":0},"sklon",{"$f":"$N$5","v":0.28679245283018523},null,null,null,null,null,null,null,"stavitelná patka 0,5m",null,{"$f":"IF(X7>0,(COUNT(I46:AB46)+2)-X7,(COUNT(I46:AB46)+2))","v":12},3.1,{"$f":"Y7*X6","v":56.400000000000006},null,"ZÁVĚS",3500,{"$f":"IF(Z30<=AC5,0,SUM(Z10:Z12,Z24:Z25,Z13/2,Z14/2))","v":0},{"$f":"IF((AC6-AD6)<=0,0,AC6-AD6)","v":3500},3500,{"$f":"IF(AC6-AD6<=0,-(AC6-AD6),0)","v":0},{"$f":"AF6-AG6","v":3500}]
[null,"→","Místo nejnižšího bodu (zleva) [m]",{"$f":"D12","v":13.25},"[m]",null,null,"vpravo",{"$f":"$D$12","v":13.25},{"$f":"$J$4","v":11.75},{"$f":"$D$12","v":13.25},{"$f":"$D$5","v":-0.75},null,null,null,null,null,null,null,null,null,"stavitelná patka 1m",null,0,4.7,{"$f":"Y9*X7","v":0}]
[null,"→","Výška nejvyššího bodu terénu [m]",0.75,"[m]",null,null,"min",{"$f":"$D$7","v":13.25},{"$f":"IF($D$12/2>I8,$N$3*I8+$J$4,-$N$3*I8+$J$4+$N$3*$D$12)","v":11.75},{"$f":"$D$7","v":13.25},{"$f":"$D$6","v":-0.75},null,null,null,null,null,null,null,null,null,"rám 2m",null,{"$f":"IF(X9>0,SUM(J46-I46,L46-K46,N46-M46,P46-O46,R46-Q46,T46-S46,V46-U46,X46-W46,Z46-Y46,AB46-AA46)+MIN(J46-I46,L46-K46,N46-M46,P46-O46,R46-Q46,T46-S46,V46-U46,X46-W46,Z46-Y46,AB46-AA46)+MAX(J46-I46,L46-K46,N46-M46,P46-O46,R46-Q46,T46-S46,V46-U46,X46-W46,Z46-Y46,AB46-AA46)-MIN(J46-I46,L46-K46,N46-M46,P46-O46,R46-Q46,T46-S46,V46-U46,X46-W46,Z46-Y46,AB46-AA46)-X9,SUM(J46-I46,L46-K46,N46-M46,P46-O46,R46-Q46,T46-S46,V46-U46,X46-W46,Z46-Y46,AB46-AA46)+MIN(J46-I46,L46-K46,N46-M46,P46-O46,R46-Q46,T46-S46,V46-U46,X46-W46,Z46-Y46,AB46-AA46)+MAX(J46-I46,L46-K46,N46-M46,P46-O46,R46-Q46,T46-S46,V46-U46,X46-W46,Z46-Y46,AB46-AA46)-MIN(J46-I46,L46-K46,N46-M46,P46-O46,R46-Q46,T46-S46,V46-U46,X46-W46,Z46-Y46,AB46-AA46))","v":32},16.5,{"$f":"Y8*X8","v":528}]
[null,"→","Místo nejvyššího bodu (zleva) [m]",0,"[m]",null,null,null,null,null,null,null,null,null,null,null,null,null,null,null,null,"rám 1m",null,0,11.3,0]
[null,null,null,null,null,null,null,null,"Tvar střechy",null,"Tvar terénu",null,"úhel alfa",null,null,null,null,null,null,null,null,"podlaha 3m",null,{"$f":"((IF(I44=3,J46-I46,0)+IF(K44=3,L46-K46,0)+IF(M44=3,N46-M46,0)+IF(O44=3,P46-O46,0)+IF(Q44=3,R46-Q46,0)+IF(S44=3,T46-S46,0)+IF(U44=3,V46-U46,0)+IF(W44=3,X46-W46,0)+IF(Y44=3,Z46-Y46,0)+IF(AA44=3,AB46-AA46,0))-X12)*2","v":40},22,880]
[null,null,"Střecha: v případě úžlabí volit tvar střechy sedlový",null,null,null,null,null,"osa x","osa y","osa x","osa y","tg A",{"$f":"($D$14-$J$4)/($D$17)","v":{"$error":"#DIV/0!"}},null,null,null,null,null,null,null,"podlaha 2m",null,{"$f":"(IF(I44=2,J46-I46,0)+IF(K44=2,L46-K46,0)+IF(M44=2,N46-M46,0)+IF(O44=2,P46-O46,0)+IF(Q44=2,R46-Q46,0)+IF(S44=2,T46-S46,0)+IF(U44=2,V46-U46,0)+IF(W44=2,X46-W46,0)+IF(Y44=2,Z46-Y46,0)+IF(AA44=2,AB46-AA46,0))*2","v":0},14.5,0]
[null,null,"Délka strany [m]",{"$f":"Půdorys!C12","v":13.25},"[m]",null,null,"vlevo",0,{"$f":"$D$15+$D$4","v":11.75},0,{"$f":"$D$4","v":0.75},"A",{"$f":"DEGREES(ATAN(N11))","v":{"$error":"#DIV/0!"}},null,null,null,null,null,null,null,"průlezová podlaha 3m",null,{"$f":"MAX(J46:AB46)","v":6},28,168]
[null,"→","Tvar střechy:","sedlová",null,null,null,"max",{"$f":"$D$9","v":0},{"$f":"IF($I$17<I13,-$N$3*I13+$J$4+$N$11*$D$12,IF(I13<$I$14,$N$11*I13+$J$4,J14))","v":13.649999999999977},{"$f":"$D$9","v":0},{"$f":"$D$8","v":0.75},"tg A",{"$f":"TAN(RADIANS($N$12))","v":{"$error":"#DIV/0!"}},null,null,null,null,null,null,null,"zábradlí 3m",null,{"$f":"IF(I44=3,2*(J46-I46)+1,0)+IF(K44=3,2*(L46-K46)+1,0)+IF(M44=3,2*(N46-M46)+1,0)+IF(O44=3,2*(P46-O46)+1,0)+IF(Q44=3,2*(R46-Q46)+1,0)+IF(S44=3,2*(T46-S46)+1,0)+IF(U44=3,2*(V46-U46)+1,0)+IF(W44=3,2*(X46-W46)+1,0)+IF(Y44=3,2*(Z46-Y46)+1,0)+IF(AA44=3,2*(AB46-AA46)+1,0)","v":57},5.5,313.5]
[null,"→",{"$f":"IF('stěna H'!$D$13=Data_podpora!$B$9,\"Výška stěny [m]\",\"Výška uprostřed stěny [m]\")","v":"Výška uprostřed stěny [m]"},{"$f":"510.4-496-0.75","v":13.649999999999977},"[m]",null,null,"polov1",{"$f":"$D$17","v":0},{"$f":"$D$14","v":13.649999999999977},{"$f":"$D$17","v":0},{"$f":"$D$18","v":0},"sklon",{"$f":"$N$13","v":{"$error":"#DIV/0!"}},null,null,null,null,null,null,null,"zábradlí 2m",null,{"$f":"IF(I44=2,2*(J46-I46)+1,0)+IF(K44=2,2*(L46-K46)+1,0)+IF(M44=2,2*(N46-M46)+1,0)+IF(O44=2,2*(P46-O46)+1,0)+IF(Q44=2,2*(R46-Q46)+1,0)+IF(S44=2,2*(T46-S46)+1,0)+IF(U44=2,2*(V46-U46)+1,0)+IF(W44=2,2*(X46-W46)+1,0)+IF(Y44=2,2*(Z46-Y46)+1,0)+IF(AA44=2,2*(AB46-AA46)+1,0)","v":0},3.5,0]
[null,{"$f":"IF($D$13=Data_podpora!B9,\"\",\"→\")","v":"→"},{"$f":"IF($D$13=Data_podpora!$B$9,\"\",\"Výška od terénu k okapu (levý) [m]\")","v":"Výška od terénu k okapu (levý) [m]"},11,{"$f":"IF($D$13=Data_podpora!$B$9,\"\",\"[m]\")","v":"[m]"},null,null,"top",{"$f":"$D$12/2","v":6.625},{"$f":"$D$14","v":13.649999999999977},{"$f":"$D$12/2","v":6.625},{"$f":"0","v":0},null,null,null,null,null,null,null,null,null,"diagonální úchyt",null,{"$f":"X16/MAX(I46:AB46)","v":1},0.5,0.5]
[null,null,{"$f":" IF(D13=Data_podpora!B10,\"Upřesňující parametry pro polovalbovou střechu:\",\"\")","v":""},null,null,null,null,"polov2",{"$f":"$D$12-$D$17","v":13.25},{"$f":"$D$14","v":13.649999999999977},{"$f":"$D$12-$D$17","v":13.25},{"$f":"$D$19","v":0},null,null,null,null,null,null,null,null,null,"diagonála 3m",null,{"$f":"MAX(J46-I46,L46-K46,N46-M46,P46-O46,R46-Q46,T46-S46,V46-U46,X46-W46,Z46-Y46,AB46-AA46)*ROUNDUP((IF(I44=3,I44,0)+IF(K44=3,K44,0)+IF(M44=3,M44,0)+IF(O44=3,O44,0)+IF(Q44=3,Q44,0)+IF(S44=3,S44,0)+IF(U44=3,U44,0)+IF(W44=3,W44,0)+IF(Y44=3,Y44,0)+IF(AA44=3,AA44,0))/20,0)","v":6},11,66]
[null,{"$f":"IF($D$13=Data_podpora!$B$10,'stěna H'!$B$15,\"\")","v":""},{"$f":"IF($D$13=Data_podpora!$B$10,\"Místo polovalby [m]\",\"\")","v":""},null,{"$f":"IF($D$13=Data_podpora!$B$10,\"[m]\",\"\")","v":""},null,null,"min",{"$f":"$D$7","v":13.25},{"$f":"IF($I$13>=I17,$N$11*I17+$J$4,IF(I17<=$I$16,J15,-$N$11*I17+$J$12+$N$11*$D$12))","v":13.649999999999977},{"$f":"$D$7","v":13.25},{"$f":"$D$6","v":-0.75},null,null,null,null,null,null,null,null,null,"diagonála 2m",null,{"$f":"IF(X16=0,MAX(J46-I46,L46-K46,N46-M46,P46-O46,R46-Q46,T46-S46,V46-U46,X46-W46,Z46-Y46,AB46-AA46)*ROUNDUP((IF(I44=2,I44,0)+IF(K44=2,K44,0)+IF(M44=2,M44,0)+IF(O44=2,O44,0)+IF(Q44=2,Q44,0)+IF(S44=2,S44,0)+IF(U44=2,U44,0)+IF(W44=2,W44,0)+IF(Y44=2,Y44,0)+IF(AA44=2,AA44,0))/12,0),0)","v":0},8,0]
[null,{"$f":"IF($D$13=Data_podpora!$B$10,'stěna H'!$B$15,\"\")","v":""},{"$f":"IF($D$13=Data_podpora!$B$10,\"Výška terénu v místě levé polovalby [m]\",\"\")","v":""},null,{"$f":"IF($D$13=Data_podpora!$B$10,\"[m]\",\"\")","v":""},null,null,"vpravo",{"$f":"$D$12","v":13.25},{"$f":"$J$4","v":11.75},{"$f":"$D$12","v":13.25},{"$f":"$D$5","v":-0.75},null,null,null,null,null,null,null,null,null,"kotva 0,5 m",null,{"$f":"IF(X19=0,ROUNDUP(X8*0.45,0),ROUNDUP(X8*0.45,0)-X19)","v":15},2,30]
[null,{"$f":"IF($D$13=Data_podpora!$B$10,'stěna H'!$B$15,\"\")","v":""},{"$f":"IF($D$13=Data_podpora!$B$10,\"Výška terénu v místě pravé polovalby [m]\",\"\")","v":""},null,{"$f":"IF($D$13=Data_podpora!$B$10,\"[m]\",\"\")","v":""},null,null,null,null,null,null,null,null,null,null,null,null,null,null,null,null,"kotva dlouhá 1 m",null,0,3.8,0]
[null,null,null,null,null,null,null,"Patra lešení",null,null,null,null,null,null,null,null,null,null,null,null,null,"eLko / sloupek",null,{"$f":"IF(X22=0,COUNT(J46,L46,N46,P46,R46,T46,V46,X46,Z46,AB46)+1,(COUNT(J46,L46,N46,P46,R46,T46,V46,X46,Z46,AB46)+1)-X22)","v":4},5,20]
[null,null,null,null,null,null,null,null,null,null,null,null,null,null,null,null,null,null,null,null,null,"eLko 2 m",null,null,11.5,0]
[null,{"$f":"IF($D$21=Data_podpora!B30,\"→\",\"\")","v":""},null,null,{"$f":"IF(D21=Data_podpora!B30,\"[m]\",\"\")","v":""},null,null,"-0,5",{"$f":"I26-1","v":-0.8},{"$f":"J26-1","v":-0.8},{"$f":"K26-1","v":-0.8},{"$f":"L26-1","v":-0.8},{"$f":"M26-1","v":-0.8},null,null,null,null,null,null,null,null,"Háčko",null,{"$f":"2*(MAX(I46:AB46)-MIN(J46,L46,N46,P46,R46,T46,V46,X46,Z46,AB46))","v":2},9.6999999999999993,19.399999999999999]
[null,{"$f":"IF($D$21=Data_podpora!$B$30,\"→\",\"\")","v":""},{"$f":"IF(D21=Data_podpora!B30,\"Výška od terénu (zleva) [m]\",\"\")","v":""},null,{"$f":"IF(D21=Data_podpora!B30,\"[m]\",\"\")","v":""},null,null,"-3",{"$f":"I24-2","v":-5.8},-5.8,-5.8,-5.8,-5.8,null,null,null,null,null,null,null,null,"boční zábradlí",null,{"$f":"IF(X22=0,(MAX(J46-I46,L46-K46,N46-M46,P46-O46,R46-Q46,T46-S46,V46-U46,X46-W46,Z46-Y46,AB46-AA46)+1)*2,(MAX(J46-I46,L46-K46,N46-M46,P46-O46,R46-Q46,T46-S46,V46-U46,X46-W46,Z46-Y46,AB46-AA46)+1)*2-X22)","v":12},3,36]
[null,{"$f":"IF($D$21=Data_podpora!$B$30,\"→\",\"\")","v":""},{"$f":"IF(D21=Data_podpora!B30,\"Šířka [m]\",\"\")","v":""},null,{"$f":"IF(D21=Data_podpora!B30,\"[m]\",\"\")","v":""},null,null,"-2",-3.8,-3.8,-3.8,-3.8,-3.8,null,null,null,null,null,null,null,null,"okopové prkno 3m",null,{"$f":"IF(I44=3,J46-I46,0)+IF(K44=3,L46-K46,0)+IF(M44=3,N46-M46,0)+IF(O44=3,P46-O46,0)+IF(Q44=3,R46-Q46,0)+IF(S44=3,T46-S46,0)+IF(U44=3,V46-U46,0)+IF(W44=3,X46-W46,0)+IF(Y44=3,Z46-Y46,0)+IF(AA44=3,AB46-AA46,0)","v":26},6.5,169]
[null,null,null,null,null,null,null,"-1",{"$f":"I26-2","v":-1.8},{"$f":"$K$41-2","v":-1.8},{"$f":"$K$41-2","v":-1.8},{"$f":"$K$41-2","v":-1.8},{"$f":"$K$41-2","v":-1.8},null,null,null,null,null,null,null,null,"okopové prkno 2m",null,{"$f":"IF(I44=2,J46-I46,0)+IF(K44=2,L46-K46,0)+IF(M44=2,N46-M46,0)+IF(O44=2,P46-O46,0)+IF(Q44=2,R46-Q46,0)+IF(S44=2,T46-S46,0)+IF(U44=2,V46-U46,0)+IF(W44=2,X46-W46,0)+IF(Y44=2,Z46-Y46,0)+IF(AA44=2,AB46-AA46,0)","v":0},4.5,0]
[null,null,null,null,null,null,null,"0",{"$f":"$K$41","v":0.2},{"$f":"$K$41","v":0.2},{"$f":"$K$41","v":0.2},{"$f":"$K$41","v":0.2},{"$f":"$K$41","v":0.2},null,null,null,null,null,null,null,null,"konzola",null,0,10,0]
[null,null,null,null,null,null,null,"1",{"$f":"I26+$D$86","v":2.2000000000000002},{"$f":"J26+$D$86","v":2.2000000000000002},{"$f":"K26+$D$86","v":2.2000000000000002},{"$f":"L26+$D$86","v":2.2000000000000002},{"$f":"M26+$D$86","v":2.2000000000000002},null,null,null,null,null,null,null,null,"pevna spojka",null,{"$f":"J46*2","v":10},1.1499999999999999,11.5]
[null,null,null,null,null,null,null,"2",4.2,4.2,4.2,4.2,4.2,null,null,null,null,null,null,null,null,"otočná spojka",null,{"$f":"J46","v":5},1.35,6.75]
[null,null,null,null,null,null,null,"3",6.2,6.2,6.2,6.2,6.2,null,null,null,null,null,null,null,null,"závlačná spojka",null,{"$f":"J46*2","v":10},0.8,8]
[null,null,null,null,null,null,null,"4",8.1999999999999993,8.1999999999999993,8.1999999999999993,8.1999999999999993,8.1999999999999993,null,null,null,null,null,null,null,null,"CELKOVÁ HMOTNOST [kg]",null,null,null,{"$f":"SUM(Z6:Z29)","v":2313.0500000000002}]
[null,null,null,null,null,null,null,"5",10.199999999999999,10.199999999999999,10.199999999999999,10.199999999999999,10.199999999999999]
[null,null,null,null,null,null,null,"6",12.2,12.2,12.2,12.2,12.2]
[null,null,null,null,null,null,null,"7",14.2,14.2,14.2,14.2,14.2]
[null,null,null,null,null,null,null,"8",16.2,16.2,16.2,16.2,16.2]
[null,null,null,null,null,null,null,"9",18.2,18.2,18.2,18.2,18.2]
[null,null,null,null,null,null,null,"10",20.2,20.2,20.2,20.2,20.2]
[null,null,null,null,null,null,null,"11",22.2,22.2,22.2,22.2,22.2]
[null,null,null,null,null,null,null,"12",24.2,24.2,24.2,24.2,24.2]
[null,null,null,null,null,null,null,"13",26.2,26.2,26.2,26.2,26.2]
[]
[null,null,null,null,null,null,null,"LEŠENÍ","výška založení [m]",null,0.2,"[m]","nepsat nuly v kolonce \"patro\",pokud není sestava lešení využita",null,null,null,null,null,"Poznámka:",{"$f":"IF(Půdorys!I12=0,\"\",Půdorys!I12)","v":""}]
[null,null,null,null,null,null,null,null,"ZALOŽENÍ","VÝŠKA P.P.","ZALOŽENÍ","VÝŠKA P.P.","ZALOŽENÍ","VÝŠKA P.P.","ZALOŽENÍ","VÝŠKA P.P.","ZALOŽENÍ","VÝŠKA P.P.","ZALOŽENÍ","VÝŠKA P.P.","ZALOŽENÍ","VÝŠKA P.P.","ZALOŽENÍ","VÝŠKA P.P.","ZALOŽENÍ","VÝŠKA P.P.","ZALOŽENÍ","VÝŠKA P.P."]
[null,null,null,null,null,null,null,"SESTAVA",1,null,2,null,3,null,4,null,5,null,6,null,7,null,8,null,9,null,10]
[null,null,null,null,null,null,null,"DÉLKA SESTAVY",3,null,3,null,3,null,3,null,3,null,0,null,0,null,0,null,0,null,0]
[null,null,null,null,null,null,null,"\"potvrdit\""]
[null,null,null,null,null,null,null,"PATRO",1,5,1,6,0,6,0,6,0,5]
[null,null,null,null,null,null,null,"POSUN"]
[null,null,null,null,null,null,null,"plocha [m2]",{"$f":"(J46-I46)*$D$86*I44","v":24},null,{"$f":"L46*$D$86*K44","v":36},null,{"$f":"N46*$D$86*M44","v":36},null,{"$f":"P46*$D$86*O44","v":36},null,{"$f":"R46*$D$86*Q44","v":30},null,{"$f":"T46*$D$86*S44","v":0},null,{"$f":"V46*$D$86*U44","v":0},null,{"$f":"X46*$D$86*W44","v":0},null,{"$f":"Z46*$D$86*Y44","v":0},null,{"$f":"AB46*$D$86*AA44","v":0}]
[null,null,null,null,null,null,null,"výška",{"$f":"IF(I46=-0.5,M22,INDEX($M$23:$M$39,I46+4))","v":2.2000000000000002},{"$f":"INDEX($M$23:$M$39,J46+4)","v":10.199999999999999},{"$f":"IF(K46=-0.5,M22,INDEX($M$23:$M$39,K46+4))","v":2.2000000000000002},{"$f":"INDEX($M$23:$M$39,L46+4)","v":12.2},{"$f":"IF(M46=-0.5,M22,INDEX($M$23:$M$39,M46+4))","v":0.2},{"$f":"INDEX($M$23:$M$39,N46+4)","v":12.2},{"$f":"IF(O46=-0.5,M22,INDEX($M$23:$M$39,O46+4))","v":0.2},{"$f":"INDEX($M$23:$M$39,P46+4)","v":12.2},{"$f":"IF(Q46=-0.5,M22,INDEX($M$23:$M$39,Q46+4))","v":0.2},{"$f":"INDEX($M$23:$M$39,R46+4)","v":10.199999999999999},{"$f":"IF(S46=-0.5,M22,INDEX($M$23:$M$39,S46+4))","v":0.2},{"$f":"INDEX($M$23:$M$39,T46+4)","v":0.2},{"$f":"IF(U46=-0.5,M22,INDEX($M$23:$M$39,U46+4))","v":0.2},{"$f":"INDEX($M$23:$M$39,V46+4)","v":0.2},{"$f":"IF(W46=-0.5,M22,INDEX($M$23:$M$39,W46+4))","v":0.2},{"$f":"INDEX($M$23:$M$39,X46+4)","v":0.2},{"$f":"IF(Y46=-0.5,M22,INDEX($M$23:$M$39,Y46+4))","v":0.2},{"$f":"INDEX($M$23:$M$39,Z46+4)","v":0.2},{"$f":"IF(AA46=-0.5,M22,INDEX($M$23:$M$39,AA46+4))","v":0.2},{"$f":"INDEX($M$23:$M$39,AB46+4)","v":0.2}]
[]
[]
[]
[]
[]
[null,null,null,null,null,null,null,-1,{"$f":"$I$49","v":2.2000000000000002},{"$f":"$J$49","v":10.199999999999999}]
[null,null,null,null,null,null,null,0,{"$f":"$I$49","v":2.2000000000000002},{"$f":"$J$49","v":10.199999999999999}]
[null,null,null,null,null,null,null,1,{"$f":"$I$49","v":2.2000000000000002},{"$f":"$J$49","v":10.199999999999999}]
[null,null,null,null,null,null,null,2,{"$f":"$I$49","v":2.2000000000000002},{"$f":"$J$49","v":10.199999999999999},{"$f":"$K$49","v":2.2000000000000002},{"$f":"$L$49","v":12.2}]
[null,null,null,null,null,null,null,3,null,null,{"$f":"$K$49","v":2.2000000000000002},{"$f":"$L$49","v":12.2}]
[null,null,null,null,null,null,null,4,null,null,{"$f":"$K$49","v":2.2000000000000002},{"$f":"$L$49","v":12.2}]
[null,null,null,null,null,null,null,5,null,null,{"$f":"$K$49","v":2.2000000000000002},{"$f":"$L$49","v":12.2},{"$f":"$M$49","v":0.2},{"$f":"$N$49","v":12.2}]
[null,null,null,null,null,null,null,6,null,null,null,null,{"$f":"$M$49","v":0.2},{"$f":"$N$49","v":12.2}]
[null,null,null,null,null,null,null,7,null,null,null,null,{"$f":"$M$49","v":0.2},{"$f":"$N$49","v":12.2}]
[null,null,null,null,null,null,null,8,null,null,null,null,{"$f":"$M$49","v":0.2},{"$f":"$N$49","v":12.2},{"$f":"$O$49","v":0.2},{"$f":"$P$49","v":12.2}]
[null,null,null,null,null,null,null,9,null,null,null,null,null,null,{"$f":"$O$49","v":0.2},{"$f":"$P$49","v":12.2}]
[null,null,null,null,null,null,null,10,null,null,null,null,null,null,{"$f":"$O$49","v":0.2},{"$f":"$P$49","v":12.2}]
[null,null,null,null,null,null,null,11,null,null,null,null,null,null,{"$f":"$O$49","v":0.2},{"$f":"$P$49","v":12.2},{"$f":"$Q$49","v":0.2},{"$f":"$R$49","v":10.199999999999999}]
[null,null,null,null,null,null,null,12,null,null,null,null,null,null,null,null,{"$f":"$Q$49","v":0.2},{"$f":"$R$49","v":10.199999999999999}]
[null,null,"Pomocný výpočet počtu sestav lešení:",null,null,null,null,13,null,null,null,null,null,null,null,null,{"$f":"$Q$49","v":0.2},{"$f":"$R$49","v":10.199999999999999}]
[null,null,"Délka:",null,null,null,null,14,null,null,null,null,null,null,null,null,{"$f":"$Q$49","v":0.2},{"$f":"$R$49","v":10.199999999999999},{"$f":"$S$49","v":0.2},{"$f":"$T$49","v":0.2}]
[null,null,"přesah za roh objektu:","Ne",null,null,null,15,null,null,null,null,null,null,null,null,null,null,{"$f":"$S$49","v":0.2},{"$f":"$T$49","v":0.2}]
[null,null,"Požadovaná minimální délka lešení [m]",{"$f":"IF(D71=Data_podpora!B17,'stěna H'!D12+2,IF('stěna H'!D71=Data_podpora!B14,'stěna H'!D12+0.5,IF(D71=Data_podpora!B13,'stěna H'!D12,'stěna H'!D12+1)))","v":13.25},"[m]",null,null,16,null,null,null,null,null,null,null,null,null,null,{"$f":"$S$49","v":0.2},{"$f":"$T$49","v":0.2}]
[null,null,"Počet sestav lešení (3m) [-]",{"$f":"ROUNDDOWN(D72/E73,0)","v":4},"3",{"$f":"D73*E73","v":12},"[m]",17,null,null,null,null,null,null,null,null,null,null,{"$f":"$S$49","v":0.2},{"$f":"$T$49","v":0.2},{"$f":"$U$49","v":0.2},{"$f":"$V$49","v":0.2}]
[null,null,"Počet sestav lešení (2m) [-]",{"$f":"ROUNDDOWN(MOD(D72,E73)/E74,0)","v":0},"2",{"$f":"D74*E74","v":0},"[m]",18,null,null,null,null,null,null,null,null,null,null,null,null,{"$f":"$U$49","v":0.2},{"$f":"$V$49","v":0.2}]
[null,null,"Počet sestav lešení (0,75m) [-]",{"$f":"ROUNDUP(D72-(D73*E73+D74*E74),0)","v":2},"0,75",{"$f":"D75*E75","v":1.5},"[m]",19,null,null,null,null,null,null,null,null,null,null,null,null,{"$f":"$U$49","v":0.2},{"$f":"$V$49","v":0.2}]
[null,null,"Reálná délka lešení [m]",{"$f":"D73*E73+D74*E74+D75*E75","v":13.5},"[m]",null,null,20,null,null,null,null,null,null,null,null,null,null,null,null,{"$f":"$U$49","v":0.2},{"$f":"$V$49","v":0.2},{"$f":"$W$49","v":0.2},{"$f":"$X$49","v":0.2}]
[null,null,null,null,null,null,null,21,null,null,null,null,null,null,null,null,null,null,null,null,null,null,{"$f":"$W$49","v":0.2},{"$f":"X76","v":0.2}]
[null,null,"Výška:",null,null,null,null,22,null,null,null,null,null,null,null,null,null,null,null,null,null,null,{"$f":"$W$49","v":0.2},{"$f":"X77","v":0.2}]
[null,null,"Lešení pro:","Fasádu",null,null,null,23,null,null,null,null,null,null,null,null,null,null,null,null,null,null,{"$f":"$W$49","v":0.2},{"$f":"X78","v":0.2},{"$f":"$Y$49","v":0.2},{"$f":"$Z$49","v":0.2}]
[null,null,"Výška zábradlí posledního patra [m]",1,"[m]",null,null,24,null,null,null,null,null,null,null,null,null,null,null,null,null,null,null,null,{"$f":"$Y$49","v":0.2},{"$f":"Z79","v":0.2}]
[null,null,"Požadovaná výška [m]",{"$f":"IF(D79=Data_podpora!B22,'stěna H'!D14+D80,'stěna H'!D14)","v":13.649999999999977},"[m]",null,null,25,null,null,null,null,null,null,null,null,null,null,null,null,null,null,null,null,{"$f":"$Y$49","v":0.2},{"$f":"Z80","v":0.2}]
["Založení",null,"Výška nejnižžšího bodu terénu [m]",{"$f":"MIN(D4,D5,D6,D8)","v":-0.75},"[m]",null,null,26,null,null,null,null,null,null,null,null,null,null,null,null,null,null,null,null,{"$f":"$Y$49","v":0.2},{"$f":"Z81","v":0.2},{"$f":"$AA$49","v":0.2},{"$f":"$AB$49","v":0.2}]
[null,null,"Výška nejvyššího  bodu terénu [m]",{"$f":"D8","v":0.75},"[m]",null,null,27,null,null,null,null,null,null,null,null,null,null,null,null,null,null,null,null,null,null,{"$f":"$AA$49","v":0.2},{"$f":"AB82","v":0.2}]
[null,null,"Rozdíl max a min [m]",{"$f":"D83-D82","v":1.5},"[m]",{"$f":"IF(D84<0.4,\"(Patky 0,4m)\",IF(D84<=1,\"(Patky 1m)\",IF(2>=D84>1,\"(Rám 1m)\",IF(5>D84>2,\"(Rám 2m)\",\"\"))))","v":"(Rám 1m)"},null,28,null,null,null,null,null,null,null,null,null,null,null,null,null,null,null,null,null,null,{"$f":"$AA$49","v":0.2},{"$f":"AB83","v":0.2}]
[null,"#","Výška založení [m]",{"$f":"D8+0.1","v":0.85},"[m]",null,null,29,null,null,null,null,null,null,null,null,null,null,null,null,null,null,null,null,null,null,{"$f":"$AA$49","v":0.2},{"$f":"AB84","v":0.2}]
[null,null,"Modulová výška patra lešení [m]",2,"[m]",null,null,30]
[null,null,"Počet pater lešení [-]; výška [m])",{"$f":"IF(D81-D85<11,ROUNDDOWN((D81-D85)/2.15,0),ROUNDDOWN((D81-D85)/2.1,0))","v":6},"pater",{"$f":"INDEX(M27:M39,D87)","v":12.2},"[m]",31]
[null,null,"Reálná výška lešení [m]",{"$f":"D87*D86+D85+D80","v":13.85},"[m]"]
[]
["Uskočení pater","→","Hranice posouzení uskočení","4",null,{"$f":"INDEX(M27:M39,D90)","v":8.1999999999999993},"[m]"]
[null,null,"Zbývající výška do hřebene",{"$f":"$D$14-F90","v":5.449999999999978},"[m]"]
[null,null,"Počet uskočených pater",{"$f":"IF(D91<11,ROUNDDOWN((D91)/2.6,0),ROUNDDOWN((D91)/2.6,0))","v":2},{"$f":"IF(D92=1,\"patro\",IF(D92<=4,\"patra\",\"pater\"))","v":"patra"}]
[null,null,"Rozdíl výšky okapu a nejbližšího patra",{"$f":"$J$4-(INDEX(M27:M39,D90))","v":3.5500000000000007},"[m]"]
[null,null,"Rozdíl výšek na 3 m sestavu",{"$f":"$N$5*$E$73","v":0.86037735849055563},"[m]"]
[null,{"$f":"IF($D$92>=1,1,\"\")","v":1},"První sestava",{"$f":"D93+D94","v":4.4103773584905568},"[m]",{"$f":"IF(D$95<=2,\"posoudit další\",IF(D$95<=3.2,\"ponechat\",\"pokračuje patrem\"))","v":"pokračuje patrem"}]
[null,{"$f":"IF(1<=$D$92,2,\"X\")","v":2},"Druhá sestava",{"$f":"IF(F95=\"ponechat\",$D$93+$D$94*B96,$D$93+$D$94*B96-2)","v":3.270754716981112},"[m]",{"$f":"IF(D96<2,\"posoudit další\",IF(D96<=3.2,\"ponechat\",IF(D96>3.2,\"pokračuje patrem\",\"\")))","v":"pokračuje patrem"}]
[null,{"$f":"IF(2<=$D$92,3,\"X\")","v":3},"Třetí sestava",{"$f":"IF(F96=\"ponechat\",$D$93+$D$94*B97,$D$93+$D$94*B97-2)","v":4.1311320754716672},"[m]",{"$f":"IF(D97<2,\"posoudit další\",IF(D97<=3.2,\"ponechat\",IF(D97>3.2,\"pokračuje patrem\",\"\")))","v":"pokračuje patrem"}]
[null,{"$f":"IF(3<=$D$92,4,\"X\")","v":"X"},"Čtvrtá sestava",{"$f":"IF(F97=\"ponechat\",$D$93+$D$94*B98,$D$93+$D$94*B98-2)","v":{"$error":"#VALUE!"}},"[m]",{"$f":"IF(D98<2,\"posoudit další\",IF(D98<=3.2,\"ponechat\",IF(D98>3.2,\"pokračuje patrem\",\"\")))","v":{"$error":"#VALUE!"}}]
[]
[]
[]
[]
[null,null,"NAKLÁDACÍ LIST"]
[]
[null,null,"stavitelná patka 0,5m","počet kusů"]
[null,null,"stavitelná patka 1m",{"$f":"IF(D107>=0,($D$73+$D$74+$D$75)*2+2-D107,($D$73+$D$74+$D$75)*2+2)","v":12}]
[null,null,"rám 2m",2]
[null,null,"rám 1m",{"$f":"(($D$73+$D$74+$D$75)+1)*$D$87","v":42}]
[null,null,"podlaha 3m",{"$f":"IF(D85>=1,($D$73+$D$74+$D$75)+1,0)","v":0}]
[null,null,"podlaha 2m",{"$f":"(D73*D87-$D112)*2","v":36}]
[null,null,"průlezová podlaha 3m",{"$f":"D74*D87","v":0}]
[null,null,"zábradlí 3m",{"$f":"D87","v":6}]
[null,null,"zábradlí 2m",{"$f":"(1+$D$87*2)*D73","v":52}]
[null,null,"diagonální úchyt",{"$f":"(1+$D$87*2)*D74","v":0}]
[null,null,"diagonála 3m"]
[null,null,"diagonála 2m",{"$f":"$D$87*(ROUNDUP((D73+D74+D75)/4,0))","v":12}]
[null,null,"kotva 0,5 m",{"$f":"IF(D116=0,$D$87*ROUNDUP(D74/4,0),0)","v":0}]
[null,null,"kotva dlouhá 1 m",{"$f":"(($D$87-1)*SUM(D73:D75))/2","v":15}]
[null,null,"eLko / sloupek"]
[null,null,"eLko 2 m",{"$f":"SUM(D73:D75)+1","v":7}]
[null,null,"Háčko"]
[null,null,"boční zábradlí"]
[null,null,"okopové prkno 3m",{"$f":"D87*2","v":12}]
[null,null,"okopové prkno 2m",{"$f":"D73*D87","v":24}]
[null,null,"konzola",{"$f":"D74*D87","v":0}]
[null,null,"pevna spojka"]
[null,null,"otočná spojka"]
[null,null,"závlačná spojka"]

{"sheet":"Rekapitulace","index":10,"n_rows":75,"n_cols":23,"rows_kept":75,"cut":false,"hidden":false,"merged":[[41,0,42,0],[41,11,42,11],[41,2,42,2],[41,1,42,1],[8,1,9,1],[7,2,7,3],[8,2,9,2],[8,3,9,3],[8,4,9,4],[8,0,9,0]]}
[null,"Rekapitulace"]
[null,"Název zakázky:",{"$f":"Nabídka!A7","v":"Akce:"}]
[null,"Výška nejvyššího patra:",{"$f":"MAX('stěna A'!I46:AB46,'stěna B'!I46:AB47,'stěna C'!I46:AB46,'stěna D'!I46:AB46,'stěna E'!I46:AB46,'stěna F'!I46:AB46,'stěna G'!I46:AB46,'stěna H'!I46:AB46)","v":6}]
[null,"Počet sestav lešení na jedno patro:",null,"3 m",{"$f":"COUNTIF('stěna A'!I44:AB44,Data_podpora!B29)+COUNTIF('stěna B'!I44:AB44,Data_podpora!B29)+COUNTIF('stěna C'!I44:AB44,Data_podpora!B29)+COUNTIF('stěna D'!I44:AB44,Data_podpora!B29)+COUNTIF('stěna E'!I44:AB44,Data_podpora!B29)+COUNTIF('stěna F'!I44:AB44,Data_podpora!B29)+COUNTIF('stěna G'!I44:AB44,Data_podpora!B29)+COUNTIF('stěna H'!I44:AB44,Data_podpora!B29)","v":42}]
[null,null,null,"2 m",{"$f":"COUNTIF('stěna A'!I44:AB44,Data_podpora!B28)+COUNTIF('stěna B'!I44:AB44,Data_podpora!B28)+COUNTIF('stěna C'!I44:AB44,Data_podpora!B28)+COUNTIF('stěna D'!I44:AB44,Data_podpora!B28)+COUNTIF('stěna E'!I44:AB44,Data_podpora!B28)+COUNTIF('stěna F'!I44:AB44,Data_podpora!B28)+COUNTIF('stěna G'!I44:AB44,Data_podpora!B28)+COUNTIF('stěna H'!I44:AB44,Data_podpora!B28)","v":1}]
[]
[null,"CELKOVÝ NAKLÁDACÍ LIST ZAKÁZKY:",null,null,null,null,"VYTÍŽENOST ODVOZNÍHO PROSTŘEDKU:",null,null,null,null,"pro navezení lešení bez uvažování postupu výstavby, orientace podle hmotnosti všeho"]
[null,"Celková plocha lešení:",{"$f":"'stěna A'!Y3+'stěna B'!Y3+'stěna C'!Y3+'stěna D'!Y3+'stěna E'!Y3+'stěna F'!Y3+'stěna G'!Y3+'stěna H'!Y3","v":1593},null,"[m2]",null,"[kg]","1. cesta",null,{"$f":"IF(I10+I11<=H10,\"Naložit  AUTO\",\"\")","v":""},null,"2. cesta",null,{"$f":"IF(M10+M11<=L10,\"Naložit  AUTO\",\"\")","v":""},null,"3. cesta",null,{"$f":"IF(Q10+Q11<=P10,\"Naložit AUTO\",\"\")","v":""},null,"4. cesta",{"$f":"IF(U10+U11=0,\"Žádný náklad\",\"\")","v":""},{"$f":"IF(U10+U11<=T10,\"Naložit  AUTO\",\"\")","v":"Naložit  AUTO"}]
["Auto/Závěs","Komponenta","počet kusů [ks]","jednotková hmotnost [kg/ks]","hmotnost [kg]",null,null,"KAPACITA","ZBÝVÁ","VYUŽITO","VOLNO","KAPACITA","ZBÝVÁ","VYUŽITO","VOLNO","KAPACITA","ZBÝVÁ","VYUŽITO","VOLNO","KAPACITA","ZBÝVÁ","VYUŽITO","VOLNO"]
[null,null,null,null,null,null,"AUTO",2500,{"$f":"IF(E36<=H10,SUM(E11:E34),SUM(E11:E14,E31:E34,E20:E28,E18/2,E19/2))","v":7550.85},{"$f":"IF(I10<=H10,I10,H10)","v":2500},{"$f":"IF((H10-J10)<=0,0,H10-J10)","v":0},2500,{"$f":"IF(I10-J10<=0,0,(I10-J10))","v":5050.8500000000004},{"$f":"IF(M10<=L10,L10-M10,L10)","v":2500},{"$f":"IF((L10-M10)<=0,0,L10-M10)","v":0},2500,{"$f":"IF(M10-N10<=0,0,(M10-N10))","v":2550.8500000000004},{"$f":"IF(Q10<=P10,Q10,P10)","v":2500},{"$f":"IF((P10-Q10)<=0,0,P10-Q10)","v":0},2500,{"$f":"IF(Q10-R10<=0,0,(Q10-R10))","v":50.850000000000364},{"$f":"IF(U10<=T10,U10,T10)","v":50.850000000000364},{"$f":"IF((T10-U10)<=0,0,T10-U10)","v":2449.1499999999996}]
["A","stavitelná patka 0,5m",{"$f":"'stěna A'!X6+'stěna B'!X6+'stěna C'!X6+'stěna D'!X6+'stěna E'!X6+'stěna F'!X6+'stěna G'!X6+'stěna H'!X6","v":102},3.1,{"$f":"D11*C11","v":316.2},null,"ZÁVĚS",3500,{"$f":"IF(E36<=H10,0,SUM(E15:E17,E29:E30,E18/2,E19/2))","v":12054.25},{"$f":"IF(I11<=H11,I11,H11)","v":3500},{"$f":"IF((H11-J11)<=0,0,H11-J11)","v":0},3500,{"$f":"IF(I11-J11<=0,0,(I11-J11))","v":8554.25},{"$f":"IF(M11<=L11,M11,L11)","v":3500},{"$f":"IF((L11-N11)<=0,0,L11-N11)","v":0},3500,{"$f":"IF(M11-N11<=0,0,(M11-N11))","v":5054.25},{"$f":"IF(Q11<=P11,Q11,P11)","v":3500},{"$f":"IF((P11-R11)<=0,0,P11-R11)","v":0},3500,{"$f":"IF(Q11-R11<=0,0,(Q11-R11))","v":1554.25},{"$f":"IF(U11<=T11,U11,T11)","v":1554.25},{"$f":"IF((T11-V11)<=0,0,T11-V11)","v":1945.75}]
["A","stavitelná patka 1m",{"$f":"'stěna A'!X7+'stěna B'!X7+'stěna C'!X7+'stěna D'!X7+'stěna E'!X7+'stěna F'!X7+'stěna G'!X7+'stěna H'!X7","v":0},4.7,{"$f":"D12*C12","v":0}]
["A","rám 2 m",{"$f":"'stěna A'!X8+'stěna B'!X8+'stěna C'!X8+'stěna D'!X8+'stěna E'!X8+'stěna F'!X8+'stěna G'!X8+'stěna H'!X8","v":261},16.5,{"$f":"D13*C13","v":4306.5}]
["A","rám 1 m",{"$f":"'stěna A'!X9+'stěna B'!X9+'stěna C'!X9+'stěna D'!X9+'stěna E'!X9+'stěna F'!X9+'stěna G'!X9+'stěna H'!X9","v":1},11.3,11.3]
["Z","podlaha 3 m",{"$f":"('stěna A'!X10+'stěna B'!X10+'stěna C'!X10+'stěna D'!X10+'stěna E'!X10+'stěna F'!X10+'stěna G'!X10+'stěna H'!X10)+(('stěna A'!X12+'stěna B'!X12+'stěna C'!X12+'stěna E'!X12+'stěna D'!X12+'stěna F'!X12+'stěna G'!X12+'stěna H'!X12)-C17)*2","v":394},22,8668]
["Z","podlaha 2 m",{"$f":"'stěna A'!X11+'stěna B'!X11+'stěna C'!X11+'stěna D'!X11+'stěna E'!X11+'stěna F'!X11+'stěna G'!X11+'stěna H'!X11","v":10},14.5,145]
["Z","průlezová podlaha 3 m",{"$f":"MAX('stěna A'!I46:AB46,'stěna B'!I46:AB46,'stěna C'!I46:AB46,'stěna D'!I46:AB46,'stěna E'!I46:AB46,'stěna F'!I46:AB46,'stěna G'!I46:AB46,'stěna H'!I46:AB46)*ROUNDUP(COUNT(Půdorys!C5:C15)/3,0)","v":18},28,504]
["A/Z","zábradlí 3 m",{"$f":"'stěna A'!X13+'stěna B'!X13+'stěna C'!X13+'stěna D'!X13+'stěna E'!X13+'stěna F'!X13+'stěna G'!X13+'stěna H'!X13","v":472},5.5,2596]
["A/Z","zábradlí 2 m",{"$f":"'stěna A'!X14+'stěna B'!X14+'stěna C'!X14+'stěna D'!X14+'stěna E'!X14+'stěna F'!X14+'stěna G'!X14+'stěna H'!X14","v":11},3.5,38.5]
["A","diagonální úchyt",{"$f":"'stěna A'!X15+'stěna B'!X15+'stěna C'!X15+'stěna D'!X15+'stěna E'!X15+'stěna F'!X15+'stěna G'!X15+'stěna H'!X15","v":12},0.5,6]
["A","diagonála 3 m",{"$f":"'stěna A'!X16+'stěna B'!X16+'stěna C'!X16+'stěna D'!X16+'stěna E'!X16+'stěna F'!X16+'stěna G'!X16+'stěna H'!X16","v":62},11,682]
["A","diagonála 2 m",{"$f":"'stěna A'!X17+'stěna B'!X17+'stěna C'!X17+'stěna D'!X17+'stěna E'!X17+'stěna F'!X17+'stěna G'!X17+'stěna H'!X17","v":0},8,0]
["A","kotva 0,5 m",{"$f":"'stěna A'!X18+'stěna B'!X18+'stěna C'!X18+'stěna D'!X18+'stěna E'!X18+'stěna F'!X18+'stěna G'!X18+'stěna H'!X18","v":120},2,240]
["A","kotva dlouhá 1 m",{"$f":"'stěna A'!X19+'stěna B'!X19+'stěna C'!X19+'stěna D'!X19+'stěna E'!X19+'stěna F'!X19+'stěna G'!X19+'stěna H'!X19","v":0},3.8,0]
["A","eLko / sloupek",{"$f":"'stěna A'!X20+'stěna B'!X20+'stěna C'!X20+'stěna D'!X20+'stěna E'!X20+'stěna F'!X20+'stěna G'!X20+'stěna H'!X20","v":47},5,235]
["A","eLko 2 m",{"$f":"'stěna A'!X21+'stěna B'!X21+'stěna C'!X21+'stěna D'!X21+'stěna E'!X21+'stěna F'!X21+'stěna G'!X21+'stěna H'!X21","v":0},11.5,0]
["A","Háčko",{"$f":"'stěna A'!X22+'stěna B'!X22+'stěna C'!X22+'stěna D'!X22+'stěna E'!X22+'stěna F'!X22+'stěna G'!X22+'stěna H'!X22","v":4},9.6999999999999993,38.799999999999997]
["A","boční zábradlí",{"$f":"('stěna A'!X23+'stěna B'!X23+'stěna C'!X23+'stěna D'!X23+'stěna E'!X23+'stěna F'!X23+'stěna G'!X23+'stěna H'!X23)/2","v":48},3,144]
["Z","okopové prkno 3 m",{"$f":"'stěna A'!X24+'stěna B'!X24+'stěna C'!X24+'stěna D'!X24+'stěna E'!X24+'stěna F'!X24+'stěna G'!X24+'stěna H'!X24","v":215},6.5,1397.5]
["Z","okopové prkno 2 m",{"$f":"'stěna A'!X25+'stěna B'!X25+'stěna C'!X25+'stěna D'!X25+'stěna E'!X25+'stěna F'!X25+'stěna G'!X25+'stěna H'!X25","v":5},4.5,22.5]
["A","konzola",{"$f":"'stěna A'!X26+'stěna B'!X26+'stěna C'!X26+'stěna D'!X26+'stěna E'!X26+'stěna F'!X26+'stěna G'!X26+'stěna H'!X26","v":0},10,0]
["A","pevná spojka",{"$f":"('stěna A'!X27+'stěna B'!X27+'stěna C'!X27+'stěna D'!X27+'stěna E'!X27+'stěna F'!X27+'stěna G'!X27+'stěna H'!X27)*1.3","v":104},1.1499999999999999,119.6]
["A","otočná spojka",{"$f":"('stěna A'!X28+'stěna B'!X28+'stěna C'!X28+'stěna D'!X28+'stěna E'!X28+'stěna F'!X28+'stěna G'!X28+'stěna H'!X28)*1.3","v":52},1.35,70.2]
["A","závlačná spojka",{"$f":"('stěna A'!X29+'stěna B'!X29+'stěna C'!X29+'stěna D'!X29+'stěna E'!X29+'stěna F'!X29+'stěna G'!X29+'stěna H'!X29)","v":80},0.8,64]
["A","spojovací trubka 0,5 m",{"$f":"SUM('stěna A'!J46,'stěna B'!J46,'stěna C'!$J$46,'stěna D'!$J$46,'stěna E'!$J$46,'stěna F'!$J$46,'stěna G'!$J$46,'stěna H'!$J$46)","v":40},2,80]
[null,"CELKOVÁ HMOTNOST [kg]",null,null,{"$f":"SUM(E11:E35)","v":19685.099999999999}]
[]
[]
[]
[]
[null,"NASTAVITELNÝ NAKLÁDACÍ LIST ZAKÁZKY:",null,null,null,"zohlednění nejen hmotnosti, ale i postupu výstavby"]
["Auto/Závěs",{"$f":"B9","v":"Komponenta"},{"$f":"C9","v":"počet kusů [ks]"},"1. cesta",null,"2. cesta",null,"3. cesta",null,"4. cesta",null,"ZBÝVÁ",null,"Časový výpočet:",null,"Montáž","Demontáž"]
[null,null,null,"POČET [ks]","HMOTNOST [kg]","POČET [ks]","HMOTNOST [kg]","POČET [ks]","HMOTNOST [kg]","POČET [ks]","HMOTNOST [kg]",null,null,"Počet pracovníků:",null,6,2]
["A","stavitelná patka 0,5m",{"$f":"C11","v":102},102,{"$f":"D11*D44","v":316.2},0,{"$f":"D11*F44","v":0},null,{"$f":"D11*H44","v":0},null,{"$f":"D11*J44","v":0},{"$f":"C11-SUM(D44,F44,H44,J44)","v":0},null,"Koeficient počtu pater:",null,{"$f":"VLOOKUP($C$3,List1!$O$11:$P$21,2)","v":1.5},{"$f":"VLOOKUP($C$3,List1!$O$11:$P$21,2)","v":1.5}]
["A","stavitelná patka 1m",0,null,0,null,0,null,0,null,0,0,null,"Přibližná doba trvání [h]:",null,{"$f":"($C$8/List1!$F$9/$P$43)*P44","v":34.788687954451184},{"$f":"$C$8/List1!K9/$P$43","v":10.422664224025125}]
["A","rám 2m",261,92,1518,92,1518,74,1221,null,0,3]
["A","rám 1m",1,null,0,null,0,null,0,null,0,1]
["Z","podlaha 3m",394,90,1980,100,2200,100,2200,96,2112,8]
["Z","podlaha 2m",10,8,116,2,29,null,0,null,0,0]
["Z","průlezová podlaha 3m",18,6,168,6,168,6,168,null,0,0]
["A/Z","zábradlí 3m",472,150,825,150,825,150,825,14,77,8]
["A/Z","zábradlí 2m",11,6,21,5,17.5,null,0,null,0,0]
["A","diagonální úchyt",12,12,6,null,0,null,0,null,0,0]
["A","diagonála 3m",62,20,220,20,220,22,242,null,0,0]
["A","diagonála 2m",0,null,0,null,0,null,0,null,0,0]
["A","kotva 0,5 m",120,30,60,50,100,39,78,null,0,1]
["A","kotva dlouhá 1 m",0,null,0,null,0,null,0,null,0,0]
["A","eLko / sloupek",47,null,0,null,0,47,235,null,0,0]
["A","eLko 2 m",0,null,0,null,0,null,0,null,0,0]
["A","Háčko",4,null,0,null,0,4,38.799999999999997,null,0,0]
["A","boční zábradlí",48,10,30,20,60,10,30,8,24,0]
["Z","okopové prkno 3m",215,50,325,50,325,40,260,71,461.5,4]
["Z","okopové prkno 2m",5,5,22.5,0,0,null,0,null,0,0]
["A","konzola",0,null,0,null,0,null,0,null,0,0]
["A","pevná spojka",104,40,46,30,34.5,34,39.099999999999994,null,0,0]
["A","otočná spojka",52,20,27,20,27,12,16.200000000000003,null,0,0]
["A","závlačná spojka",80,20,16,20,16,20,16,20,16,0]
["A","spojovací trubka 0,5 m",40,10,20,10,20,10,20,10,20,0]
[null,"HMOTNOST CELKEM [kg]",{"$f":"E69+G69+I69+K69","v":19376.300000000003},null,{"$f":"SUM(E44:E68)","v":5716.7},null,{"$f":"SUM(G44:G68)","v":5560},null,{"$f":"SUM(I44:I68)","v":5389.1},null,{"$f":"SUM(K44:K68)","v":2710.5}]
[]
[null,"VYTÍŽENOST ODVOZNÍHO PROSTŘEDKU:",null,null,null,"pro navezení lešení dle potřeby postupu výstavby"]
[null,"[kg]","1. cesta",null,{"$f":"IF(D74+D75<=C74,\"Naložit  AUTO\",\"\")","v":""},null,"2. cesta",null,{"$f":"IF(H74+H75<=G74,\"Naložit  AUTO\",\"\")","v":""},null,"3. cesta",null,{"$f":"IF(L74+L75<=K74,\"Naložit  AUTO\",\"\")","v":""},null,"4. cesta",null,{"$f":"IF(P74+P75<=O74,\"Naložit  AUTO\",\"\")","v":""}]
[null,null,"KAPACITA","ZBÝVÁ","VYUŽITO","VOLNO","KAPACITA","ZBÝVÁ","VYUŽITO","VOLNO","KAPACITA","ZBÝVÁ","VYUŽITO","VOLNO","KAPACITA","ZBÝVÁ","VYUŽITO","VOLNO"]
[null,"AUTO",2500,{"$f":"IF(E36<=C74,SUM(E44:E68),SUM(E44:E68)-E48-E49-E50-E62-E63-E51)","v":2280.1999999999998},{"$f":"IF(D74<=C74,D74,C74)","v":2280.1999999999998},{"$f":"IF((C74-E74)<=0,0,C74-E74)","v":219.80000000000018},2500,{"$f":"IF(G69<=G74,SUM(G44:G68),SUM(G44:G68)-G48-G49-G50-G62-G63-G51/2)","v":2425.5},{"$f":"IF(H74<=G74,H74,G74)","v":2425.5},{"$f":"IF((G74-I74)<=0,0,G74-I74)","v":74.5},2500,{"$f":"IF(I69<=K74,SUM(I44:I68),SUM(I44:I68)-I48-I49-I50-I62-I63-I51)","v":1936.1000000000004},{"$f":"IF(L74<=K74,L74,K74)","v":1936.1000000000004},{"$f":"IF((K74-M74)<=0,0,K74-M74)","v":563.89999999999964},2500,{"$f":"IF(K69<=O74,SUM(K44:K68),SUM(K44:K68)-K48-K49-K50-K62-K63-K51)","v":60},{"$f":"IF(P74<=O74,P74,O74)","v":60},{"$f":"IF((O74-Q74)<=0,0,O74-Q74)","v":2440}]
[null,"ZÁVĚS",3500,{"$f":"E48+E49+E50+E62+E63+E51","v":3436.5},{"$f":"IF(D75<=C75,D75,C75)","v":3436.5},{"$f":"IF((C75-E75)<=0,0,C75-E75)","v":63.5},3500,{"$f":"G48+G49+G50+G62+G63+G51/2","v":3134.5},{"$f":"IF(H75<=G75,H75,G75)","v":3134.5},{"$f":"IF((G75-I75)<=0,0,G75-I75)","v":365.5},3500,{"$f":"I48+I49+I50+I62+I63+I51","v":3453},{"$f":"IF(L75<=K75,L75,K75)","v":3453},{"$f":"IF((K75-M75)<=0,0,K75-M75)","v":47},3500,{"$f":"K48+K49+K50+K62+K63+K51","v":2650.5},{"$f":"IF(P75<=O75,P75,O75)","v":2650.5},{"$f":"IF((O75-Q75)<=0,0,O75-Q75)","v":849.5}]

{"sheet":"Předávací protokol","index":11,"n_rows":59,"n_cols":7,"rows_kept":59,"cut":false,"hidden":false,"merged":[[52,0,52,1],[46,0,50,7],[14,5,14,6],[7,1,7,7],[0,0,0,7],[9,1,10,7],[2,1,2,7],[3,1,3,7],[4,1,4,7],[5,1,5,7],[6,1,6,7]]}
["Protokol o předání a převzetí rámového lešení"]
[]
["Předávající"]
["(Zhotovitel)",{"$f":"VLOOKUP($B$3,Předávací_protokol_data!$A$3:$C$5,2)","v":{"$error":"#N/A"}}]
[null,{"$f":"VLOOKUP($B$3,Předávací_protokol_data!$A$3:$C$5,3)","v":{"$error":"#N/A"}}]
["Přebírající"]
["(Objednatel)",{"$f":"VLOOKUP('Předávací protokol'!$B$6:$H$6,Předávací_protokol_data!$A$7:$C$50,2)","v":{"$error":"#N/A"}}]
[null,{"$f":"VLOOKUP('Předávací protokol'!$B$6:$H$6,Předávací_protokol_data!$A$7:$C$50,3)","v":{"$error":"#N/A"}}]
[]
["Specifikace akce",{"$f":"Nabídka!A7","v":"Akce:"}]
[]
[]
["Výměra lešení:",{"$f":"Rekapitulace!C8","v":1593},"[m2]"]
["Způsob použití lešení:","Pro fasádu"]
["Typ lešení:","S osovou šířkou 0,732 m",null,"Třída únosnosti podlah:",null,"3 (2,00 kN/m2)"]
["Použití sítě:","Ne",null,"Výměra sítě:",null,null,"[m2]"]
[]
[]
["komponenta","počet kusů"]
["stavitelná patka 0,5 m",{"$f":"Rekapitulace!C11","v":102}]
["stavitelná patka 1 m",{"$f":"Rekapitulace!C12","v":0}]
["rám 2 m",{"$f":"Rekapitulace!C13","v":261}]
["rám 1 m",{"$f":"Rekapitulace!C14","v":1}]
["podlážka 3 m",{"$f":"Rekapitulace!C15","v":394}]
["podlážka 2 m",{"$f":"Rekapitulace!C16","v":10}]
["průlezová podlážka 3 m",{"$f":"Rekapitulace!C17","v":18}]
["zábradlí 3 m",{"$f":"Rekapitulace!C18","v":472}]
["zábradlí 2 m",{"$f":"Rekapitulace!C19","v":11}]
["diagonální úchyt",{"$f":"Rekapitulace!C20","v":12}]
["diagonála 3 m",{"$f":"Rekapitulace!C21","v":62}]
["diagonála 2 m",{"$f":"Rekapitulace!C22","v":0}]
["kotva 0,5 m",{"$f":"Rekapitulace!C23","v":120}]
["kotva dlouhá 1 m",{"$f":"Rekapitulace!C24","v":0}]
["eLko / sloupek",{"$f":"Rekapitulace!C25","v":47}]
["eLko 2 m",{"$f":"Rekapitulace!C26","v":0}]
["Háčko",{"$f":"Rekapitulace!C27","v":4}]
["boční zábradlí",{"$f":"Rekapitulace!C28","v":48}]
["okopové prkno 3 m",{"$f":"Rekapitulace!C29","v":215}]
["okopové prkno 2 m",{"$f":"Rekapitulace!C30","v":5}]
["konzola",{"$f":"Rekapitulace!C31","v":0}]
["pevna spojka",{"$f":"Rekapitulace!C32","v":104}]
["otočná spojka",{"$f":"Rekapitulace!C33","v":52}]
["závlačná spojka",{"$f":"Rekapitulace!C34","v":80}]
["spojovací trubka 0,5 m",{"$f":"Rekapitulace!C35","v":40}]
[]
[]
["Tento Protokol o předání a převzetí byl vyhotoven dle Článku III. odst. 3. Obchodních podmínek společnosti Jasico s.r.o. - přeprava, montáž a nájem lešení. Přebírající podpisem tohoto Protokolu o předání a převzetí výslovně potvrzuje, že od Předávajícího převzal lešení řádně provedené dle jeho požadavků uvedených v cenové nabídce (rozpočtu) Zhotovitele a Objednávce Objednatele a v souladu s požadavky normy ČSN 73 8101:2005."]
[]
[]
[]
[]
[]
["V………………………………………………………….",null,"dne",{"$f":"TODAY()","v":"2017-05-21"}]
[]
[]
[]
[null,"………………………………………",null,null,"……………………………………………"]
[null,{"$f":"B3","v":0},null,null,{"$f":"B6","v":0}]
[null,{"$f":"A3","v":"Předávající"},null,null,{"$f":"A6","v":"Přebírající"}]

{"sheet":"Faktura","index":12,"n_rows":53,"n_cols":7,"rows_kept":53,"cut":false,"hidden":false,"merged":[[8,5,8,6],[9,5,9,6],[10,5,10,6],[11,5,11,6],[12,5,12,6],[25,0,25,1],[26,0,26,1],[27,0,27,1],[28,0,28,1],[17,0,17,1],[18,0,18,1],[19,0,19,1],[20,0,20,1],[40,0,40,1],[29,0,29,1],[30,0,30,1],[31,0,31,1],[32,0,32,1],[33,0,33,1],[34,0,34,1],[44,0,44,5],[52,0,52,5],[0,2,0,3],[7,0,7,2],[13,0,13,1],[14,0,14,1],[15,0,15,1],[41,0,41,1],[42,0,42,1],[43,0,43,1],[45,0,45,1],[35,0,35,1],[36,0,36,1],[37,0,37,1],[38,0,38,1],[39,0,39,1],[16,0,16,1],[21,0,21,1],[22,0,22,1],[23,0,23,1],[24,0,24,1]]}
["FAKTURA – daňový doklad",null,{"$f":"_xlfn.CONCAT(\"Akce: \",Nabídka!A7)","v":"Akce: Akce:"},null,"Číslo:",{"$f":"TODAY()","v":"2017-05-21"},"01"]
["Dodavatel:",null,null,"Odběratel:"]
["Jasico s.r.o.","www.jasico.cz"]
["E.Beneše 609/7","info@jasico.cz",null,null,{"$f":"VLOOKUP($E$3,Předávací_protokol_data!$A$7:$C$50,3)","v":{"$error":"#N/A"}}]
["370 06 České Budějovice",733544047]
[]
["IČO: 281 49 483","DIČ: CZ 281 49 483",null,"IČO:",{"$f":"VLOOKUP($E$3,Předávací_protokol_data!$A$7:$C$50,2)","v":{"$error":"#N/A"}}]
["zapsána KS v Českých Budějovicích, oddíl C,vložka 21483",null,null,"DIČ:",{"$f":" _xlfn.CONCAT(\"CZ \",VLOOKUP($E$3,Předávací_protokol_data!$A$7:$C$50,2))","v":{"$error":"#N/A"}}]
["Bankovní spojení:","Komerční banka",null,"Datum vystavení:",null,{"$f":"TODAY()","v":"2017-05-21"}]
["Číslo účtu: ","107-4158640217/0100",null,"Datum uskutečnění zdaň. plnění:",null,{"$f":"F9","v":"2017-05-21"}]
[null,null,null,"Datum splatnosti:",null,{"$f":"F9+14","v":"2017-06-04"}]
[null,null,null,"Forma úhrady:",null,"převodem"]
["Označení dodávky",null,"množství","mj","cena za mj bez DPH","cena bez DPH"]
["Montáž lešení",null,{"$f":"Rekapitulace!C8","v":1593},"m2",0,{"$f":"C14*E14","v":0}]
["Pronájem lešení",null,{"$f":"Rekapitulace!C8","v":1593},"m2",0,{"$f":"C15*E15","v":0}]
["Doprava",null,1,"kpl",0,{"$f":"C16*E16","v":0}]
[]
[]
[]
[]
[]
[]
[]
[]
[]
[]
[]
[]
[]
[]
[]
[]
[]
[]
[]
[]
[]
[]
[]
[]
[]
[]
[]
[]
["Podle § 92e zákona č. 235/2004 Sb., o dani z přidané hodnoty. Daň odvede zákazník."]
[null,null,"DPH 21%",{"$f":"F48*0.21","v":0}]
[]
["Vystavil:",null,null,null,"Celkem cena bez DPH",{"$f":"SUM(F14:F44)","v":0}]
[null,null,null,null,"DPH 21%",0]
[]
[null,null,null,null,"Celkem k úhradě CZK",{"$f":"F48+F49","v":0}]
[]
["0,5"]

{"sheet":"Data_podpora","index":13,"n_rows":34,"n_cols":3,"rows_kept":34,"cut":false,"hidden":false,"merged":[[23,0,24,0],[1,0,4,0],[1,3,2,3],[3,3,4,3]]}
["Použití","Data","Vysvětlivky"]
["půdorys - načtrnout jako…","vodorovná zleva doprava","→"]
[null,"vodorovná zprava doleva","←"]
[null,"svislá zdora nahoru","↑"]
[null,"svislá shora dolu","↓"]
[]
[]
["tvar střechy","sedlová"]
[null,"valbová"]
[null,"polovalbová"]
[]
[]
["Přesah za roh","Ne","v případě neprovázaného lešení (volně stojící lešení)"]
[null,"Nepřesahuje (+0,5 m)","přičte +0,5 m z důvodu případného propojení lešeení"]
[null,"Zleva +1 m"]
[null,"Zprava +1 m"]
[null,"Zleva +1 m | Zprava +1 m"]
[null,"Napojení zprava + 0,25 m"]
[null,"Napojení zleva + 0,25 m"]
[null,"Napojení zprava i zleva"]
[]
["Pro střechu","Střechu"]
[null,"Fasádu"]
["Výška zábradlí posledního patra [m]",1]
[null,2]
[]
["délka sestavy",0]
[null,2]
[null,3]
["Předsazená konstrukce","Ano"]
[null,"Ne"]
["Auto/Závěs","A"]
[null,"A/Z"]
[null,"Z"]

{"sheet":"Předávací_protokol_data","index":14,"n_rows":25,"n_cols":11,"rows_kept":25,"cut":false,"hidden":false,"merged":[[2,9,3,9]]}
["Protokol o předání a převzetí rámového lešení",null,null,null,null,null,null,null,null,"použití sítě:","Ano"]
["Předávající","IČ","sídlo",null,null,null,null,null,null,null,"Ne"]
["Jasico s.r.o.","IČ: 28149483","se sídlem J. Jindřicha 1550/4, 370 06 České Budějovice",null,null,null,null,null,null,"Třída únosnosti podlah","1 (0,75 kN/m2)"]
[null,null,null,null,null,null,null,null,null,null,"2 (1,50 kN/m2)"]
[null,null,null,null,null,null,null,null,null,null,"3 (2,00 kN/m2)"]
["Přebírající","IČ","sídlo","DIČ",null,null,null,null,null,null,"4 (3,00 kN/m2)"]
["a",10,"aa",null,null,null,null,null,null,null,"5 (4,50 kN/m2)"]
["b",20,"bb",null,null,null,null,null,null,null,"6 (6,00 kN/m2)"]
["c",33,"cc"]
["d",15,"dd",null,null,null,null,null,null,"Použití lešení:","Pro fasádu"]
["e",16,"ee",null,null,null,null,null,null,null,"Pro střechu"]
["f",18,"ff"]
["g",11,"gg"]
["h",2,"hh"]
["i",66,"ii",null,null,null,null,null,null,"Kde:","V……………………………………………………"]
["j",10,"jj",null,null,null,null,null,null,null,"V Českých Budějovicích"]
["k",11,"kk",null,null,null,null,null,null,null,"V Českém Krumlově"]
["l",12,"ll"]
["m",13,"mm",null,null,null,null,null,null,"Typ lešení:","S osovou šířkou 0,739 m"]
["n",14,"nn",null,null,null,null,null,null,null,"S osovou šířkou 0,732 m"]
["o",15,"oo",null,null,null,null,null,null,null,"S osovou šířkou 0,65 m"]
["p",16,"pp",null,null,null,null,null,null,null,"Jiné"]
["q",17,"qq"]
["r",18,"rr"]
["s",19,"ss"]

{"sheet":"List1","index":15,"n_rows":21,"n_cols":16,"rows_kept":21,"cut":false,"hidden":false,"merged":[[6,1,6,7],[6,8,6,12]]}
["Mediální hrubá měsíční mzda lešenáře (data -www.platy.cz)",null,null,null,null,21286,"Kč"]
["hrubý počet měsíčně odpracovaných hodin lešenáře",null,null,null,null,160,"h"]
["hrubá hodinová mzda lešenáře",null,null,null,null,{"$f":"F1/F2","v":133.03749999999999},"Kč/h"]
[]
[]
[]
["Evidence práce na lešení","Montáž",null,null,null,null,null,null,"Demontáž"]
["Akce/ Projekt","Výměra lešení [m2]","Max počet pater lešení","Počet pracovníků","Doba práce [h]","Počet postavených m2 za 1 hodinu  na jednoho lešenáře","Cena práce lešenářů [Kč]","Cena práce lešenářů za 1 m2 lešení [Kč/m2]","Počet pracovníků","Doba práce [h]","Počet zbouraných m2 za 1 hodinu  na jednoho lešenáře","Cena práce lešenářů [Kč]","Cena práce lešenářů za 1 m2 lešení [Kč/m2]"]
["Součty / Průměry",null,null,null,null,{"$f":"AVERAGE(F10:F81)","v":11.447686688311688},null,{"$f":"AVERAGE(H10:H257)","v":13.523907968483897},null,null,{"$f":"AVERAGE(K10:K81)","v":25.473333333333333},null,{"$f":"AVERAGE(M10:M257)","v":5.5521291112396369},null,"Koeficient počtu pater"]
["ČK - Panská",250,3,4,5.5,{"$f":"B10/D10/E10","v":11.363636363636363},{"$f":"D10*E10*$F$3","v":2926.8249999999998},{"$f":"G10/B10","v":11.7073},5,1.5,{"$f":"B10/I10/J10","v":33.333333333333336},{"$f":"I10*J10*$F$3","v":997.78125},{"$f":"L10/B10","v":3.9911249999999998},null,"patro","koeficient"]
["Freyung KozenyBau",330,3,3,7,{"$f":"B11/D11/E11","v":15.714285714285714},2793.7874999999999,8.4660227272727262,null,null,null,0,null,null,1,1]
["ČB - Kanaloš ",312,8,5,7,8.9142857142857146,4656.3125,14.924078525641026,5,2,{"$f":"B12/I12/J12","v":31.2},1330.375,{"$f":"L12/B12","v":4.2640224358974361},null,2,1.1000000000000001]
["ČK - Čičeli",60,2,3,4,5,1596.4499999999998,26.607499999999998,3,1,{"$f":"B13/I13/J13","v":20},399.11249999999995,{"$f":"L13/B13","v":6.6518749999999995},null,3,1.2]
["ČK - Čičeli - předek",{"$f":"3*5*6+3*4+3","v":105},3,3,4,8.75,1596.4499999999998,15.204285714285712,3,2,17.5,798.22499999999991,7.602142857142856,null,4,1.3]
["ČB - Bobeš",{"$f":"76*4","v":304},1,4,4,19,2128.6,7.001973684210526,4,3,{"$f":"B15/I15/J15","v":25.333333333333332},1596.4499999999998,{"$f":"L15/B15","v":5.2514802631578945},null,5,1.4]
["Adamov RD",{"$f":"21*4+6*13+8+5*12+9*6+3+10*3+8*6","v":365},2,5,8,9.125,5321.5,14.579452054794521,null,null,null,null,null,null,6,1.5]
["Waldkirchen_Rosenium_1P",null,1,5,8,null,5321.5,null,null,null,null,null,null,null,7,1.6]
["Sedlec PKK",480,4,5,7,13.714285714285714,4656.3125,9.7006510416666671,null,null,null,null,null,null,8,1.7]
["Kreuzberg_1P",null,1,5,3,null,1995.5625,null,null,null,null,null,null,null,9,1.8]
[null,null,null,null,null,null,null,null,null,null,null,null,null,null,10,1.9]
[null,null,null,null,null,null,null,null,null,null,null,null,null,null,11,2]