{"text_format":"1","workbook":"xlsx","n_sheets":14,"sheets":["Titulní","Seznam firem","Tabulky","služby","Úklid podlah","Úklid sněhu","Mytí oken","Mytí obkladů","Security","Hasicí přístroje","výtahy","Klima","Grafy","List1"],"not_rendered":{"charts":20,"images":1,"macros":1,"external_links":0,"defined_names":1,"comments":0,"pivot_tables":0},"unopened":[],"bounds":{"document_bytes":16777216,"sheet_cells":100000,"rows_first":2000,"rows_last":500,"rows_between":2000,"halvings":0,"cell_chars":16384,"cell_head_chars":4096},"cells_cut":0,"cells_raw":0,"read":"whole","date_system":"1900"}

{"sheet":"Titulní","index":0,"n_rows":40,"n_cols":4,"rows_kept":40,"cut":false,"hidden":false,"merged":[]}
[null,null,"ČESKÉ VYSOKÉ UČENÍ TECHNICKÉ"]
[null,null,"FAKULTA STAVEBNÍ"]
[null,null,"Management a ekonomika ve stavebnictví"]
[]
[]
[null,null,1]
[null,null,8]
[]
[]
[]
[]
[]
[]
[]
[]
[]
[]
[]
[null,null,"Výběr dodavatele podpůrných služeb"]
[]
{"$rows_left_out":21}
{"sheet":"Seznam firem","index":1,"n_rows":104,"n_cols":28,"rows_kept":104,"cut":false,"hidden":false,"merged":[]}
["ID",null,"Název poskytovatele","Město","Ulice","PSČ","Telefon","E-mail","HTTP","Vzdálenost","Mytí obkladů","Mytí oken a výloh","Revize hasících přístrojů","Revize výtahů","Revize vzduchotechniky","Security služby","Úklid podlah","Úklid sněhu","Praha","Plzeň","Příbram","Liberec","České Budejovice","Tábor","Kladno","Mladá boleslav","Hradec králové","Celková cena"]
[1,null,"COOL Facillity s.r.o.","Praha","Švábky 52","180 00",777790005,"info@completeservice.cz","www.completeservice.cz",{"$f":"VLOOKUP(A2,A2:AA2,18+Tabulky!$C$3)","v":8},40,6,null,null,null,null,2,null,8,105,68.5,106,155,96.3,31,60,114,{"$f":"IF(VLOOKUP(A2,A2:AA2,10+Tabulky!$C$4)=\"\",\"\",J2*Titulní!$B$26+VLOOKUP(A2,A2:AA2,10+Tabulky!$C$4)*Titulní!$B$25)","v":800}]
[2,null,"Úklidové služby","Praha","V Nových Vokovicích 149","160 00",602238073,"www.uklidovesluzby.cz","www.uklidovesluzby.cz",{"$f":"VLOOKUP(A3,A3:AA3,18+Tabulky!$C$3)","v":8.5},35,8,null,null,null,null,2.5,null,8.5,95,71,114,164,102,21,68,128,{"$f":"IF(VLOOKUP(A3,A3:AA3,10+Tabulky!$C$4)=\"\",\"\",J3*Titulní!$B$26+VLOOKUP(A3,A3:AA3,10+Tabulky!$C$4)*Titulní!$B$25)","v":1012.5}]
[3,null,"EuroProfi Clean v.o.s","Praha","Cílkova 639/24","142 00",777595854,"epc@europroficlean.cz ","www.europroficlean.cz",{"$f":"VLOOKUP(A4,A4:AA4,18+Tabulky!$C$3)","v":10.3},30,11,null,null,null,null,1.7,null,10.3,98,57,112,103,89,44,66,116,{"$f":"IF(VLOOKUP(A4,A4:AA4,10+Tabulky!$C$4)=\"\",\"\",J4*Titulní!$B$26+VLOOKUP(A4,A4:AA4,10+Tabulky!$C$4)*Titulní!$B$25)","v":1357.5}]
[4,null,"Ksena.s.r.o.","Praha","Dářská 275/14","198 00",777595854,"reditel.uklid@ksena.cz  ","www.uklidove-prace-ksena.cz",{"$f":"VLOOKUP(A5,A5:AA5,18+Tabulky!$C$3)","v":19.5},null,13,null,null,null,null,3,null,19.5,108,70,98,153,95,53,52,118,{"$f":"IF(VLOOKUP(A5,A5:AA5,10+Tabulky!$C$4)=\"\",\"\",J5*Titulní!$B$26+VLOOKUP(A5,A5:AA5,10+Tabulky!$C$4)*Titulní!$B$25)","v":1787.5}]
[5,null,"D&D s.r.o.","Praha","Výletní 398/27","142 00",244470604,"info@ddservis.eu","www.dd-uklid-praha.cz",{"$f":"VLOOKUP(A6,A6:AA6,18+Tabulky!$C$3)","v":11.8},32,10,null,null,null,null,2.5,null,11.8,103,59,113,147,88,48,67.5,117,{"$f":"IF(VLOOKUP(A6,A6:AA6,10+Tabulky!$C$4)=\"\",\"\",J6*Titulní!$B$26+VLOOKUP(A6,A6:AA6,10+Tabulky!$C$4)*Titulní!$B$25)","v":1295}]
[6,null,"DOLEŽAL-DUHA, s. r. o.","Praha","Podolská 241/23,","147 00"," 733 640 206","info@duha.eu","www.duha-uklid.cz",{"$f":"VLOOKUP(A7,A7:AA7,18+Tabulky!$C$3)","v":3.2},null,12,null,null,null,null,3,null,3.2,96.5,56,113.5,148,90,42,66.7,116,{"$f":"IF(VLOOKUP(A7,A7:AA7,10+Tabulky!$C$4)=\"\",\"\",J7*Titulní!$B$26+VLOOKUP(A7,A7:AA7,10+Tabulky!$C$4)*Titulní!$B$25)","v":1280}]
[7,null,"David Plecitý","Praha","Dubnova 807","149 00",602332178,"dplecity@volny.cz","www.uklidplecity.cz",{"$f":"VLOOKUP(A8,A8:AA8,18+Tabulky!$C$3)","v":13.7},null,10,null,null,null,null,8,null,13.7,102,64.5,107,143,84.6,48,61,111,{"$f":"IF(VLOOKUP(A8,A8:AA8,10+Tabulky!$C$4)=\"\",\"\",J8*Titulní!$B$26+VLOOKUP(A8,A8:AA8,10+Tabulky!$C$4)*Titulní!$B$25)","v":1342.5}]
[8,null,"A.W.I.S.","Praha","Na Plzeňce 1236/4","150 00",222531104,"info@uklidy-kancelari.cz","www.uklidy-kancelari.cz",{"$f":"VLOOKUP(A9,A9:AA9,18+Tabulky!$C$3)","v":1},null,12,null,null,null,null,7,5,1,95.1,57.7,116,152,94,40.700000000000003,70.5,120,{"$f":"IF(VLOOKUP(A9,A9:AA9,10+Tabulky!$C$4)=\"\",\"\",J9*Titulní!$B$26+VLOOKUP(A9,A9:AA9,10+Tabulky!$C$4)*Titulní!$B$25)","v":1225}]
[9,null,"Herakles","Praha","Marie Cibulkové 14","140 00",222934038,"jirisvatek.herakles@seznam.cz","www.adherakles.cz",{"$f":"VLOOKUP(A10,A10:AA10,18+Tabulky!$C$3)","v":3.7},38,8,null,null,null,null,2.8,3,3.7,97.2,60,112,148,89.9,43,66.7,116,{"$f":"IF(VLOOKUP(A10,A10:AA10,10+Tabulky!$C$4)=\"\",\"\",J10*Titulní!$B$26+VLOOKUP(A10,A10:AA10,10+Tabulky!$C$4)*Titulní!$B$25)","v":892.5}]
[10,null,"VYČISTÍM CZ","Praha","Zborovská 4","150 00",606741841,"info@vycistim.cz","www.vycistim.cz",{"$f":"VLOOKUP(A11,A11:AA11,18+Tabulky!$C$3)","v":0.5},70,14,null,null,null,null,4,null,0.5,90.6,58,117,153,94,32,71,121,{"$f":"IF(VLOOKUP(A11,A11:AA11,10+Tabulky!$C$4)=\"\",\"\",J11*Titulní!$B$26+VLOOKUP(A11,A11:AA11,10+Tabulky!$C$4)*Titulní!$B$25)","v":1412.5}]
[11,null,"Mytí oken s.r.o.","Praha","Na Harfě 7","198 00",603232515,"uklid@mytioken.cz","www.mytioken.cz",{"$f":"VLOOKUP(A12,A12:AA12,18+Tabulky!$C$3)","v":10.7},null,8,null,null,null,null,null,null,10.7,111,73,101,156,97.6,34.700000000000003,54,106,{"$f":"IF(VLOOKUP(A12,A12:AA12,10+Tabulky!$C$4)=\"\",\"\",J12*Titulní!$B$26+VLOOKUP(A12,A12:AA12,10+Tabulky!$C$4)*Titulní!$B$25)","v":1067.5}]
[12,null,"Úklidová četa","Praha","Jičínská 37","130 00",608947845,"info@uklidovaceta.cz","www.uklidovaceta.cz",{"$f":"VLOOKUP(A13,A13:AA13,18+Tabulky!$C$3)","v":5.7},null,15,null,null,null,null,2.9,null,5.7,104,66.5,106,149,90.4,31.8,60.8,112,{"$f":"IF(VLOOKUP(A13,A13:AA13,10+Tabulky!$C$4)=\"\",\"\",J13*Titulní!$B$26+VLOOKUP(A13,A13:AA13,10+Tabulky!$C$4)*Titulní!$B$25)","v":1642.5}]
[13,null,"AB Prokir spol. s r.o.","Praha","Magistrů 921/9","140 00",602332948,"prokir@prokir.cz","www.prokir.cz",{"$f":"VLOOKUP(A14,A14:AA14,18+Tabulky!$C$3)","v":5.5},null,9.5,null,null,null,null,10,null,5.5,100,62.7,109,147,88.5,43.7,63.4,113,{"$f":"IF(VLOOKUP(A14,A14:AA14,10+Tabulky!$C$4)=\"\",\"\",J14*Titulní!$B$26+VLOOKUP(A14,A14:AA14,10+Tabulky!$C$4)*Titulní!$B$25)","v":1087.5}]
[14,null,"RPM Service CZ a.s.","Praha","Moskevská 63/659","101 16"," 272 099 600","obchod@rpmservice.cz","www.rpmservice.cz",{"$f":"VLOOKUP(A15,A15:AA15,18+Tabulky!$C$3)","v":6.3},null,6,null,null,null,null,2,null,6.3,101,63.9,108,146,87.5,47,62.8,112.5,{"$f":"IF(VLOOKUP(A15,A15:AA15,10+Tabulky!$C$4)=\"\",\"\",J15*Titulní!$B$26+VLOOKUP(A15,A15:AA15,10+Tabulky!$C$4)*Titulní!$B$25)","v":757.5}]
[15,null,"Detai cleaning","Praha","Tovarova 1211","198 00",777926300,"info@detai.cz","www.detai.cz",{"$f":"VLOOKUP(A16,A16:AA16,18+Tabulky!$C$3)","v":21.3},null,null,null,null,null,null,null,13,21.3,110,72.8,100,155,97,56,145,104,{"$f":"IF(VLOOKUP(A16,A16:AA16,10+Tabulky!$C$4)=\"\",\"\",J16*Titulní!$B$26+VLOOKUP(A16,A16:AA16,10+Tabulky!$C$4)*Titulní!$B$25)","v":""}]
[16,null,"Komplexní úklid","Praha"," Šatrova 662",14200,603444507,"info@komplexni-uklid.cz","www.komplexni-uklid.cz",{"$f":"VLOOKUP(A17,A17:AA17,18+Tabulky!$C$3)","v":10.4},null,null,null,null,null,null,null,7,10.4,99.5,57.5,113,149,90.3,43,66.8,116,{"$f":"IF(VLOOKUP(A17,A17:AA17,10+Tabulky!$C$4)=\"\",\"\",J17*Titulní!$B$26+VLOOKUP(A17,A17:AA17,10+Tabulky!$C$4)*Titulní!$B$25)","v":""}]
[17,null,"Dopareal","Praha","Poznaňská 435",18100,604946096,"dopareal@gmail.com","www.dopareal.cz",{"$f":"VLOOKUP(A18,A18:AA18,18+Tabulky!$C$3)","v":13.4},null,null,null,null,null,null,null,8,13.4,99,71,108,159,100,33.5,62,116,{"$f":"IF(VLOOKUP(A18,A18:AA18,10+Tabulky!$C$4)=\"\",\"\",J18*Titulní!$B$26+VLOOKUP(A18,A18:AA18,10+Tabulky!$C$4)*Titulní!$B$25)","v":""}]
[18,null,"Šticha a syn s.r.o.","Praha","Choceradská 3044","141 00"," 777 844 726","info@stichaasyn.cz","www.stichaasyn.cz",{"$f":"VLOOKUP(A19,A19:AA19,18+Tabulky!$C$3)","v":11.5},null,null,null,null,null,null,null,2.4,11.5,100,63,108.5,144,85.4,44,62.4,112,{"$f":"IF(VLOOKUP(A19,A19:AA19,10+Tabulky!$C$4)=\"\",\"\",J19*Titulní!$B$26+VLOOKUP(A19,A19:AA19,10+Tabulky!$C$4)*Titulní!$B$25)","v":""}]
[19,null,"Miroslav Mlezviva","Kladno","Smetanova 284","273 45","725 370 545 ","miloslav.mleziva@uklidmleziva.cz","www.uklidmleziva.cz",{"$f":"VLOOKUP(A20,A20:AA20,18+Tabulky!$C$3)","v":26.8},null,null,null,null,null,null,null,5,26.8,83,81.400000000000006,147,175,123,1.9,101,150,{"$f":"IF(VLOOKUP(A20,A20:AA20,10+Tabulky!$C$4)=\"\",\"\",J20*Titulní!$B$26+VLOOKUP(A20,A20:AA20,10+Tabulky!$C$4)*Titulní!$B$25)","v":""}]
{"$rows_left_out":85}
{"sheet":"Tabulky","index":2,"n_rows":25,"n_cols":6,"rows_kept":25,"cut":false,"hidden":false,"merged":[]}
["Pomocné"]
[null,"Počet firem v databázi",{"$f":"MAX('Seznam firem'!$A$2:$A$10000)","v":91},null,"Nejnižší cena",{"$f":"MIN('Seznam firem'!$AB$2:$AB$10000)","v":757.5}]
[null,{"$f":"VLOOKUP(C3,Tabulky!A17:B29,2,1)","v":"Praha"},1,null,"Nejvyšší cena",{"$f":"MAX('Seznam firem'!$AB$2:$AB$10000)","v":6300}]
[null,{"$f":"VLOOKUP(C4,Tabulky!A7:C14,2,1)","v":"Mytí oken"},2]
[]
["TABULKA SLUŽEB"]
[1,"Mytí obkladů","Kč/m2","m2"]
[2,"Mytí oken","Kč/m2","m2"]
[3,"Revize hasících přístrojů","Kč/ks","ks"]
[4,"Revize výtahů","Kč/h","h"]
[5,"Revize vzduchotechniky","Kč/h","h"]
[6,"Security služby","Kč/h","h"]
[7,"Úklid podlah","Kč/m2","m2"]
[8,"Úklid sněhu","Kč/m2","m2"]
[]
["TABULKA MĚST"]
[1,"Praha"]
[2,"Plzeň"]
[3,"Příbram"]
[4,"Liberec"]
{"$rows_left_out":6}
{"sheet":"služby","index":3,"n_rows":107,"n_cols":5,"rows_kept":107,"cut":false,"hidden":false,"merged":[]}
["Činnost","ID","Vzdálenost","Cena","MJ"]
["Mytí oken",1,8,6,"Kč/m2"]
["Úklid podlah",1,8,2,"Kč/m2"]
["Mytí obkladů",1,8,40,"Kč/m2"]
["Mytí oken",2,8.5,8,"Kč/m2"]
["Úklid podlah",2,8.5,0.9,"Kč/m2"]
["Mytí obkladů",2,8.5,35,"Kč/m2"]
["Mytí oken",3,10.3,11,"Kč/m2"]
["Úklid podlah",3,10.3,1.7,"Kč/m2"]
["Mytí obkladů",3,10.3,30,"Kč/m2"]
["Mytí oken",4,19.5,13,"Kč/m2"]
["Úklid podlah",4,19.5,3,"Kč/m2"]
["Mytí oken",5,11.8,10,"Kč/m2"]
["Úklid podlah",5,11.8,0.8,"Kč/m2"]
["Mytí obkladů",5,11.8,32,"Kč/m2"]
["Mytí oken",6,3.2,12,"Kč/m2"]
["Úklid podlah",6,3.2,0.55000000000000004,"Kč/m2"]
["Mytí oken",7,13.7,10,"Kč/m2"]
["Úklid podlah",7,13.7,8,"Kč/m2"]
["Mytí oken",8,1,12,"Kč/m2"]
{"$rows_left_out":88}
{"sheet":"Úklid podlah","index":4,"n_rows":17,"n_cols":10,"rows_kept":17,"cut":false,"hidden":false,"merged":[]}
[]
[]
[]
[null,"Název poskytovatele","Město","Ulice","PSČ","Telefon","E-mail","HTTP","Vzdálenost\nkm ","Cena služby\nza 1m2"]
["1.","COOL Facillity s.r.o.","Praha","Švábky 52","180 00",777790005,"info@completeservice.cz","www.completeservice.cz",8,2]
["2.","Úklidové služby","Praha","V Nových Vokovicích 149","160 00",602238073,"www.uklidovesluzby.cz","www.uklidovesluzby.cz",8.5,2.5]
["3.","EuroProfi Clean v.o.s","Praha","Cílkova 639/24","142 00",777595854,"epc@europroficlean.cz ","www.europroficlean.cz",10.3,1.7]
["4.","Ksena.s.r.o.","Praha","Dářská 275/14","198 00",777595854,"reditel.uklid@ksena.cz  ","www.uklidove-prace-ksena.cz",19.5,3]
["5.","D&D s.r.o.","Praha","Výletní 398/27","142 00",244470604,"info@ddservis.eu","www.dd-uklid-praha.cz",11.8,2.5]
["6.","DOLEŽAL-DUHA, s. r. o.","Praha","Podolská 241/23,","147 00"," 733 640 206","info@duha.eu","www.duha-uklid.cz",3.2,3]
["7.","David Plecitý","Praha","Dubnova 807","149 00",602332178,"dplecity@volny.cz","www.uklidplecity.cz",13.7,8]
["8.","A.W.I.S.","Praha","Na Plzeňce 1236/4","150 00",222531104,"info@uklidy-kancelari.cz","www.uklidy-kancelari.cz",1,7]
["9.","Herakles","Praha","Marie Cibulkové 14","140 00",222934038,"jirisvatek.herakles@seznam.cz","www.adherakles.cz",3.7,2.8]
["10.","VYČISTÍM CZ","Praha","Zborovská 4","150 00",606741841,"info@vycistim.cz","www.vycistim.cz",0.5,4]
["11.","Úklidová četa","Praha","Jičínská 37","130 00",608947845,"info@uklidovaceta.cz","www.uklidovaceta.cz",5.7,2.9]
["12.","AB Prokir spol. s r.o.","Praha","Magistrů 921/9","140 00",602332948,"prokir@prokir.cz","www.prokir.cz",5.5,10]
["13.","RPM Service CZ a.s.","Praha","Moskevská 63/659","101 16"," 272 099 600","obchod@rpmservice.cz","www.rpmservice.cz",6.3,2]

{"sheet":"Úklid sněhu","index":5,"n_rows":11,"n_cols":10,"rows_kept":11,"cut":false,"hidden":false,"merged":[]}
[]
[]
[]
[null,"Název poskytovatele","Město","Ulice","PSČ","Telefon","E-mail","HTTP","Vzdálenost\nkm ","Cena služby\nza 1m2"]
["1.","Detai cleaning","Praha","Tovarova 1211","198 00",777926300,"info@detai.cz","www.detai.cz",21.3,13]
["2.","Komplexní úklid","Praha"," Šatrova 662",14200,603444507,"info@komplexni-uklid.cz","www.komplexni-uklid.cz",10.4,7]
["3.","Dopareal","Praha","Poznaňská 435",18100,604946096,"dopareal@gmail.com","www.dopareal.cz",13.4,8]
["4.","Šticha a syn s.r.o.","Praha","Choceradská 3044","141 00"," 777 844 726","info@stichaasyn.cz","www.stichaasyn.cz",11.5,2.4]
["5.","Miroslav Mlezviva","Kladno","Smetanova 284","273 45","725 370 545 ","miloslav.mleziva@uklidmleziva.cz","www.uklidmleziva.cz",26.8,5]
["6.","A.W.I.S.","Praha","Na Plzeňce 1236/4","150 00",222531104,"info@uklidy-kancelari.cz","www.uklidy-kancelari.cz",1,5]
["7.","Herakles","Praha","Marie Cibulkové 14","140 00",222934038,"jirisvatek.herakles@seznam.cz","www.adherakles.cz",3.7,3]

{"sheet":"Mytí oken","index":6,"n_rows":18,"n_cols":10,"rows_kept":18,"cut":false,"hidden":false,"merged":[]}
[]
[]
[]
[null,"Název poskytovatele","Město","Ulice","PSČ","Telefon","E-mail","HTTP","Vzdálenost\nkm ","Cena služby\nza 1m2"]
["1.","COOL Facillity s.r.o.","Praha","Švábky 52","180 00",777790005,"info@completeservice.cz","www.completeservice.cz",8,6]
["2.","Úklidové služby","Praha","V Nových Vokovicích 149","160 00",602238073,"www.uklidovesluzby.cz","www.uklidovesluzby.cz",8.5,8]
["3.","EuroProfi Clean v.o.s","Praha","Cílkova 639/24","142 00",777595854,"epc@europroficlean.cz ","www.europroficlean.cz",10.3,11]
["4.","Ksena.s.r.o.","Praha","Dářská 275/14","198 00",777595854,"reditel.uklid@ksena.cz  ","www.uklidove-prace-ksena.cz",19.5,13]
["5.","D&D s.r.o.","Praha","Výletní 398/27","142 00",244470604,"info@ddservis.eu","www.dd-uklid-praha.cz",11.8,10]
["6.","DOLEŽAL-DUHA, s. r. o.","Praha","Podolská 241/23,","147 00"," 733 640 206","info@duha.eu","www.duha-uklid.cz",3.2,12]
["7.","David Plecitý","Praha","Dubnova 807","149 00",602332178,"dplecity@volny.cz","www.uklidplecity.cz",13.7,10]
["8.","A.W.I.S.","Praha","Na Plzeňce 1236/4","150 00",222531104,"info@uklidy-kancelari.cz","www.uklidy-kancelari.cz",1,12]
["9.","Herakles","Praha","Marie Cibulkové 14","140 00",222934038,"jirisvatek.herakles@seznam.cz","www.adherakles.cz",3.7,8]
["10.","VYČISTÍM CZ","Praha","Zborovská 4","150 00",606741841,"info@vycistim.cz","www.vycistim.cz",0.5,15]
["11.","Mytí oken s.r.o.","Praha","Na Harfě 7","198 00",603232515,"uklid@mytioken.cz","www.mytioken.cz",10.7,8]
["12.","Úklidová četa","Praha","Jičínská 37","130 00",608947845,"info@uklidovaceta.cz","www.uklidovaceta.cz",5.7,15]
["13.","AB Prokir spol. s r.o.","Praha","Magistrů 921/9","140 00",602332948,"prokir@prokir.cz","http://www.prokir.cz/",5.5,9.5]
["14.","RPM Service CZ a.s.","Praha","Moskevská 63/659","101 16"," 272 099 600","obchod@rpmservice.cz","www.rpmservice.cz",6.3,6]

{"sheet":"Mytí obkladů","index":7,"n_rows":11,"n_cols":10,"rows_kept":11,"cut":false,"hidden":false,"merged":[]}
[]
[]
[]
[null,"Název poskytovatele","Město","Ulice","PSČ","Telefon","E-mail","HTTP","Vzdálenost\nkm ","Cena služby\nza 1m2"]
["1.","COOL Facillity s.r.o.","Praha","Švábky 52","180 00",777790005,"info@completeservice.cz","www.completeservice.cz",8,40]
["2.","Úklidové služby","Praha","V Nových Vokovicích 149","160 00",602238073,"www.uklidovesluzby.cz","www.uklidovesluzby.cz",8.5,35]
["3.","EuroProfi Clean v.o.s","Praha","Cílkova 639/24","142 00",777595854,"epc@europroficlean.cz ","www.europroficlean.cz",10.3,30]
["4.","D&D s.r.o.","Praha","Výletní 398/27","142 00",244470604,"info@ddservis.eu","www.dd-uklid-praha.cz",19.5,32]
["5.","Herakles","Praha","Marie Cibulkové 14","140 00",222934038,"jirisvatek.herakles@seznam.cz","www.adherakles.cz",3.7,38]
["6.","VYČISTÍM CZ","Praha","Zborovská 4","150 00",606741841,"info@vycistim.cz","www.vycistim.cz",0.5,70]
["7.","RPM Service CZ a.s.","Praha","Moskevská 63/659","101 16"," 272 099 600","obchod@rpmservice.cz","www.rpmservice.cz",6.3,40]

{"sheet":"Security","index":8,"n_rows":12,"n_cols":10,"rows_kept":12,"cut":false,"hidden":false,"merged":[]}
[]
[]
[]
[null,"Název poskytovatele","Město","Ulice","PSČ","Telefon","E-mail","HTTP","Vzdálenost\nkm ","Cena služby\nza h"]
["1.","RP Security","Praha","Plavecká 8","128 00","774 676 665","info@rp-security.cz","www.rp-security.cz",2.1,85]
["2.","S a S security service, s.r.o.","Praha"," Ke Klimentce 15","150 00",257225555,"sas@sassecurity.cz","www.sassecurity.cz",5.5,103]
["3.","Security Cihlář","Praha","Polední 1029/29","147 00",774881892,"security-cihlar@email.cz","www.security-cihlar.cz",6.9,150]
["4.","RTH Security s.r.o.","Praha","Jaurisova 4","140 00",261213712,"obchod@rthgroup.cz","www.rthgroup.cz",5.0999999999999996,125]
["5.","CBS PROFESIONAL security agency, a.s.","Praha","Na Rovnosti 2245/3","130 00"," 242441476","info@cbs.cz","www.cbs.cz",8.5,90]
["6.","V.I.P. SECURITY SERVICES s.r.o.","Praha","Za Elektrárnou 419","170 00",266727468,"info@prague-security.cz","www.prague-security.cz",6.6,180]
["7.","HG-SECURITY spol. s r.o.","Praha","Chudenická 30/1059","102 00",733121587,"hg-security@centrum.cz","http://www.hg-security.cz/",14.2,90]
["8.","Security service","Praha","Dopravní 500",14000,606728321,"michal.krejcik@email.cz","www.security.wbs.cz",20.5,105]

{"sheet":"Hasicí přístroje","index":9,"n_rows":11,"n_cols":10,"rows_kept":11,"cut":false,"hidden":false,"merged":[]}
[]
[]
[null,"Název poskytovatele","Město","Ulice","PSČ","Telefon","E-mail","HTTP","Vzdálenost\nkm ","Cena služby\nza ks"]
["1.","Bezpo","Plzeň","Hřímalého 805/3","301 00",602104471,"bezpoplzen@seznam.cz","http://www.bezpo.com/",91,40]
["2.","Jaroslav Vidim","Velvary","Malovarská 387","273 24",733139577,"info@hasici-pristroje.net","http://www.hasici-pristroje.net/",45,49]
["3.","Karel Hrbek","Praha","Černošice","252 28",777312705,"technikpo@technikpo.cz","http://www.technikpo.cz/",16.5,40]
["4.","SLÁDEČEK PAVEL","Opatovice nad Labem","Jozífova 377","533 45",603972288," hasici-pristroje-sladecek@seznam.cz","http://www.hasici-pristroje-sladecek.stranky1.cz/",114,40]
["5.","AGROS","Praha"," Bojasova 1245",18200,606950976,"argos.zvara@seznam.cz","http://www.argos-pozarniservis.cz/",13.7,60]
["6."," AHAS-PROFI","Hluboká nad Vltavou","Zvolenovská 536","371 43",775413089,"ahas-profi@seznam.cz","http://www.ahas-profi.cz/",146,45]
["7.","Požární revize","Praha","Kurzova 2391/9","155 00",776638919,"matyaskalenda@pozarni-prevence.eu","http://www.pozarni-revize.eu/",8.1,40]
["8.","Hlavní báňská záchranná stanice Praha a.s.","Praha","Za opravnou 276/8","151 23"," 257 282 701","hbzs@hbzs-praha.cz","http://www.hbzs-praha.cz/",6,30]

{"sheet":"výtahy","index":10,"n_rows":29,"n_cols":15,"rows_kept":29,"cut":false,"hidden":false,"merged":[[25,13,25,14],[26,13,26,14],[27,12,27,14],[28,13,28,14],[18,12,18,14],[20,12,20,14],[19,13,19,14],[24,12,24,14]]}
[]
[]
[]
[]
[]
[]
[null,"Název poskytovatele","Město","Ulice","PSČ","Telefon","E-mail","HTTP","Vzdálenost\nkm ","Cena služby\nza h"]
["1.","Výtahy Kladno v.o.s","Kladno","Kročehlavská 1308","272 01",603718172,"vytahy@vytahykladno.cz","www.vytahykladno.cz ",28.5,350]
["2.","TDT servis výtahů","Praha","Šimáčkova 8","170 00",775619908,"tdt-vytahy@seznam.cz","http://www.tdt.wz.cz/",6.1,360]
["3.","Výtahy Holý, s.r.o.","Praha","K Louži-2","101 00"," 732 782 588","info@vytahyholy.cz","www.vytahyholy.cz",5.5,380]
["4.","BŘÍZA Výtahy s.r.o.","Praha","Českobrodská 72","190 12","777 251 659 ","info@briza-vytahy.cz","http://www.briza-vytahy.cz/",19.600000000000001,365]
["5.","NERA-lift, s.r.o.","Praha","U Továren 770/1b","102 00",602699401,"info@nera-lift.cz ","www.nera-lift.cz",17.100000000000001,380]
["6.","Bestlift, spol. s r.o.","Praha","Pražská 15, ","251 64",724971453,"ivanka@bestlift.cz","http://www.bestlift.cz/",15.1,355]
["7.","Evyt s.r.o.","Praha","Klouzková 74","104 00","724 753 434","evyt@evyt.cz","http://www.evyt.cz/",20.2,360]
["8.","EXPRESS ELEVATORS S.R.O.","Praha","Chodovická 2279","193 00",603546098,"info@e-elevators.cz","http://www.e-elevators.cz/",26,350]
["9.","EURO VÝTAHY s.r.o.","Praha","Ke Stírce 1845/39","182 00",737211301,"info@eurovytahy.cz","http://www.eurovytahy.cz/",13,360]
[]
[null,null,null,null,null,null,null,null,null,null,null,null,"Druh výtahu","Výtahy uvedené \ndo provozu po 31.12.1992","Výtahy uvedené \ndo provozu před 1.1.1993"]
[null,null,null,null,null,null,null,null,null,null,null,null,"Provozní prohlídky"]
[null,null,null,null,null,null,null,null,null,null,null,null,"Výtahy bez rozlišení","2x/týden"]
{"$rows_left_out":10}
{"sheet":"Klima","index":11,"n_rows":62,"n_cols":14,"rows_kept":62,"cut":false,"hidden":false,"merged":[[48,12,52,12],[53,12,60,12],[40,12,42,12],[43,12,47,12]]}
[]
[]
[]
[null,"Název poskytovatele","Město","Ulice","PSČ","Telefon","E-mail","HTTP","Vzdálenost\nkm ","Cena služby\nza h"]
["1.","KLIMAX","Praha","Úvalská 794/23","100 00",602330430,"pavel.klimax@tiscali.cz","www.klimax-vzduchotechnika.cz",14.6,350]
["2.","VSK Praha s.r.o.","Praha","Livornská 429","109 00",274860591,"info@vkspraha.cz","vkspraha.cz ",18.7,360]
["3.","AB Clima s.r.o.","Praha","Högerova 1219/3",15200,800104700," j.trasak@abclima.cz ","http://www.abclima.cz/",6.4,370]
["4.","Airclima service","Praha","U Kostrounku 1279","156 00","776 630 403.",null,"www.chlazeni-vzduchotechnika.cz",13.2,365]
["5.","JR KLIMA s.r.o.","Praha","Vrážská 144","153 00",257912066,"jr-klima@jr-klima.com","http://www.jr-klima.com/",12,370]
["6.","VZDUCHOTECHNIKA VEJVODA, s.r.o.","Praha","Holečkova 22","150 00",224816874,"vejvoda@vzduchotechnika-air.cz","www.vzduchotechnika-klimatizace.info",2.6,370]
["7.","Schönbauer a spol. s.r.o.","Praha","Nad Libří 233/22","159 00",257940072,"schonbauer@schonbauer.cz","http://www.schonbauer.cz/",5.6,350]
["8.","Comfort sdružení, a.s.","Plzeň","Domažlická 1133","318 00",377382380,"comfort@comfort-as.cz","www.comfort-as.cz",125,355]
["9.","Enerfin plus s.r.o.","Plzeň","Domažlická 116/223,","318 00",377457816,"enerfin@enerfin.cz","http://www.enerfinplus.cz/",92,360]
["10.","ENERGOSTAR Tábor s.r.o.","Tábor","Sedláčkova 1856",39002,602661810,"info@energostar.cz","http://www.energostar.cz ",93,340]
[]
[]
[]
[]
[]
[]
{"$rows_left_out":43}
{"sheet":"Grafy","index":12,"n_rows":157,"n_cols":21,"rows_kept":157,"cut":false,"hidden":false,"merged":[]}
[]
[]
[]
[]
[]
[]
[]
[]
[]
[]
[]
[]
[]
[]
[]
[]
[]
[]
[]
[]
{"$rows_left_out":138}
{"sheet":"List1","index":13,"n_rows":64,"n_cols":6,"rows_kept":64,"cut":false,"hidden":false,"merged":[]}
[]
["podlahy","Název poskytovatele","Město","Cena služby\nza 1m2"]
[null,"COOL Facillity s.r.o.","Praha",2]
[null,"Úklidové služby","Praha",2.5]
[null,"EuroProfi Clean v.o.s","Praha",1.7]
[null,"Ksena.s.r.o.","Praha",3]
[null,"D&D s.r.o.","Praha",2.5]
[null,"DOLEŽAL-DUHA, s. r. o.","Praha",3,"Praha",{"$f":"AVERAGE(D3:D15,D24)","v":4.2428571428571429}]
[null,"David Plecitý","Praha",8,"Plzeň",{"$f":"AVERAGE(D18,D19,D20,D21,D22)","v":7.4}]
[null,"A.W.I.S.","Praha",7,"Středočeský kraj",{"$f":"AVERAGE(D23,D25,D26,D17,D16)","v":12.4}]
[null,"Herakles","Praha",2.8]
[null,"VYČISTÍM CZ","Praha",4]
[null,"Úklidová četa","Praha",2.9]
[null,"AB Prokir spol. s r.o.","Praha",10]
[null,"RPM Service CZ a.s.","Praha",2]
[null,"INUS Příbram s.r.o.","Příbram",10]
[null,"Vanost s.r.o.","Příbram",19]
[null,"SvoboDo","Plzeň",6]
[null,"Uklid-udrzba-plzen","Plzeň",12]
[null,"ÚKLID-PLZEŇ.EU","Mýto",4]
{"$rows_left_out":44}