{"text_format":"1","workbook":"xlsx","n_sheets":5,"sheets":["Bilance","H","GRAF","G","BAZ"],"not_rendered":{"charts":1,"images":0,"macros":1,"external_links":1,"defined_names":29,"comments":0,"pivot_tables":0},"unopened":[],"bounds":{"document_bytes":16777216,"sheet_cells":100000,"rows_first":2000,"rows_last":500,"rows_between":2000,"halvings":0,"cell_chars":16384,"cell_head_chars":4096},"cells_cut":0,"cells_raw":0,"read":"whole","date_system":"1900"}

{"sheet":"Bilance","index":0,"n_rows":58,"n_cols":43,"rows_kept":58,"cut":false,"hidden":false,"merged":[[35,33,35,36],[36,29,36,32],[37,29,37,32],[38,29,38,32],[37,33,37,36],[38,33,38,36],[36,33,36,36],[42,0,43,0],[41,0,41,7],[41,8,41,14],[6,0,6,3],[6,5,6,8],[6,10,6,13],[18,12,18,13],[19,12,19,13],[20,12,20,13],[21,12,21,13],[22,12,22,13],[33,8,33,13],[22,7,22,8],[9,11,10,11],[9,12,10,13],[11,12,11,13],[12,12,12,13],[13,12,13,13],[14,12,14,13],[15,12,15,13],[16,12,16,13],[17,12,17,13],[14,7,14,8],[15,7,15,8],[16,7,16,8],[17,7,17,8],[57,0,57,6],[57,7,57,14],[22,2,22,3],[9,1,10,1],[9,2,10,3],[32,0,32,14],[18,7,18,8],[19,7,19,8],[20,7,20,8],[21,7,21,8],[14,2,14,3],[13,2,13,3],[12,2,12,3],[21,2,21,3],[15,2,15,3],[16,2,16,3],[4,0,4,1],[2,8,2,9],[3,8,3,9],[19,2,19,3],[20,2,20,3],[11,2,11,3],[17,2,17,3],[18,2,18,3],[9,6,10,6],[9,7,10,8],[11,7,11,8],[12,7,12,8],[13,7,13,8],[3,2,3,6],[4,2,4,6],[0,12,0,14],[0,0,0,11],[2,2,2,6],[2,0,2,1],[3,0,3,1],[2,10,2,13],[3,10,3,13]]}
["Zjednodušená měsíční bilance solární tepelné soustavy",null,null,null,null,null,null,null,null,null,null,null,"verze 2015/03"]
[]
["Akce:",null,null,null,null,null,null,null,"Vypracoval:"]
["Adresa:",null,null,null,null,null,null,null,"Datum:"]
["Kontakt:"]
[]
["Příprava teplé vody",null,null,null,null,"Vytápění",null,null,null,null,"Bazén"]
[]
[]
[null,"Měsíc","Qp,TV [kWh/měs]",null,null,null,"Měsíc","Qp,VYT [kWh/měs]",null,null,null,"Měsíc","Qp,BAZ [kWh/měs]",null,null,null,"Měsíční údaje jsou známé",null,null,null,null,"Měsíční údaje jsou známé",null,null,null,null,"Měsíční údaje jsou známé"]
[null,null,null,null,null,null,null,null,null,null,null,null,null,null,null,null,"Vypočítat ze zadaných údajů",null,null,null,null,"Vypočítat ze zadaných údajů",null,null,null,null,"Vypočítat ze zadaných údajů",null,null,null,null,null,null,null,null,null,null,null,"tep","QTV","QVYT","QBAZ","QTV+QVYT"]
[null,"Led",7282,null,null,null,"Led",null,null,null,null,"Led",null,null,null,null,1,null,null,null,null,1,null,null,null,null,2,null,null,null,null,null,null,null,null,null,"Led",31,-1.3,{"$f":"AL12*$D$26*$D$27*4187*($D$29-$D$28)*(1+$D$31/100)/3600000","v":4985.5027700000001},{"$f":"AL12*24*$I$26*($I$27-AM12)*$I$31*(1+$I$30/100)/($I$27-$I$28)","v":3899.8968750000004},{"$f":"+CHOOSE($AG$31,BAZ!O30,BAZ!O30,BAZ!P30,BAZ!P30)","v":924.21042584509587},{"$f":"AO12+AN12","v":8885.3996450000013}]
[null,"Úno",6577,null,null,null,"Úno",null,null,null,null,"Úno",null,null,null,null,null,null,null,null,null,null,null,null,null,null,null,null,null,null,null,null,null,null,null,null,"Úno",28,-0.1,4503.0347599999996,{"$f":"AL13*24*$I$26*($I$27-AM13)*$I$31*(1+$I$30/100)/($I$27-$I$28)","v":3324.0375000000004},{"$f":"+CHOOSE($AG$31,BAZ!O31,BAZ!O31,BAZ!P31,BAZ!P31)","v":840.03822334395761},{"$f":"AO13+AN13","v":7827.0722599999999}]
[null,"Bře",7282,null,null,null,"Bře",null,null,null,null,"Bře",null,null,null,null,null,null,null,null,null,null,null,null,null,null,null,null,null,null,null,null,null,null,null,null,"Bře",31,3.7,4985.5027700000001,2984.4281249999999,{"$f":"+CHOOSE($AG$31,BAZ!O32,BAZ!O32,BAZ!P32,BAZ!P32)","v":924.21042584509587},7969.9308949999995]
[null,"Dub",7047,null,null,null,"Dub",null,null,null,null,"Dub",null,null,null,null,null,null,null,null,null,null,null,null,null,null,null,null,null,null,null,null,null,null,null,null,"Dub",30,8.1,4824.6800999999996,2108.53125,{"$f":"+CHOOSE($AG$31,BAZ!O33,BAZ!O33,BAZ!P33,BAZ!P33)","v":896.15302501138308},6933.2113499999996]
[null,"Kvě",7282,null,null,null,"Kvě",null,null,null,null,"Kvě",null,null,null,null,null,null,null,null,null,null,null,null,null,null,null,null,null,null,null,null,null,null,null,null,"Kvě",31,13.3,4985.5027700000001,1226.7281249999999,{"$f":"+CHOOSE($AG$31,BAZ!O34,BAZ!O34,BAZ!P34,BAZ!P34)","v":924.21042584509587},6212.2308949999997]
[null,"Čer",7047,null,null,null,"Čer",null,null,null,null,"Čer",null,null,null,null,null,null,null,null,null,null,null,null,null,null,null,null,null,null,null,null,null,null,null,null,"Čer",30,16.100000000000001,4824.6800999999996,0,{"$f":"+CHOOSE($AG$31,BAZ!O35,BAZ!O35,BAZ!P35,BAZ!P35)","v":896.15302501138308},4824.6800999999996]
[null,"Čvc",5097,null,null,null,"Čvc",null,null,null,null,"Čvc",null,null,null,null,null,null,null,null,null,null,null,null,null,null,null,null,null,null,null,null,null,null,null,null,"Čvc",31,18,{"$f":"AL18*$D$26*$D$27*4187*($D$29-$D$28)*(1+$D$31/100)*(1-$D$30/100)/3600000","v":3489.8519389999997},0,{"$f":"+CHOOSE($AG$31,BAZ!O36,BAZ!O36,BAZ!P36,BAZ!P36)","v":924.21042584509587},3489.8519389999997]
[null,"Srp",5097,null,null,null,"Srp",null,null,null,null,"Srp",null,null,null,null,null,null,null,null,null,null,null,null,null,null,null,null,null,null,null,null,null,null,null,null,"Srp",31,17.899999999999999,{"$f":"AL19*$D$26*$D$27*4187*($D$29-$D$28)*(1+$D$31/100)*(1-$D$30/100)/3600000","v":3489.8519389999997},0,{"$f":"+CHOOSE($AG$31,BAZ!O37,BAZ!O37,BAZ!P37,BAZ!P37)","v":924.21042584509587},3489.8519389999997]
[null,"Zář",7047,null,null,null,"Zář",null,null,null,null,"Zář",null,null,null,null,null,null,null,null,null,null,null,null,null,null,null,null,null,null,null,null,null,null,null,null,"Zář",30,13.5,{"$f":"AL20*$D$26*$D$27*4187*($D$29-$D$28)*(1+$D$31/100)/3600000","v":4824.6800999999996},1151.71875,{"$f":"+CHOOSE($AG$31,BAZ!O38,BAZ!O38,BAZ!P38,BAZ!P38)","v":896.15302501138308},5976.3988499999996]
{"$rows_left_out":39}
{"sheet":"H","index":1,"n_rows":44,"n_cols":14,"rows_kept":44,"cut":false,"hidden":true,"merged":[[0,2,0,13],[2,1,2,13],[10,1,10,13],[17,1,17,13],[24,1,24,13]]}
[null,"Úhel sklonu plochy","Teoreticky možná sluneční energie celkového záření HT,měs [kWh/(m2.měs)] dopadající za den pro charakteristickou oblast město"]
[null,"b","Led","Úno","Bře","Dub","Kvě","Čvn","Čvc","Srp","Zář","Říj","Lis","Pro"]
[null,"Azimutový úhel osluněné plochy g = ± 0° (orientace na jih)"]
[0,0,20.8,37,72.2,113.8,148.80000000000001,146.19999999999999,144.30000000000001,136.19999999999999,87.1,56.5,25.2,14.9]
[null,15,27.5,46.4,89,124.6,155.5,149.80000000000001,148.80000000000001,147.30000000000001,97.9,69.900000000000006,33.799999999999997,20.8]
[null,30,32,53.1,90.8,128.9,154.80000000000001,146.19999999999999,145.80000000000001,151.80000000000001,104.4,79.599999999999994,41,25.3]
[null,45,35.700000000000003,57.1,93,127.4,147.30000000000001,136.1,136.9,148.1,105.1,85.6,46.1,29]
[null,60,37.200000000000003,57.8,91.5,118.8,132.4,120.2,121.3,136.9,100.8,86.3,48.2,30.5]
[null,75,36.5,55.8,84.8,105.1,111.6,99.4,101.2,119,91.4,82.6,48.2,30.5]
[null,90,34.200000000000003,51.1,74.400000000000006,85.7,87,75.599999999999994,78.099999999999994,96,77.8,74.400000000000006,45.4,29]
[null,"Azimutový úhel osluněné plochy g = ± 15°"]
[15,15,26.8,45.7,82.6,123.8,155.5,149.80000000000001,148.80000000000001,147.30000000000001,97.2,69.2,33.799999999999997,20.8]
[null,30,32,52.4,90,128.19999999999999,154.80000000000001,146.9,145.80000000000001,151,103,78.900000000000006,40.299999999999997,25.3]
[null,45,35,55.8,92.3,126,146.6,136.80000000000001,136.9,147.30000000000001,103.7,84.1,44.6,28.3]
[null,60,36.5,56.4,90,118.1,132.4,121.7,122,136.19999999999999,98.6,84.1,46.8,30.5]
[null,75,35.700000000000003,54.4,83.3,104.4,112.3,101.5,101.9,118.3,89.3,80.400000000000006,46.8,30.5]
[null,90,33.5,49.7,72.900000000000006,86.4,88.5,77.8,79.599999999999994,96.7,75.599999999999994,72.2,43.2,29]
[null,"Azimutový úhel osluněné plochy g = ± 30°"]
[30,15,26,45,81.8,123.1,154.80000000000001,149.80000000000001,148.1,145.80000000000001,95.8,67.7,32.4,20.100000000000001]
[null,30,30.5,50.4,87.8,126.7,153.30000000000001,146.9,145.1,148.80000000000001,100.1,75.900000000000006,38.200000000000003,23.8]
{"$rows_left_out":25}
{"sheet":"GRAF","index":2,"n_rows":13,"n_cols":4,"rows_kept":13,"cut":false,"hidden":true,"merged":[]}
[null,"Měsíc","Potřeba","Zisk"]
[null,1,{"$f":"Bilance!F45","v":7.282},{"$f":"Bilance!G45","v":0.7690760977407598}]
[null,2,{"$f":"Bilance!F46","v":6.577},{"$f":"Bilance!G46","v":1.4079641829812273}]
[null,3,{"$f":"Bilance!F47","v":7.282},{"$f":"Bilance!G47","v":2.5638973575790178}]
[null,4,{"$f":"Bilance!F48","v":7.0469999999999997},{"$f":"Bilance!G48","v":3.7349872226700751}]
[null,5,{"$f":"Bilance!F49","v":7.282},{"$f":"Bilance!G49","v":4.6383450476505725}]
[null,6,{"$f":"Bilance!F50","v":7.0469999999999997},{"$f":"Bilance!G50","v":4.4276024594502132}]
[null,7,{"$f":"Bilance!F51","v":5.0970000000000004},{"$f":"Bilance!G51","v":4.554176359089074}]
[null,8,{"$f":"Bilance!F52","v":5.0970000000000004},{"$f":"Bilance!G52","v":4.9697679168817377}]
[null,9,{"$f":"Bilance!F53","v":7.0469999999999997},{"$f":"Bilance!G53","v":3.3504833180771345}]
[null,10,{"$f":"Bilance!F54","v":7.282},{"$f":"Bilance!G54","v":2.4768263997548687}]
[null,11,{"$f":"Bilance!F55","v":7.0469999999999997},{"$f":"Bilance!G55","v":1.1290414483114188}]
[null,12,{"$f":"Bilance!F56","v":7.282},{"$f":"Bilance!G56","v":0.61427403009956671}]

{"sheet":"G","index":3,"n_rows":45,"n_cols":14,"rows_kept":45,"cut":false,"hidden":true,"merged":[[25,1,25,13],[0,2,0,13],[1,2,1,13],[3,1,3,13],[11,1,11,13],[18,1,18,13]]}
[null,"Úhel sklonu plochy","Střední hodnota slunečního ozáření GT,m [W/m2] "]
[null,"b","pro charakteristickou oblast město"]
[null,null,"I","II","III","IV","V","VI","VII","VIII","IX","X","XI","XII"]
[0,"Azimutový úhel osluněné plochy g = ± 0° (orientace na jih)"]
[null,0,175,253,365,446,498,514,501,462,388,285,195,150]
[null,15,273,353,448,501,535,545,534,508,457,375,290,245]
[null,30,356,434,506,529,543,546,538,526,501,444,369,325]
[null,45,418,489,535,527,521,517,512,515,516,488,427,387]
[null,60,454,514,533,496,470,460,459,476,503,502,458,424]
[null,75,463,509,500,437,394,379,381,411,461,488,462,436]
[null,90,443,473,438,355,299,279,285,325,393,444,438,421]
[15,"Azimutový úhel osluněné plochy g = ± 15°"]
[null,15,270,350,445,499,534,543,533,506,454,372,287,241]
[null,30,349,427,500,525,540,543,535,522,496,438,363,319]
[null,45,408,479,526,521,516,512,508,509,509,479,417,377]
[null,60,442,502,522,488,464,455,453,469,494,491,447,413]
[null,75,449,495,488,428,388,373,375,403,451,475,449,423]
[null,90,429,459,426,346,292,273,279,317,383,431,425,408]
[30,"Azimutový úhel osluněné plochy g = ± 30°"]
[null,15,259,339,435,492,529,539,528,500,446,362,277,232]
{"$rows_left_out":26}
{"sheet":"BAZ","index":4,"n_rows":41,"n_cols":24,"rows_kept":41,"cut":false,"hidden":true,"merged":[]}
["Výparné teplo vody","Iw",2500000,"J/kg",null,null,null,null,"tv,p","tw,p","p\"d,w,p","p\"d,v,p","pd,v,p","QBV",null,null,null,"te,s","tw,p","p\"d,w,p","p\"d,v,p","pd,v,p","Hmes","Qbv,p"]
["Relativní vlhkost vzduchu v době provozu","fv,p",0.65,null,null,null,"Vnitřní provoz","Leden",{"$f":"Bilance!$N$29","v":28},{"$f":"Bilance!$N$28","v":28},{"$f":"+EXP(23.58-(4044.2/(235.6+J2)))","v":3781.2687143507601},{"$f":"+EXP(23.58-(4044.2/(235.6+I2)))","v":3781.2687143507601},{"$f":"+L2*$C$2","v":2457.824664327994},{"$f":"I30/1000*Bilance!$N$27*($C$5*Bilance!$N$26*(K2-M2)*$C$1/3600+$C$7*Bilance!$N$26*(J2-I2))","v":683.77942584509583},null,"Vnější","Leden",1.8,{"$f":"Bilance!$N$28","v":28},{"$f":"+EXP(23.58-(4044.2/(235.6+S2)))","v":3781.2687143507601},{"$f":"+EXP(23.58-(4044.2/(235.6+R2)))","v":695.49003310028525},{"$f":"+U2*$C$4","v":347.74501655014262},20.8,{"$f":"+I30/1000*Bilance!$N$27*($C$5*Bilance!$N$26*(T2-V2)*$C$1/3600+$C$8*Bilance!$N$26*(S2-R2))-0.7*W2*Bilance!$N$26","v":3419.4372438636524}]
["Relativní vlhkost vzduchu mimo provoz","fv,n",0.65,null,null,null,"1)","Únor",{"$f":"Bilance!$N$29","v":28},{"$f":"Bilance!$N$28","v":28},{"$f":"+EXP(23.58-(4044.2/(235.6+J3)))","v":3781.2687143507601},{"$f":"+EXP(23.58-(4044.2/(235.6+I3)))","v":3781.2687143507601},{"$f":"+L3*$C$2","v":2457.824664327994},{"$f":"I31/1000*Bilance!$N$27*($C$5*Bilance!$N$26*(K3-M3)*$C$1/3600+$C$7*Bilance!$N$26*(J3-I3))","v":617.60722334395757},null,"3)","Únor",2.7,{"$f":"Bilance!$N$28","v":28},{"$f":"+EXP(23.58-(4044.2/(235.6+S3)))","v":3781.2687143507601},{"$f":"+EXP(23.58-(4044.2/(235.6+R3)))","v":741.70760236952435},{"$f":"+U3*$C$4","v":370.85380118476218},37,{"$f":"+I31/1000*Bilance!$N$27*($C$5*Bilance!$N$26*(T3-V3)*$C$1/3600+$C$8*Bilance!$N$26*(S3-R3))-0.7*W3*Bilance!$N$26","v":2861.676959477466}]
["Relativní venkovní vlhkost (venkovní bazén)","fv,e",0.5,null,null,null,null,"Březen",{"$f":"Bilance!$N$29","v":28},{"$f":"Bilance!$N$28","v":28},3781.2687143507601,3781.2687143507601,2457.824664327994,{"$f":"I32/1000*Bilance!$N$27*($C$5*Bilance!$N$26*(K4-M4)*$C$1/3600+$C$7*Bilance!$N$26*(J4-I4))","v":683.77942584509583},null,null,"Březen",6.3,{"$f":"Bilance!$N$28","v":28},3781.2687143507601,954.81851883541685,477.40925941770843,72.2,{"$f":"+I32/1000*Bilance!$N$27*($C$5*Bilance!$N$26*(T4-V4)*$C$1/3600+$C$8*Bilance!$N$26*(S4-R4))-0.7*W4*Bilance!$N$26","v":2588.8190517154098}]
["Součinitel přenosu hmoty pro vnitřní bazény v době provozu","bp",{"$f":"+CHOOSE(Bilance!AG31,0.00016,0.00016,0.00029,0.00029)","v":1.6000000000000001E-4},"kg/h.m2Pa",null,null,null,"Duben",{"$f":"Bilance!$N$29","v":28},{"$f":"Bilance!$N$28","v":28},3781.2687143507601,3781.2687143507601,2457.824664327994,{"$f":"I33/1000*Bilance!$N$27*($C$5*Bilance!$N$26*(K5-M5)*$C$1/3600+$C$7*Bilance!$N$26*(J5-I5))","v":661.72202501138304},null,null,"Duben",10.7,{"$f":"Bilance!$N$28","v":28},3781.2687143507601,1287.1513041250389,643.57565206251945,113.8,{"$f":"+I33/1000*Bilance!$N$27*($C$5*Bilance!$N$26*(T5-V5)*$C$1/3600+$C$8*Bilance!$N$26*(S5-R5))-0.7*W5*Bilance!$N$26","v":1740.84653114412}]
["Součinitel přenosu hmoty pro vnitřní bazény mimo provoz","bn",{"$f":"+CHOOSE(Bilance!AG31,0,C5,0,C5)","v":0},"kg/h.m2Pa",null,null,null,"Květen",{"$f":"Bilance!$N$29","v":28},{"$f":"Bilance!$N$28","v":28},3781.2687143507601,3781.2687143507601,2457.824664327994,{"$f":"I34/1000*Bilance!$N$27*($C$5*Bilance!$N$26*(K6-M6)*$C$1/3600+$C$7*Bilance!$N$26*(J6-I6))","v":683.77942584509583},null,null,"Květen",16,{"$f":"Bilance!$N$28","v":28},3781.2687143507601,1819.0563051739721,909.52815258698604,148.80000000000001,{"$f":"+I34/1000*Bilance!$N$27*($C$5*Bilance!$N$26*(T6-V6)*$C$1/3600+$C$8*Bilance!$N$26*(S6-R6))-0.7*W6*Bilance!$N$26","v":1018.7326235779501}]
["součinitel přestupu tepla mezi okolním prostředím a hladinou bazénu sáláním a prouděním","hi",10,"W/m2K",null,null,null,"Červen",{"$f":"Bilance!$N$29","v":28},{"$f":"Bilance!$N$28","v":28},3781.2687143507601,3781.2687143507601,2457.824664327994,{"$f":"I35/1000*Bilance!$N$27*($C$5*Bilance!$N$26*(K7-M7)*$C$1/3600+$C$7*Bilance!$N$26*(J7-I7))","v":661.72202501138304},null,null,"Červen",18.600000000000001,{"$f":"Bilance!$N$28","v":28},3781.2687143507601,2144.1102363081591,1072.0551181540795,146.19999999999999,{"$f":"+I35/1000*Bilance!$N$27*($C$5*Bilance!$N$26*(T7-V7)*$C$1/3600+$C$8*Bilance!$N$26*(S7-R7))-0.7*W7*Bilance!$N$26","v":709.85679809834028}]
["součinitel přestupu tepla mezi okolním prostředím a hladinou bazénu sáláním a prouděním","he",15,"W/m2K",null,null,null,"Červenec",{"$f":"Bilance!$N$29","v":28},{"$f":"Bilance!$N$28","v":28},3781.2687143507601,3781.2687143507601,2457.824664327994,{"$f":"I36/1000*Bilance!$N$27*($C$5*Bilance!$N$26*(K8-M8)*$C$1/3600+$C$7*Bilance!$N$26*(J8-I8))","v":683.77942584509583},null,null,"Červenec",20.5,{"$f":"Bilance!$N$28","v":28},3781.2687143507601,2412.725498878845,1206.3627494394225,144.30000000000001,{"$f":"+I36/1000*Bilance!$N$27*($C$5*Bilance!$N$26*(T8-V8)*$C$1/3600+$C$8*Bilance!$N$26*(S8-R8))-0.7*W8*Bilance!$N$26","v":590.86808187085785}]
["Hodinová kapacita bazénu - vnitřní","kb,i",{"$f":"1.5*Bilance!N26/5","v":3.75},"os/hod",null,null,null,"Srpen",{"$f":"Bilance!$N$29","v":28},{"$f":"Bilance!$N$28","v":28},3781.2687143507601,3781.2687143507601,2457.824664327994,{"$f":"I37/1000*Bilance!$N$27*($C$5*Bilance!$N$26*(K9-M9)*$C$1/3600+$C$7*Bilance!$N$26*(J9-I9))","v":683.77942584509583},null,null,"Srpen",21.1,{"$f":"Bilance!$N$28","v":28},3781.2687143507601,2503.4440238934553,1251.7220119467277,136.19999999999999,{"$f":"+I37/1000*Bilance!$N$27*($C$5*Bilance!$N$26*(T9-V9)*$C$1/3600+$C$8*Bilance!$N$26*(S9-R9))-0.7*W9*Bilance!$N$26","v":596.45746290875036}]
["Hodinová kapacita bazénu - venkovní","kb,e",{"$f":"3*Bilance!N26/5","v":7.5},"os/hod",null,null,null,"Září",{"$f":"Bilance!$N$29","v":28},{"$f":"Bilance!$N$28","v":28},3781.2687143507601,3781.2687143507601,2457.824664327994,{"$f":"I38/1000*Bilance!$N$27*($C$5*Bilance!$N$26*(K10-M10)*$C$1/3600+$C$7*Bilance!$N$26*(J10-I10))","v":661.72202501138304},null,null,"Září",17.100000000000001,{"$f":"Bilance!$N$28","v":28},3781.2687143507601,1950.893474019806,975.44673700990302,87.1,{"$f":"+I38/1000*Bilance!$N$27*($C$5*Bilance!$N$26*(T10-V10)*$C$1/3600+$C$8*Bilance!$N$26*(S10-R10))-0.7*W10*Bilance!$N$26","v":1376.5359886704282}]
["Měrná potřeba přiváděné čísté vody na návštěvníka","VSV,os",0.03,"m2/os",null,null,null,"Říjen",{"$f":"Bilance!$N$29","v":28},{"$f":"Bilance!$N$28","v":28},3781.2687143507601,3781.2687143507601,2457.824664327994,{"$f":"I39/1000*Bilance!$N$27*($C$5*Bilance!$N$26*(K11-M11)*$C$1/3600+$C$7*Bilance!$N$26*(J11-I11))","v":683.77942584509583},null,null,"Říjen",11.7,{"$f":"Bilance!$N$28","v":28},3781.2687143507601,1375.5144663304147,687.75723316520737,56.5,{"$f":"+I39/1000*Bilance!$N$27*($C$5*Bilance!$N$26*(T11-V11)*$C$1/3600+$C$8*Bilance!$N$26*(S11-R11))-0.7*W11*Bilance!$N$26","v":2240.8642652792023}]
[null,null,null,null,null,null,null,"Listopad",{"$f":"Bilance!$N$29","v":28},{"$f":"Bilance!$N$28","v":28},3781.2687143507601,3781.2687143507601,2457.824664327994,{"$f":"I40/1000*Bilance!$N$27*($C$5*Bilance!$N$26*(K12-M12)*$C$1/3600+$C$7*Bilance!$N$26*(J12-I12))","v":661.72202501138304},null,null,"Listopad",6.4,{"$f":"Bilance!$N$28","v":28},3781.2687143507601,961.43768435579625,480.71884217789813,25.2,{"$f":"+I40/1000*Bilance!$N$27*($C$5*Bilance!$N$26*(T12-V12)*$C$1/3600+$C$8*Bilance!$N$26*(S12-R12))-0.7*W12*Bilance!$N$26","v":2887.7749360864314}]
[null,null,null,null,null,null,null,"Prosinec",{"$f":"Bilance!$N$29","v":28},{"$f":"Bilance!$N$28","v":28},3781.2687143507601,3781.2687143507601,2457.824664327994,{"$f":"I41/1000*Bilance!$N$27*($C$5*Bilance!$N$26*(K13-M13)*$C$1/3600+$C$7*Bilance!$N$26*(J13-I13))","v":683.77942584509583},null,null,"Prosinec",3.6,{"$f":"Bilance!$N$28","v":28},3781.2687143507601,790.61360925721021,395.30680462860511,14.9,{"$f":"+I41/1000*Bilance!$N$27*($C$5*Bilance!$N$26*(T13-V13)*$C$1/3600+$C$8*Bilance!$N$26*(S13-R13))-0.7*W13*Bilance!$N$26","v":3320.938653356447}]
[null,null,null,null,null,null,null,null,"tv,n","tw,n","p\"d,w,n","p\"d,v,n","pd,v,n","QBV",null,null,null,"te,n","tw,n","p\"d,w,n","p\"d,v,n","pd,v,n",null,"Qbv,n"]
[null,null,null,null,null,null,"Vnitřní mimo","Leden",{"$f":"Bilance!$N$31","v":20},{"$f":"Bilance!$N$30","v":24},{"$f":"+EXP(23.58-(4044.2/(235.6+J15)))","v":2985.1866867186986},{"$f":"+EXP(23.58-(4044.2/(235.6+I15)))","v":2339.333370248095},{"$f":"+L15*$C$3","v":1520.5666906612619},{"$f":"I30/1000*(24-Bilance!$N$27)*($C$6*Bilance!$N$26*(K15-M15)*BAZ!$C$1/3600+$C$7*Bilance!$N$26*(J15-I15))","v":186},null,"Vnější","Leden",-2.9,{"$f":"Bilance!$N$30","v":24},{"$f":"+EXP(23.58-(4044.2/(235.6+S15)))","v":2985.1866867186986},493.01592201787452,{"$f":"+U15*$C$4","v":246.50796100893726},null,{"$f":"I30/1000*(24-Bilance!$N$27)*($C$6*Bilance!$N$26*(T15-V15)*$C$1/3600+$C$8*Bilance!$N$26*(S15-R15))","v":1876.2750000000001}]
[null,null,null,null,null,null,"2)","Únor",{"$f":"Bilance!$N$31","v":20},{"$f":"Bilance!$N$30","v":24},{"$f":"+EXP(23.58-(4044.2/(235.6+J16)))","v":2985.1866867186986},{"$f":"+EXP(23.58-(4044.2/(235.6+I16)))","v":2339.333370248095},{"$f":"+L16*$C$3","v":1520.5666906612619},{"$f":"I31/1000*(24-Bilance!$N$27)*($C$6*Bilance!$N$26*(K16-M16)*BAZ!$C$1/3600+$C$7*Bilance!$N$26*(J16-I16))","v":168},null,"4)","Únor",-2.1,{"$f":"Bilance!$N$30","v":24},{"$f":"+EXP(23.58-(4044.2/(235.6+S16)))","v":2985.1866867186986},523.26375735411636,{"$f":"+U16*$C$4","v":261.63187867705818},null,{"$f":"I31/1000*(24-Bilance!$N$27)*($C$6*Bilance!$N$26*(T16-V16)*$C$1/3600+$C$8*Bilance!$N$26*(S16-R16))","v":1644.3000000000002}]
[null,null,null,null,null,null,null,"Březen",{"$f":"Bilance!$N$31","v":20},{"$f":"Bilance!$N$30","v":24},2985.1866867186986,2339.333370248095,1520.5666906612619,{"$f":"I32/1000*(24-Bilance!$N$27)*($C$6*Bilance!$N$26*(K17-M17)*BAZ!$C$1/3600+$C$7*Bilance!$N$26*(J17-I17))","v":186},null,null,"Březen",1.1000000000000001,{"$f":"Bilance!$N$30","v":24},2985.1866867186986,661.31973128229549,330.65986564114775,null,{"$f":"I32/1000*(24-Bilance!$N$27)*($C$6*Bilance!$N$26*(T17-V17)*$C$1/3600+$C$8*Bilance!$N$26*(S17-R17))","v":1597.2750000000001}]
[null,null,null,null,null,null,null,"Duben",{"$f":"Bilance!$N$31","v":20},{"$f":"Bilance!$N$30","v":24},2985.1866867186986,2339.333370248095,1520.5666906612619,{"$f":"I33/1000*(24-Bilance!$N$27)*($C$6*Bilance!$N$26*(K18-M18)*BAZ!$C$1/3600+$C$7*Bilance!$N$26*(J18-I18))","v":180},null,null,"Duben",4.5,{"$f":"Bilance!$N$30","v":24},2985.1866867186986,842.34100216353841,421.1705010817692,null,{"$f":"I33/1000*(24-Bilance!$N$27)*($C$6*Bilance!$N$26*(T18-V18)*$C$1/3600+$C$8*Bilance!$N$26*(S18-R18))","v":1316.25}]
[null,null,null,null,null,null,null,"Květen",{"$f":"Bilance!$N$31","v":20},{"$f":"Bilance!$N$30","v":24},2985.1866867186986,2339.333370248095,1520.5666906612619,{"$f":"I34/1000*(24-Bilance!$N$27)*($C$6*Bilance!$N$26*(K19-M19)*BAZ!$C$1/3600+$C$7*Bilance!$N$26*(J19-I19))","v":186},null,null,"Květen",8.8000000000000007,{"$f":"Bilance!$N$30","v":24},2985.1866867186986,1132.9009391720065,566.45046958600324,null,{"$f":"I34/1000*(24-Bilance!$N$27)*($C$6*Bilance!$N$26*(T19-V19)*$C$1/3600+$C$8*Bilance!$N$26*(S19-R19))","v":1060.2}]
[null,null,null,null,null,null,null,"Červen",{"$f":"Bilance!$N$31","v":20},{"$f":"Bilance!$N$30","v":24},2985.1866867186986,2339.333370248095,1520.5666906612619,{"$f":"I35/1000*(24-Bilance!$N$27)*($C$6*Bilance!$N$26*(K20-M20)*BAZ!$C$1/3600+$C$7*Bilance!$N$26*(J20-I20))","v":180},null,null,"Červen",11.1,{"$f":"Bilance!$N$30","v":24},2985.1866867186986,1321.8795318191733,660.93976590958664,null,{"$f":"I35/1000*(24-Bilance!$N$27)*($C$6*Bilance!$N$26*(T20-V20)*$C$1/3600+$C$8*Bilance!$N$26*(S20-R20))","v":870.75}]
{"$rows_left_out":21}